<?xml version="1.0" encoding="UTF-8" standalone="no"?>
<!-- Generator: Adobe Illustrator 19.0.0, SVG Export Plug-In . SVG Version: 6.00 Build 0)  -->

<svg
   xmlns:dc="http://purl.org/dc/elements/1.1/"
   xmlns:cc="http://creativecommons.org/ns#"
   xmlns:rdf="http://www.w3.org/1999/02/22-rdf-syntax-ns#"
   xmlns:svg="http://www.w3.org/2000/svg"
   xmlns="http://www.w3.org/2000/svg"
   xmlns:sodipodi="http://sodipodi.sourceforge.net/DTD/sodipodi-0.dtd"
   xmlns:inkscape="http://www.inkscape.org/namespaces/inkscape"
   version="1.1"
   id="Layer_1"
   x="0px"
   y="0px"
   viewBox="0 0 100 100.00001"
   xml:space="preserve"
   inkscape:version="0.48.4 r9939"
   width="100%"
   height="100%"
   sodipodi:docname="ems.svg"><metadata
     id="metadata49"><rdf:RDF><cc:Work
         rdf:about=""><dc:format>image/svg+xml</dc:format><dc:type
           rdf:resource="http://purl.org/dc/dcmitype/StillImage" /></cc:Work></rdf:RDF></metadata><defs
     id="defs47" /><sodipodi:namedview
     pagecolor="#ffffff"
     bordercolor="#666666"
     borderopacity="1"
     objecttolerance="10"
     gridtolerance="10"
     guidetolerance="10"
     inkscape:pageopacity="0"
     inkscape:pageshadow="2"
     inkscape:window-width="1920"
     inkscape:window-height="1176"
     id="namedview45"
     showgrid="false"
     fit-margin-top="0"
     fit-margin-left="0"
     fit-margin-right="0"
     fit-margin-bottom="0"
     inkscape:zoom="2.057102"
     inkscape:cx="28.177645"
     inkscape:cy="115.81869"
     inkscape:window-x="0"
     inkscape:window-y="24"
     inkscape:window-maximized="1"
     inkscape:current-layer="Layer_1" /><path
     sodipodi:type="arc"
     style="fill:#ffffff;fill-opacity:1;fill-rule:nonzero;stroke:none"
     id="path3018"
     sodipodi:cx="-81.981819"
     sodipodi:cy="-12.574606"
     sodipodi:rx="78.200684"
     sodipodi:ry="42.451801"
     d="m -3.7811356,-12.574606 a 78.200684,42.451801 0 1 1 -156.4013644,0 78.200684,42.451801 0 1 1 156.4013644,0 z"
     transform="matrix(0.63938062,0,0,1.1778064,102.41759,64.810458)" /><path
     style="fill:#d40000;fill-opacity:1;fill-rule:nonzero;stroke:none"
     d="M 50 0 C 22.385762 -4.7369516e-15 1.5533243e-16 22.385761 0 50 C -9.4739031e-15 77.614239 22.385762 100 50 100 C 77.614238 100 100 77.614239 100 50 C 100 22.385761 77.614238 -1.4055522e-14 50 0 z M 50.03125 10 C 62.185006 10 72.0625 19.907885 72.0625 32.0625 C 72.0625 33.86644 71.849 35.601955 71.4375 37.28125 C 73.76478 39.54706 75.700811 42.157244 77.21875 45.0625 L 67.78125 45.0625 C 63.765286 50.51786 57.309331 54.0625 50.03125 54.0625 C 42.753167 54.0625 36.265964 50.51786 32.25 45.0625 L 22.78125 45.0625 C 24.304312 42.146999 26.256227 39.521786 28.59375 37.25 C 28.186519 35.577535 27.96875 33.858756 27.96875 32.0625 C 27.96875 19.908739 37.877492 10 50.03125 10 z M 50.03125 20.28125 C 43.54031 20.28125 38.24912 25.572411 38.25 32.0625 C 38.25 38.552585 43.54031 43.8125 50.03125 43.8125 C 56.520481 43.8125 61.78125 38.552585 61.78125 32.0625 C 61.78125 25.572411 56.521335 20.28125 50.03125 20.28125 z M 19.3125 59 L 80.6875 59 C 80.68838 59.098179 80.71875 59.18307 80.71875 59.28125 C 80.71875 76.245798 66.964547 90 50 90 C 33.035453 90 19.28213 76.245798 19.28125 59.28125 C 19.28125 59.183071 19.31162 59.09818 19.3125 59 z "
     transform="translate(-1.1853026e-6,0)"
     id="path3021" /></svg>