<?xml version="1.0" encoding="UTF-8" standalone="no"?>
<!DOCTYPE svg PUBLIC "-//W3C//DTD SVG 1.1//EN"
 "http://www.w3.org/Graphics/SVG/1.1/DTD/svg11.dtd">
<!-- Generated by graphviz version 2.28.0 (20170704.0136)
 -->
<!-- Title: _anonymous_0 Pages: 1 -->
<svg width="546pt" height="798pt"
 viewBox="0.00 0.00 546.41 797.70" xmlns="http://www.w3.org/2000/svg" xmlns:xlink="http://www.w3.org/1999/xlink">
<g id="graph1" class="graph" transform="scale(1 1) rotate(0) translate(4 793.702)">
<title>_anonymous_0</title>
<polygon fill="white" stroke="white" points="-4,5 -4,-793.702 543.408,-793.702 543.408,5 -4,5"/>
<!-- wpt_08 -->
<g id="node1" class="node"><title>wpt_08</title>
<ellipse fill="none" stroke="black" cx="106.731" cy="-494.111" rx="39.9593" ry="40.1111"/>
<text text-anchor="middle" x="106.731" y="-490.411" font-family="Times,serif" font-size="14.00">wpt_08</text>
</g>
<!-- wpt_09 -->
<g id="node2" class="node"><title>wpt_09</title>
<ellipse fill="none" stroke="black" cx="244.432" cy="-470.807" rx="39.9593" ry="40.1111"/>
<text text-anchor="middle" x="244.432" y="-467.107" font-family="Times,serif" font-size="14.00">wpt_09</text>
</g>
<!-- wpt_08&#45;&#45;wpt_09 -->
<g id="edge18" class="edge"><title>wpt_08&#45;&#45;wpt_09</title>
<path fill="none" stroke="black" d="M146.559,-487.37C164.67,-484.305 186.059,-480.686 204.215,-477.613"/>
</g>
<!-- wpt_13 -->
<g id="node15" class="node"><title>wpt_13</title>
<ellipse fill="none" stroke="black" cx="202.318" cy="-591.644" rx="39.9593" ry="40.1111"/>
<text text-anchor="middle" x="202.318" y="-587.944" font-family="Times,serif" font-size="14.00">wpt_13</text>
</g>
<!-- wpt_08&#45;&#45;wpt_13 -->
<g id="edge42" class="edge"><title>wpt_08&#45;&#45;wpt_13</title>
<path fill="none" stroke="black" d="M134.893,-522.846C147.228,-535.433 161.676,-550.175 174.026,-562.777"/>
</g>
<!-- wpt_12 -->
<g id="node16" class="node"><title>wpt_12</title>
<ellipse fill="none" stroke="black" cx="62.7846" cy="-614.618" rx="39.9593" ry="40.1111"/>
<text text-anchor="middle" x="62.7846" y="-610.918" font-family="Times,serif" font-size="14.00">wpt_12</text>
</g>
<!-- wpt_08&#45;&#45;wpt_12 -->
<g id="edge12" class="edge"><title>wpt_08&#45;&#45;wpt_12</title>
<path fill="none" stroke="black" d="M92.8258,-532.24C87.6457,-546.445 81.7709,-562.555 76.5989,-576.737"/>
</g>
<!-- wpt_14 -->
<g id="node14" class="node"><title>wpt_14</title>
<ellipse fill="none" stroke="black" cx="340.8" cy="-543.158" rx="39.9593" ry="40.1111"/>
<text text-anchor="middle" x="340.8" y="-539.458" font-family="Times,serif" font-size="14.00">wpt_14</text>
</g>
<!-- wpt_09&#45;&#45;wpt_14 -->
<g id="edge26" class="edge"><title>wpt_09&#45;&#45;wpt_14</title>
<path fill="none" stroke="black" d="M276.789,-495.1C286.959,-502.736 298.188,-511.166 308.364,-518.806"/>
</g>
<!-- wpt_09&#45;&#45;wpt_13 -->
<g id="edge56" class="edge"><title>wpt_09&#45;&#45;wpt_13</title>
<path fill="none" stroke="black" d="M231.106,-509.041C226.191,-523.146 220.622,-539.125 215.701,-553.245"/>
</g>
<!-- wpt_10 -->
<g id="node18" class="node"><title>wpt_10</title>
<ellipse fill="none" stroke="black" cx="355.766" cy="-397.217" rx="39.9593" ry="40.1111"/>
<text text-anchor="middle" x="355.766" y="-393.517" font-family="Times,serif" font-size="14.00">wpt_10</text>
</g>
<!-- wpt_09&#45;&#45;wpt_10 -->
<g id="edge22" class="edge"><title>wpt_09&#45;&#45;wpt_10</title>
<path fill="none" stroke="black" d="M278.138,-448.528C291.962,-439.39 307.938,-428.83 321.791,-419.674"/>
</g>
<!-- wpt_00 -->
<g id="node3" class="node"><title>wpt_00</title>
<ellipse fill="none" stroke="black" cx="137.475" cy="-245.295" rx="39.9593" ry="40.1111"/>
<text text-anchor="middle" x="137.475" y="-241.595" font-family="Times,serif" font-size="14.00">wpt_00</text>
</g>
<!-- wpt_01 -->
<g id="node4" class="node"><title>wpt_01</title>
<ellipse fill="none" stroke="black" cx="231.912" cy="-130.612" rx="39.9593" ry="40.1111"/>
<text text-anchor="middle" x="231.912" y="-126.912" font-family="Times,serif" font-size="14.00">wpt_01</text>
</g>
<!-- wpt_00&#45;&#45;wpt_01 -->
<g id="edge8" class="edge"><title>wpt_00&#45;&#45;wpt_01</title>
<path fill="none" stroke="black" d="M163.28,-213.957C176.605,-197.775 192.817,-178.088 206.138,-161.912"/>
</g>
<!-- wpt_04 -->
<g id="node7" class="node"><title>wpt_04</title>
<ellipse fill="none" stroke="black" cx="41.6026" cy="-359.387" rx="39.9593" ry="40.1111"/>
<text text-anchor="middle" x="41.6026" y="-355.687" font-family="Times,serif" font-size="14.00">wpt_04</text>
</g>
<!-- wpt_00&#45;&#45;wpt_04 -->
<g id="edge44" class="edge"><title>wpt_00&#45;&#45;wpt_04</title>
<path fill="none" stroke="black" d="M111.53,-276.17C97.8883,-292.404 81.2126,-312.249 67.5677,-328.488"/>
</g>
<!-- wpt_05 -->
<g id="node8" class="node"><title>wpt_05</title>
<ellipse fill="none" stroke="black" cx="230.58" cy="-344.877" rx="39.9593" ry="40.1111"/>
<text text-anchor="middle" x="230.58" y="-341.177" font-family="Times,serif" font-size="14.00">wpt_05</text>
</g>
<!-- wpt_00&#45;&#45;wpt_05 -->
<g id="edge4" class="edge"><title>wpt_00&#45;&#45;wpt_05</title>
<path fill="none" stroke="black" d="M165.157,-274.903C177.057,-287.631 190.937,-302.477 202.843,-315.211"/>
</g>
<!-- wpt_02 -->
<g id="node5" class="node"><title>wpt_02</title>
<ellipse fill="none" stroke="black" cx="380.478" cy="-146.501" rx="39.9593" ry="40.1111"/>
<text text-anchor="middle" x="380.478" y="-142.801" font-family="Times,serif" font-size="14.00">wpt_02</text>
</g>
<!-- wpt_01&#45;&#45;wpt_02 -->
<g id="edge34" class="edge"><title>wpt_01&#45;&#45;wpt_02</title>
<path fill="none" stroke="black" d="M272.116,-134.912C293.256,-137.173 319.097,-139.937 340.242,-142.198"/>
</g>
<!-- wpt_03 -->
<g id="node6" class="node"><title>wpt_03</title>
<ellipse fill="none" stroke="black" cx="466.851" cy="-40.3051" rx="39.9593" ry="40.1111"/>
<text text-anchor="middle" x="466.851" y="-36.6051" font-family="Times,serif" font-size="14.00">wpt_03</text>
</g>
<!-- wpt_02&#45;&#45;wpt_03 -->
<g id="edge54" class="edge"><title>wpt_02&#45;&#45;wpt_03</title>
<path fill="none" stroke="black" d="M405.925,-115.213C417.072,-101.509 430.127,-85.4576 441.287,-71.7365"/>
</g>
<!-- wpt_06 -->
<g id="node9" class="node"><title>wpt_06</title>
<ellipse fill="none" stroke="black" cx="438.624" cy="-283.705" rx="39.9593" ry="40.1111"/>
<text text-anchor="middle" x="438.624" y="-280.005" font-family="Times,serif" font-size="14.00">wpt_06</text>
</g>
<!-- wpt_02&#45;&#45;wpt_06 -->
<g id="edge46" class="edge"><title>wpt_02&#45;&#45;wpt_06</title>
<path fill="none" stroke="black" d="M396.213,-183.631C404.487,-203.154 414.601,-227.019 422.877,-246.546"/>
</g>
<!-- wpt_07 -->
<g id="node10" class="node"><title>wpt_07</title>
<ellipse fill="none" stroke="black" cx="498.255" cy="-167.56" rx="39.9593" ry="40.1111"/>
<text text-anchor="middle" x="498.255" y="-163.86" font-family="Times,serif" font-size="14.00">wpt_07</text>
</g>
<!-- wpt_02&#45;&#45;wpt_07 -->
<g id="edge48" class="edge"><title>wpt_02&#45;&#45;wpt_07</title>
<path fill="none" stroke="black" d="M420.024,-153.572C432.32,-155.771 445.882,-158.196 458.212,-160.4"/>
</g>
<!-- wpt_03&#45;&#45;wpt_07 -->
<g id="edge38" class="edge"><title>wpt_03&#45;&#45;wpt_07</title>
<path fill="none" stroke="black" d="M476.529,-79.5242C480.35,-95.0063 484.732,-112.761 488.554,-128.252"/>
</g>
<!-- wpt_04&#45;&#45;wpt_08 -->
<g id="edge2" class="edge"><title>wpt_04&#45;&#45;wpt_08</title>
<path fill="none" stroke="black" d="M59.2272,-395.845C68.4944,-415.016 79.8226,-438.449 89.0919,-457.623"/>
</g>
<!-- wpt_05&#45;&#45;wpt_09 -->
<g id="edge30" class="edge"><title>wpt_05&#45;&#45;wpt_09</title>
<path fill="none" stroke="black" d="M235.001,-385.068C236.6,-399.609 238.405,-416.021 240.005,-430.566"/>
</g>
<!-- wpt_05&#45;&#45;wpt_10 -->
<g id="edge28" class="edge"><title>wpt_05&#45;&#45;wpt_10</title>
<path fill="none" stroke="black" d="M267.801,-360.439C283.801,-367.129 302.464,-374.932 318.473,-381.625"/>
</g>
<!-- wpt_06&#45;&#45;wpt_07 -->
<g id="edge10" class="edge"><title>wpt_06&#45;&#45;wpt_07</title>
<path fill="none" stroke="black" d="M457.165,-247.593C464.345,-233.609 472.547,-217.632 479.726,-203.65"/>
</g>
<!-- wpt_11 -->
<g id="node17" class="node"><title>wpt_11</title>
<ellipse fill="none" stroke="black" cx="490.562" cy="-400.866" rx="39.9593" ry="40.1111"/>
<text text-anchor="middle" x="490.562" y="-397.166" font-family="Times,serif" font-size="14.00">wpt_11</text>
</g>
<!-- wpt_06&#45;&#45;wpt_11 -->
<g id="edge52" class="edge"><title>wpt_06&#45;&#45;wpt_11</title>
<path fill="none" stroke="black" d="M455.058,-320.776C461.12,-334.452 467.988,-349.944 474.057,-363.635"/>
</g>
<!-- wpt_06&#45;&#45;wpt_10 -->
<g id="edge16" class="edge"><title>wpt_06&#45;&#45;wpt_10</title>
<path fill="none" stroke="black" d="M414.881,-316.233C403.786,-331.432 390.609,-349.485 379.514,-364.685"/>
</g>
<!-- wpt_17 -->
<g id="node11" class="node"><title>wpt_17</title>
<ellipse fill="none" stroke="black" cx="178.984" cy="-731.88" rx="39.9593" ry="40.1111"/>
<text text-anchor="middle" x="178.984" y="-728.18" font-family="Times,serif" font-size="14.00">wpt_17</text>
</g>
<!-- wpt_16 -->
<g id="node12" class="node"><title>wpt_16</title>
<ellipse fill="none" stroke="black" cx="40.1525" cy="-749.396" rx="39.9593" ry="40.1111"/>
<text text-anchor="middle" x="40.1525" y="-745.696" font-family="Times,serif" font-size="14.00">wpt_16</text>
</g>
<!-- wpt_16&#45;&#45;wpt_17 -->
<g id="edge14" class="edge"><title>wpt_16&#45;&#45;wpt_17</title>
<path fill="none" stroke="black" d="M80.3083,-744.33C98.7272,-742.006 120.51,-739.258 138.918,-736.935"/>
</g>
<!-- wpt_15 -->
<g id="node13" class="node"><title>wpt_15</title>
<ellipse fill="none" stroke="black" cx="479.653" cy="-542.105" rx="39.9593" ry="40.1111"/>
<text text-anchor="middle" x="479.653" y="-538.405" font-family="Times,serif" font-size="14.00">wpt_15</text>
</g>
<!-- wpt_14&#45;&#45;wpt_15 -->
<g id="edge32" class="edge"><title>wpt_14&#45;&#45;wpt_15</title>
<path fill="none" stroke="black" d="M380.962,-542.854C399.224,-542.715 420.792,-542.552 439.1,-542.413"/>
</g>
<!-- wpt_13&#45;&#45;wpt_17 -->
<g id="edge58" class="edge"><title>wpt_13&#45;&#45;wpt_17</title>
<path fill="none" stroke="black" d="M195.693,-631.455C192.541,-650.404 188.779,-673.009 185.624,-691.97"/>
</g>
<!-- wpt_13&#45;&#45;wpt_14 -->
<g id="edge36" class="edge"><title>wpt_13&#45;&#45;wpt_14</title>
<path fill="none" stroke="black" d="M240.525,-578.267C259.899,-571.484 283.36,-563.269 302.717,-556.492"/>
</g>
<!-- wpt_12&#45;&#45;wpt_16 -->
<g id="edge50" class="edge"><title>wpt_12&#45;&#45;wpt_16</title>
<path fill="none" stroke="black" d="M56.0555,-654.691C53.1628,-671.918 49.7889,-692.01 46.8948,-709.245"/>
</g>
<!-- wpt_12&#45;&#45;wpt_13 -->
<g id="edge20" class="edge"><title>wpt_12&#45;&#45;wpt_13</title>
<path fill="none" stroke="black" d="M102.769,-608.035C121.452,-604.959 143.643,-601.305 162.327,-598.229"/>
</g>
<!-- wpt_11&#45;&#45;wpt_15 -->
<g id="edge24" class="edge"><title>wpt_11&#45;&#45;wpt_15</title>
<path fill="none" stroke="black" d="M487.436,-441.339C485.975,-460.251 484.24,-482.713 482.78,-501.626"/>
</g>
<!-- wpt_10&#45;&#45;wpt_14 -->
<g id="edge40" class="edge"><title>wpt_10&#45;&#45;wpt_14</title>
<path fill="none" stroke="black" d="M351.637,-437.483C349.543,-457.9 347.008,-482.625 344.916,-503.024"/>
</g>
<!-- wpt_10&#45;&#45;wpt_11 -->
<g id="edge6" class="edge"><title>wpt_10&#45;&#45;wpt_11</title>
<path fill="none" stroke="black" d="M396.21,-398.312C413.27,-398.774 433.09,-399.31 450.147,-399.772"/>
</g>
</g>
</svg>
