<?xml version="1.0" encoding="UTF-8" standalone="no"?>
<!-- Generator: Adobe Illustrator 20.1.0, SVG Export Plug-In . SVG Version: 6.00 Build 0)  -->

<svg
   xmlns:dc="http://purl.org/dc/elements/1.1/"
   xmlns:cc="http://creativecommons.org/ns#"
   xmlns:rdf="http://www.w3.org/1999/02/22-rdf-syntax-ns#"
   xmlns:svg="http://www.w3.org/2000/svg"
   xmlns="http://www.w3.org/2000/svg"
   xmlns:sodipodi="http://sodipodi.sourceforge.net/DTD/sodipodi-0.dtd"
   xmlns:inkscape="http://www.inkscape.org/namespaces/inkscape"
   version="1.1"
   id="Layer_1"
   x="0px"
   y="0px"
   viewBox="0 0 100.00625 100"
   xml:space="preserve"
   inkscape:version="0.48.4 r9939"
   width="100%"
   height="100%"
   sodipodi:docname="gas.svg"><metadata
     id="metadata13"><rdf:RDF><cc:Work
         rdf:about=""><dc:format>image/svg+xml</dc:format><dc:type
           rdf:resource="http://purl.org/dc/dcmitype/StillImage" /></cc:Work></rdf:RDF></metadata><defs
     id="defs11" /><sodipodi:namedview
     pagecolor="#ffffff"
     bordercolor="#666666"
     borderopacity="1"
     objecttolerance="10"
     gridtolerance="10"
     guidetolerance="10"
     inkscape:pageopacity="0"
     inkscape:pageshadow="2"
     inkscape:window-width="1920"
     inkscape:window-height="1176"
     id="namedview9"
     showgrid="false"
     inkscape:zoom="3.7165354"
     inkscape:cx="37.137261"
     inkscape:cy="70.980366"
     inkscape:window-x="0"
     inkscape:window-y="24"
     inkscape:window-maximized="1"
     inkscape:current-layer="Layer_1"
     fit-margin-top="0"
     fit-margin-left="0"
     fit-margin-right="0"
     fit-margin-bottom="0" /><style
     type="text/css"
     id="style3">
	.st0{fill:#035467;}
</style><path
     transform="matrix(1.9043388,0,0,2.8257929,128.26088,59.271828)"
     d="m -14.840256,-3.281142 a 26.255833,17.694149 0 1 1 -52.511665,0 26.255833,17.694149 0 1 1 52.511665,0 z"
     sodipodi:ry="17.694149"
     sodipodi:rx="26.255833"
     sodipodi:cy="-3.281142"
     sodipodi:cx="-41.096088"
     id="path2994"
     style="fill:#ffffff;fill-opacity:1;fill-rule:nonzero;stroke:none"
     sodipodi:type="arc" /><path
     style="fill:#035467;fill-opacity:1;fill-rule:nonzero;stroke:none"
     d="M 50.006247,-2.4104654e-8 C 22.392009,-2.4104654e-8 0.00624657,22.385762 0.00624657,50 c 0,27.614237 22.38576243,50 50.00000043,50 C 77.620485,100 100.00625,77.614237 100.00625,50 100.00625,22.385762 77.620485,-2.4104654e-8 50.006247,-2.4104654e-8 z M 44.974997,15 c 9.465409,6.49371 16.954992,14.64308 19.15625,26.75 2.091196,-3.301887 1.845125,-6.943987 1.625,-10.90625 0.550314,0.440251 1.01356,0.669811 1.34375,1 5.613207,6.273585 10.238993,13.212657 12,21.6875 0.220125,1.210693 0.529875,2.289308 0.75,3.5 l 0,4.625 c -0.110063,0.220126 -0.4375,0.451061 -0.4375,0.78125 -1.100628,9.355345 -7.033412,15.405858 -14.1875,20.46875 -0.77044,0.550316 -1.650746,1.105935 -2.53125,1.65625 -0.220125,0.110064 -0.339623,0.217376 -1,0.4375 3.191824,-7.26415 3.528695,-14.532036 1.4375,-21.90625 -1.981132,-7.264151 -5.631289,-13.42492 -12.125,-17.9375 -0.440252,3.962264 -0.63581,7.602988 -1.40625,11.125 -0.770441,3.522012 -2.224057,7.025549 -3.875,10.4375 -0.660377,-4.182391 0.11026,-8.476611 -2.53125,-12.21875 -1.100629,5.833334 -4.95224,10.249609 -7.59375,15.3125 -2.091195,4.072328 -1.648192,8.348861 -0.4375,12.53125 0.220126,0.660377 0.452437,1.214624 0.5625,1.875 l 0,0.21875 c -0.110063,0.110064 -0.34375,0.235064 -0.34375,0.125 -4.622642,-2.531446 -8.903302,-5.628734 -11.875,-10.03125 -3.742139,-5.283019 -4.168633,-11.212854 -2.1875,-17.15625 1.650943,-4.842767 3.72268,-9.563482 5.59375,-14.40625 0.550314,-1.54088 0.995872,-3.219929 1.65625,-5.53125 1.210692,3.852203 2.21187,7.164112 3.3125,10.90625 4.072327,-4.622641 7.145245,-9.791666 8.90625,-15.625 C 42.548504,26.99548 43.654242,20.943396 44.974997,15 z"
     id="path2990"
     inkscape:connector-curvature="0" /></svg>