<?xml version="1.0" encoding="UTF-8" standalone="no"?>
<!DOCTYPE svg PUBLIC "-//W3C//DTD SVG 1.1//EN"
 "http://www.w3.org/Graphics/SVG/1.1/DTD/svg11.dtd">
<!-- Generated by graphviz version 2.28.0 (20170704.0136)
 -->
<!-- Title: _anonymous_0 Pages: 1 -->
<svg width="986pt" height="625pt"
 viewBox="0.00 0.00 986.47 624.59" xmlns="http://www.w3.org/2000/svg" xmlns:xlink="http://www.w3.org/1999/xlink">
<g id="graph1" class="graph" transform="scale(1 1) rotate(0) translate(4 620.589)">
<title>_anonymous_0</title>
<polygon fill="white" stroke="white" points="-4,5 -4,-620.589 983.472,-620.589 983.472,5 -4,5"/>
<!-- wpt_08 -->
<g id="node1" class="node"><title>wpt_08</title>
<ellipse fill="none" stroke="black" cx="258.213" cy="-255.06" rx="39.9593" ry="40.1111"/>
<text text-anchor="middle" x="258.213" y="-251.36" font-family="Times,serif" font-size="14.00">wpt_08</text>
</g>
<!-- wpt_09 -->
<g id="node2" class="node"><title>wpt_09</title>
<ellipse fill="none" stroke="black" cx="390.267" cy="-288.707" rx="39.9593" ry="40.1111"/>
<text text-anchor="middle" x="390.267" y="-285.007" font-family="Times,serif" font-size="14.00">wpt_09</text>
</g>
<!-- wpt_08&#45;&#45;wpt_09 -->
<g id="edge20" class="edge"><title>wpt_08&#45;&#45;wpt_09</title>
<path fill="none" stroke="black" d="M297.476,-265.064C314.354,-269.365 334.041,-274.381 350.927,-278.683"/>
</g>
<!-- wpt_13 -->
<g id="node15" class="node"><title>wpt_13</title>
<ellipse fill="none" stroke="black" cx="259.519" cy="-396.902" rx="39.9593" ry="40.1111"/>
<text text-anchor="middle" x="259.519" y="-393.202" font-family="Times,serif" font-size="14.00">wpt_13</text>
</g>
<!-- wpt_08&#45;&#45;wpt_13 -->
<g id="edge52" class="edge"><title>wpt_08&#45;&#45;wpt_13</title>
<path fill="none" stroke="black" d="M258.587,-295.706C258.762,-314.698 258.97,-337.257 259.145,-356.25"/>
</g>
<!-- wpt_12 -->
<g id="node16" class="node"><title>wpt_12</title>
<ellipse fill="none" stroke="black" cx="152.503" cy="-333.319" rx="39.9593" ry="40.1111"/>
<text text-anchor="middle" x="152.503" y="-329.619" font-family="Times,serif" font-size="14.00">wpt_12</text>
</g>
<!-- wpt_08&#45;&#45;wpt_12 -->
<g id="edge58" class="edge"><title>wpt_08&#45;&#45;wpt_12</title>
<path fill="none" stroke="black" d="M225.634,-279.179C212.773,-288.7 198.025,-299.618 185.156,-309.145"/>
</g>
<!-- wpt_14 -->
<g id="node14" class="node"><title>wpt_14</title>
<ellipse fill="none" stroke="black" cx="396.137" cy="-435.405" rx="39.9593" ry="40.1111"/>
<text text-anchor="middle" x="396.137" y="-431.705" font-family="Times,serif" font-size="14.00">wpt_14</text>
</g>
<!-- wpt_09&#45;&#45;wpt_14 -->
<g id="edge28" class="edge"><title>wpt_09&#45;&#45;wpt_14</title>
<path fill="none" stroke="black" d="M391.886,-329.181C392.707,-349.705 393.702,-374.558 394.522,-395.063"/>
</g>
<!-- wpt_00 -->
<g id="node3" class="node"><title>wpt_00</title>
<ellipse fill="none" stroke="black" cx="345.664" cy="-40.3051" rx="39.9593" ry="40.1111"/>
<text text-anchor="middle" x="345.664" y="-36.6051" font-family="Times,serif" font-size="14.00">wpt_00</text>
</g>
<!-- wpt_04 -->
<g id="node7" class="node"><title>wpt_04</title>
<ellipse fill="none" stroke="black" cx="378.553" cy="-175.541" rx="39.9593" ry="40.1111"/>
<text text-anchor="middle" x="378.553" y="-171.841" font-family="Times,serif" font-size="14.00">wpt_04</text>
</g>
<!-- wpt_00&#45;&#45;wpt_04 -->
<g id="edge24" class="edge"><title>wpt_00&#45;&#45;wpt_04</title>
<path fill="none" stroke="black" d="M355.265,-79.7843C359.588,-97.5597 364.679,-118.493 368.996,-136.246"/>
</g>
<!-- wpt_01 -->
<g id="node4" class="node"><title>wpt_01</title>
<ellipse fill="none" stroke="black" cx="783.761" cy="-168.75" rx="39.9593" ry="40.1111"/>
<text text-anchor="middle" x="783.761" y="-165.05" font-family="Times,serif" font-size="14.00">wpt_01</text>
</g>
<!-- wpt_02 -->
<g id="node5" class="node"><title>wpt_02</title>
<ellipse fill="none" stroke="black" cx="880.992" cy="-270.538" rx="39.9593" ry="40.1111"/>
<text text-anchor="middle" x="880.992" y="-266.838" font-family="Times,serif" font-size="14.00">wpt_02</text>
</g>
<!-- wpt_01&#45;&#45;wpt_02 -->
<g id="edge40" class="edge"><title>wpt_01&#45;&#45;wpt_02</title>
<path fill="none" stroke="black" d="M811.623,-197.918C824.642,-211.547 840.106,-227.736 853.125,-241.365"/>
</g>
<!-- wpt_06 -->
<g id="node9" class="node"><title>wpt_06</title>
<ellipse fill="none" stroke="black" cx="651.935" cy="-215.738" rx="39.9593" ry="40.1111"/>
<text text-anchor="middle" x="651.935" y="-212.038" font-family="Times,serif" font-size="14.00">wpt_06</text>
</g>
<!-- wpt_01&#45;&#45;wpt_06 -->
<g id="edge32" class="edge"><title>wpt_01&#45;&#45;wpt_06</title>
<path fill="none" stroke="black" d="M745.631,-182.341C728.142,-188.575 707.458,-195.947 689.979,-202.177"/>
</g>
<!-- wpt_03 -->
<g id="node6" class="node"><title>wpt_03</title>
<ellipse fill="none" stroke="black" cx="938.319" cy="-384.653" rx="39.9593" ry="40.1111"/>
<text text-anchor="middle" x="938.319" y="-380.953" font-family="Times,serif" font-size="14.00">wpt_03</text>
</g>
<!-- wpt_02&#45;&#45;wpt_03 -->
<g id="edge2" class="edge"><title>wpt_02&#45;&#45;wpt_03</title>
<path fill="none" stroke="black" d="M899.13,-306.645C905.822,-319.966 913.403,-335.055 920.102,-348.39"/>
</g>
<!-- wpt_07 -->
<g id="node10" class="node"><title>wpt_07</title>
<ellipse fill="none" stroke="black" cx="810.559" cy="-391.816" rx="39.9593" ry="40.1111"/>
<text text-anchor="middle" x="810.559" y="-388.116" font-family="Times,serif" font-size="14.00">wpt_07</text>
</g>
<!-- wpt_02&#45;&#45;wpt_07 -->
<g id="edge8" class="edge"><title>wpt_02&#45;&#45;wpt_07</title>
<path fill="none" stroke="black" d="M860.619,-305.617C851.275,-321.707 840.224,-340.736 830.885,-356.817"/>
</g>
<!-- wpt_03&#45;&#45;wpt_07 -->
<g id="edge44" class="edge"><title>wpt_03&#45;&#45;wpt_07</title>
<path fill="none" stroke="black" d="M897.895,-386.92C882.836,-387.764 865.756,-388.722 850.72,-389.565"/>
</g>
<!-- wpt_04&#45;&#45;wpt_08 -->
<g id="edge56" class="edge"><title>wpt_04&#45;&#45;wpt_08</title>
<path fill="none" stroke="black" d="M344.711,-197.903C328.166,-208.836 308.312,-221.955 291.801,-232.866"/>
</g>
<!-- wpt_04&#45;&#45;wpt_09 -->
<g id="edge12" class="edge"><title>wpt_04&#45;&#45;wpt_09</title>
<path fill="none" stroke="black" d="M382.716,-215.757C383.807,-226.303 384.985,-237.679 386.078,-248.238"/>
</g>
<!-- wpt_05 -->
<g id="node8" class="node"><title>wpt_05</title>
<ellipse fill="none" stroke="black" cx="511.993" cy="-237.736" rx="39.9593" ry="40.1111"/>
<text text-anchor="middle" x="511.993" y="-234.036" font-family="Times,serif" font-size="14.00">wpt_05</text>
</g>
<!-- wpt_04&#45;&#45;wpt_05 -->
<g id="edge26" class="edge"><title>wpt_04&#45;&#45;wpt_05</title>
<path fill="none" stroke="black" d="M415.016,-192.536C433.69,-201.24 456.376,-211.814 475.11,-220.545"/>
</g>
<!-- wpt_05&#45;&#45;wpt_09 -->
<g id="edge6" class="edge"><title>wpt_05&#45;&#45;wpt_09</title>
<path fill="none" stroke="black" d="M474.81,-253.306C459.847,-259.571 442.623,-266.783 427.642,-273.057"/>
</g>
<!-- wpt_05&#45;&#45;wpt_06 -->
<g id="edge54" class="edge"><title>wpt_05&#45;&#45;wpt_06</title>
<path fill="none" stroke="black" d="M551.72,-231.491C570.629,-228.519 593.187,-224.973 612.108,-221.998"/>
</g>
<!-- wpt_10 -->
<g id="node18" class="node"><title>wpt_10</title>
<ellipse fill="none" stroke="black" cx="533.347" cy="-392.773" rx="39.9593" ry="40.1111"/>
<text text-anchor="middle" x="533.347" y="-389.073" font-family="Times,serif" font-size="14.00">wpt_10</text>
</g>
<!-- wpt_05&#45;&#45;wpt_10 -->
<g id="edge30" class="edge"><title>wpt_05&#45;&#45;wpt_10</title>
<path fill="none" stroke="black" d="M517.492,-277.662C520.668,-300.72 524.65,-329.633 527.829,-352.714"/>
</g>
<!-- wpt_11 -->
<g id="node17" class="node"><title>wpt_11</title>
<ellipse fill="none" stroke="black" cx="673.454" cy="-367.918" rx="39.9593" ry="40.1111"/>
<text text-anchor="middle" x="673.454" y="-364.218" font-family="Times,serif" font-size="14.00">wpt_11</text>
</g>
<!-- wpt_06&#45;&#45;wpt_11 -->
<g id="edge46" class="edge"><title>wpt_06&#45;&#45;wpt_11</title>
<path fill="none" stroke="black" d="M657.589,-255.721C660.739,-278.001 664.65,-305.658 667.801,-327.937"/>
</g>
<!-- wpt_07&#45;&#45;wpt_11 -->
<g id="edge64" class="edge"><title>wpt_07&#45;&#45;wpt_11</title>
<path fill="none" stroke="black" d="M770.902,-384.904C752.713,-381.733 731.2,-377.984 713.021,-374.815"/>
</g>
<!-- wpt_17 -->
<g id="node11" class="node"><title>wpt_17</title>
<ellipse fill="none" stroke="black" cx="148.789" cy="-469.975" rx="39.9593" ry="40.1111"/>
<text text-anchor="middle" x="148.789" y="-466.275" font-family="Times,serif" font-size="14.00">wpt_17</text>
</g>
<!-- wpt_18 -->
<g id="node20" class="node"><title>wpt_18</title>
<ellipse fill="none" stroke="black" cx="279.641" cy="-512.539" rx="39.9593" ry="40.1111"/>
<text text-anchor="middle" x="279.641" y="-508.839" font-family="Times,serif" font-size="14.00">wpt_18</text>
</g>
<!-- wpt_17&#45;&#45;wpt_18 -->
<g id="edge50" class="edge"><title>wpt_17&#45;&#45;wpt_18</title>
<path fill="none" stroke="black" d="M187.341,-482.515C204.228,-488.008 224.006,-494.442 240.912,-499.941"/>
</g>
<!-- wpt_16 -->
<g id="node12" class="node"><title>wpt_16</title>
<ellipse fill="none" stroke="black" cx="40.1525" cy="-398.742" rx="39.9593" ry="40.1111"/>
<text text-anchor="middle" x="40.1525" y="-395.042" font-family="Times,serif" font-size="14.00">wpt_16</text>
</g>
<!-- wpt_16&#45;&#45;wpt_17 -->
<g id="edge14" class="edge"><title>wpt_16&#45;&#45;wpt_17</title>
<path fill="none" stroke="black" d="M73.9302,-420.89C87.0102,-429.466 101.954,-439.265 115.032,-447.84"/>
</g>
<!-- wpt_15 -->
<g id="node13" class="node"><title>wpt_15</title>
<ellipse fill="none" stroke="black" cx="493.21" cy="-519.096" rx="39.9593" ry="40.1111"/>
<text text-anchor="middle" x="493.21" y="-515.396" font-family="Times,serif" font-size="14.00">wpt_15</text>
</g>
<!-- wpt_19 -->
<g id="node19" class="node"><title>wpt_19</title>
<ellipse fill="none" stroke="black" cx="381.867" cy="-576.283" rx="39.9593" ry="40.1111"/>
<text text-anchor="middle" x="381.867" y="-572.583" font-family="Times,serif" font-size="14.00">wpt_19</text>
</g>
<!-- wpt_15&#45;&#45;wpt_19 -->
<g id="edge16" class="edge"><title>wpt_15&#45;&#45;wpt_19</title>
<path fill="none" stroke="black" d="M457.06,-537.663C444.487,-544.121 430.393,-551.359 417.835,-557.809"/>
</g>
<!-- wpt_14&#45;&#45;wpt_15 -->
<g id="edge22" class="edge"><title>wpt_14&#45;&#45;wpt_15</title>
<path fill="none" stroke="black" d="M426.851,-461.885C438.294,-471.75 451.271,-482.938 462.695,-492.788"/>
</g>
<!-- wpt_14&#45;&#45;wpt_19 -->
<g id="edge66" class="edge"><title>wpt_14&#45;&#45;wpt_19</title>
<path fill="none" stroke="black" d="M392.047,-475.775C390.137,-494.638 387.867,-517.043 385.956,-535.907"/>
</g>
<!-- wpt_14&#45;&#45;wpt_18 -->
<g id="edge48" class="edge"><title>wpt_14&#45;&#45;wpt_18</title>
<path fill="none" stroke="black" d="M362.441,-457.715C346.986,-467.949 328.707,-480.051 313.261,-490.279"/>
</g>
<!-- wpt_13&#45;&#45;wpt_17 -->
<g id="edge68" class="edge"><title>wpt_13&#45;&#45;wpt_17</title>
<path fill="none" stroke="black" d="M225.695,-419.223C211.957,-428.289 196.123,-438.738 182.406,-447.79"/>
</g>
<!-- wpt_13&#45;&#45;wpt_14 -->
<g id="edge42" class="edge"><title>wpt_13&#45;&#45;wpt_14</title>
<path fill="none" stroke="black" d="M298.303,-407.832C316.762,-413.035 338.784,-419.241 357.256,-424.447"/>
</g>
<!-- wpt_13&#45;&#45;wpt_18 -->
<g id="edge36" class="edge"><title>wpt_13&#45;&#45;wpt_18</title>
<path fill="none" stroke="black" d="M266.444,-436.697C268.468,-448.326 270.679,-461.036 272.704,-472.67"/>
</g>
<!-- wpt_12&#45;&#45;wpt_17 -->
<g id="edge10" class="edge"><title>wpt_12&#45;&#45;wpt_17</title>
<path fill="none" stroke="black" d="M151.399,-373.95C150.924,-391.416 150.37,-411.789 149.895,-429.264"/>
</g>
<!-- wpt_12&#45;&#45;wpt_16 -->
<g id="edge62" class="edge"><title>wpt_12&#45;&#45;wpt_16</title>
<path fill="none" stroke="black" d="M117.57,-353.66C104.043,-361.537 88.5886,-370.537 75.0634,-378.413"/>
</g>
<!-- wpt_12&#45;&#45;wpt_13 -->
<g id="edge38" class="edge"><title>wpt_12&#45;&#45;wpt_13</title>
<path fill="none" stroke="black" d="M187.248,-353.962C199.332,-361.142 212.878,-369.19 224.948,-376.362"/>
</g>
<!-- wpt_10&#45;&#45;wpt_15 -->
<g id="edge60" class="edge"><title>wpt_10&#45;&#45;wpt_15</title>
<path fill="none" stroke="black" d="M521.086,-431.361C516.153,-446.888 510.474,-464.762 505.534,-480.31"/>
</g>
<!-- wpt_10&#45;&#45;wpt_14 -->
<g id="edge34" class="edge"><title>wpt_10&#45;&#45;wpt_14</title>
<path fill="none" stroke="black" d="M494.761,-404.762C476.055,-410.574 453.639,-417.539 434.908,-423.358"/>
</g>
<!-- wpt_10&#45;&#45;wpt_11 -->
<g id="edge4" class="edge"><title>wpt_10&#45;&#45;wpt_11</title>
<path fill="none" stroke="black" d="M573.121,-385.717C592.052,-382.359 614.637,-378.352 633.58,-374.992"/>
</g>
<!-- wpt_18&#45;&#45;wpt_19 -->
<g id="edge18" class="edge"><title>wpt_18&#45;&#45;wpt_19</title>
<path fill="none" stroke="black" d="M313.965,-533.942C324.754,-540.67 336.665,-548.097 347.459,-554.828"/>
</g>
</g>
</svg>
