<?xml version="1.0" encoding="UTF-8" standalone="no"?>
<!DOCTYPE svg PUBLIC "-//W3C//DTD SVG 1.1//EN"
 "http://www.w3.org/Graphics/SVG/1.1/DTD/svg11.dtd">
<!-- Generated by graphviz version 2.28.0 (20170704.0136)
 -->
<!-- Title: _anonymous_0 Pages: 1 -->
<svg width="949pt" height="740pt"
 viewBox="0.00 0.00 949.42 739.65" xmlns="http://www.w3.org/2000/svg" xmlns:xlink="http://www.w3.org/1999/xlink">
<g id="graph1" class="graph" transform="scale(1 1) rotate(0) translate(4 735.652)">
<title>_anonymous_0</title>
<polygon fill="white" stroke="white" points="-4,5 -4,-735.652 946.417,-735.652 946.417,5 -4,5"/>
<!-- wpt_08 -->
<g id="node1" class="node"><title>wpt_08</title>
<ellipse fill="none" stroke="black" cx="635.373" cy="-626.486" rx="39.9593" ry="40.1111"/>
<text text-anchor="middle" x="635.373" y="-622.786" font-family="Times,serif" font-size="14.00">wpt_08</text>
</g>
<!-- wpt_13 -->
<g id="node14" class="node"><title>wpt_13</title>
<ellipse fill="none" stroke="black" cx="706.326" cy="-499.784" rx="39.9593" ry="40.1111"/>
<text text-anchor="middle" x="706.326" y="-496.084" font-family="Times,serif" font-size="14.00">wpt_13</text>
</g>
<!-- wpt_08&#45;&#45;wpt_13 -->
<g id="edge10" class="edge"><title>wpt_08&#45;&#45;wpt_13</title>
<path fill="none" stroke="black" d="M655.137,-591.193C664.897,-573.766 676.644,-552.789 686.422,-535.328"/>
</g>
<!-- wpt_09 -->
<g id="node2" class="node"><title>wpt_09</title>
<ellipse fill="none" stroke="black" cx="705.233" cy="-347.097" rx="39.9593" ry="40.1111"/>
<text text-anchor="middle" x="705.233" y="-343.397" font-family="Times,serif" font-size="14.00">wpt_09</text>
</g>
<!-- wpt_14 -->
<g id="node13" class="node"><title>wpt_14</title>
<ellipse fill="none" stroke="black" cx="612.256" cy="-405.919" rx="39.9593" ry="40.1111"/>
<text text-anchor="middle" x="612.256" y="-402.219" font-family="Times,serif" font-size="14.00">wpt_14</text>
</g>
<!-- wpt_09&#45;&#45;wpt_14 -->
<g id="edge26" class="edge"><title>wpt_09&#45;&#45;wpt_14</title>
<path fill="none" stroke="black" d="M671.14,-368.666C663.055,-373.781 654.43,-379.238 646.345,-384.353"/>
</g>
<!-- wpt_09&#45;&#45;wpt_13 -->
<g id="edge20" class="edge"><title>wpt_09&#45;&#45;wpt_13</title>
<path fill="none" stroke="black" d="M705.523,-387.614C705.682,-409.789 705.878,-437.18 706.036,-459.344"/>
</g>
<!-- wpt_10 -->
<g id="node17" class="node"><title>wpt_10</title>
<ellipse fill="none" stroke="black" cx="574.851" cy="-274.579" rx="39.9593" ry="40.1111"/>
<text text-anchor="middle" x="574.851" y="-270.879" font-family="Times,serif" font-size="14.00">wpt_10</text>
</g>
<!-- wpt_09&#45;&#45;wpt_10 -->
<g id="edge12" class="edge"><title>wpt_09&#45;&#45;wpt_10</title>
<path fill="none" stroke="black" d="M669.95,-327.473C651.397,-317.154 628.719,-304.54 610.162,-294.219"/>
</g>
<!-- wpt_00 -->
<g id="node3" class="node"><title>wpt_00</title>
<ellipse fill="none" stroke="black" cx="40.1525" cy="-276.065" rx="39.9593" ry="40.1111"/>
<text text-anchor="middle" x="40.1525" y="-272.365" font-family="Times,serif" font-size="14.00">wpt_00</text>
</g>
<!-- wpt_01 -->
<g id="node4" class="node"><title>wpt_01</title>
<ellipse fill="none" stroke="black" cx="171.011" cy="-261.412" rx="39.9593" ry="40.1111"/>
<text text-anchor="middle" x="171.011" y="-257.712" font-family="Times,serif" font-size="14.00">wpt_01</text>
</g>
<!-- wpt_00&#45;&#45;wpt_01 -->
<g id="edge34" class="edge"><title>wpt_00&#45;&#45;wpt_01</title>
<path fill="none" stroke="black" d="M80.4822,-271.549C96.4026,-269.766 114.66,-267.722 130.589,-265.939"/>
</g>
<!-- wpt_02 -->
<g id="node5" class="node"><title>wpt_02</title>
<ellipse fill="none" stroke="black" cx="297.856" cy="-206.931" rx="39.9593" ry="40.1111"/>
<text text-anchor="middle" x="297.856" y="-203.231" font-family="Times,serif" font-size="14.00">wpt_02</text>
</g>
<!-- wpt_01&#45;&#45;wpt_02 -->
<g id="edge18" class="edge"><title>wpt_01&#45;&#45;wpt_02</title>
<path fill="none" stroke="black" d="M208.383,-245.361C224.899,-238.267 244.267,-229.948 260.752,-222.868"/>
</g>
<!-- wpt_03 -->
<g id="node6" class="node"><title>wpt_03</title>
<ellipse fill="none" stroke="black" cx="265.803" cy="-67.32" rx="39.9593" ry="40.1111"/>
<text text-anchor="middle" x="265.803" y="-63.62" font-family="Times,serif" font-size="14.00">wpt_03</text>
</g>
<!-- wpt_02&#45;&#45;wpt_03 -->
<g id="edge8" class="edge"><title>wpt_02&#45;&#45;wpt_03</title>
<path fill="none" stroke="black" d="M288.757,-167.298C284.426,-148.434 279.259,-125.929 274.925,-107.053"/>
</g>
<!-- wpt_06 -->
<g id="node9" class="node"><title>wpt_06</title>
<ellipse fill="none" stroke="black" cx="429.965" cy="-251.028" rx="39.9593" ry="40.1111"/>
<text text-anchor="middle" x="429.965" y="-247.328" font-family="Times,serif" font-size="14.00">wpt_06</text>
</g>
<!-- wpt_02&#45;&#45;wpt_06 -->
<g id="edge6" class="edge"><title>wpt_02&#45;&#45;wpt_06</title>
<path fill="none" stroke="black" d="M336.068,-219.686C353.442,-225.485 373.963,-232.335 391.382,-238.149"/>
</g>
<!-- wpt_07 -->
<g id="node10" class="node"><title>wpt_07</title>
<ellipse fill="none" stroke="black" cx="382.512" cy="-119.773" rx="39.9593" ry="40.1111"/>
<text text-anchor="middle" x="382.512" y="-116.073" font-family="Times,serif" font-size="14.00">wpt_07</text>
</g>
<!-- wpt_02&#45;&#45;wpt_07 -->
<g id="edge36" class="edge"><title>wpt_02&#45;&#45;wpt_07</title>
<path fill="none" stroke="black" d="M326.045,-177.909C335.088,-168.599 345.103,-158.288 354.157,-148.966"/>
</g>
<!-- wpt_03&#45;&#45;wpt_07 -->
<g id="edge32" class="edge"><title>wpt_03&#45;&#45;wpt_07</title>
<path fill="none" stroke="black" d="M302.73,-83.9165C316.487,-90.0994 332.089,-97.1115 345.824,-103.285"/>
</g>
<!-- wpt_04 -->
<g id="node7" class="node"><title>wpt_04</title>
<ellipse fill="none" stroke="black" cx="804.959" cy="-239.757" rx="39.9593" ry="40.1111"/>
<text text-anchor="middle" x="804.959" y="-236.057" font-family="Times,serif" font-size="14.00">wpt_04</text>
</g>
<!-- wpt_04&#45;&#45;wpt_09 -->
<g id="edge16" class="edge"><title>wpt_04&#45;&#45;wpt_09</title>
<path fill="none" stroke="black" d="M777.445,-269.372C763.493,-284.39 746.597,-302.575 732.658,-317.579"/>
</g>
<!-- wpt_05 -->
<g id="node8" class="node"><title>wpt_05</title>
<ellipse fill="none" stroke="black" cx="843.401" cy="-342.334" rx="39.9593" ry="40.1111"/>
<text text-anchor="middle" x="843.401" y="-338.634" font-family="Times,serif" font-size="14.00">wpt_05</text>
</g>
<!-- wpt_05&#45;&#45;wpt_09 -->
<g id="edge2" class="edge"><title>wpt_05&#45;&#45;wpt_09</title>
<path fill="none" stroke="black" d="M803.066,-343.725C784.905,-344.351 763.518,-345.088 745.38,-345.713"/>
</g>
<!-- wpt_06&#45;&#45;wpt_07 -->
<g id="edge24" class="edge"><title>wpt_06&#45;&#45;wpt_07</title>
<path fill="none" stroke="black" d="M416.239,-213.064C409.998,-195.801 402.628,-175.414 396.371,-158.107"/>
</g>
<!-- wpt_06&#45;&#45;wpt_10 -->
<g id="edge38" class="edge"><title>wpt_06&#45;&#45;wpt_10</title>
<path fill="none" stroke="black" d="M469.939,-257.526C490.209,-260.821 514.755,-264.811 535.007,-268.103"/>
</g>
<!-- wpt_11 -->
<g id="node16" class="node"><title>wpt_11</title>
<ellipse fill="none" stroke="black" cx="491.875" cy="-40.3051" rx="39.9593" ry="40.1111"/>
<text text-anchor="middle" x="491.875" y="-36.6051" font-family="Times,serif" font-size="14.00">wpt_11</text>
</g>
<!-- wpt_07&#45;&#45;wpt_11 -->
<g id="edge4" class="edge"><title>wpt_07&#45;&#45;wpt_11</title>
<path fill="none" stroke="black" d="M415.324,-95.9302C429.166,-85.8722 445.246,-74.1876 459.085,-64.1314"/>
</g>
<!-- wpt_16 -->
<g id="node11" class="node"><title>wpt_16</title>
<ellipse fill="none" stroke="black" cx="901.264" cy="-691.347" rx="39.9593" ry="40.1111"/>
<text text-anchor="middle" x="901.264" y="-687.647" font-family="Times,serif" font-size="14.00">wpt_16</text>
</g>
<!-- wpt_15 -->
<g id="node12" class="node"><title>wpt_15</title>
<ellipse fill="none" stroke="black" cx="600.47" cy="-127.736" rx="39.9593" ry="40.1111"/>
<text text-anchor="middle" x="600.47" y="-124.036" font-family="Times,serif" font-size="14.00">wpt_15</text>
</g>
<!-- wpt_13&#45;&#45;wpt_14 -->
<g id="edge28" class="edge"><title>wpt_13&#45;&#45;wpt_14</title>
<path fill="none" stroke="black" d="M677.847,-471.367C666.166,-459.712 652.667,-446.242 640.963,-434.564"/>
</g>
<!-- wpt_12 -->
<g id="node15" class="node"><title>wpt_12</title>
<ellipse fill="none" stroke="black" cx="817.52" cy="-588.213" rx="39.9593" ry="40.1111"/>
<text text-anchor="middle" x="817.52" y="-584.513" font-family="Times,serif" font-size="14.00">wpt_12</text>
</g>
<!-- wpt_12&#45;&#45;wpt_16 -->
<g id="edge30" class="edge"><title>wpt_12&#45;&#45;wpt_16</title>
<path fill="none" stroke="black" d="M843.101,-619.717C853.491,-632.512 865.466,-647.26 875.84,-660.036"/>
</g>
<!-- wpt_12&#45;&#45;wpt_13 -->
<g id="edge14" class="edge"><title>wpt_12&#45;&#45;wpt_13</title>
<path fill="none" stroke="black" d="M785.954,-563.11C770.929,-551.161 753.006,-536.907 737.971,-524.951"/>
</g>
<!-- wpt_11&#45;&#45;wpt_15 -->
<g id="edge22" class="edge"><title>wpt_11&#45;&#45;wpt_15</title>
<path fill="none" stroke="black" d="M523.285,-65.5937C537.567,-77.0924 554.435,-90.673 568.754,-102.201"/>
</g>
<!-- wpt_10&#45;&#45;wpt_15 -->
<g id="edge42" class="edge"><title>wpt_10&#45;&#45;wpt_15</title>
<path fill="none" stroke="black" d="M581.784,-234.841C585.429,-213.946 589.886,-188.405 593.532,-167.505"/>
</g>
<!-- wpt_10&#45;&#45;wpt_14 -->
<g id="edge40" class="edge"><title>wpt_10&#45;&#45;wpt_14</title>
<path fill="none" stroke="black" d="M585.972,-313.63C590.753,-330.417 596.329,-349.997 601.113,-366.792"/>
</g>
</g>
</svg>
