<?xml version="1.0" encoding="UTF-8" standalone="no"?>
<!DOCTYPE svg PUBLIC "-//W3C//DTD SVG 1.1//EN"
 "http://www.w3.org/Graphics/SVG/1.1/DTD/svg11.dtd">
<!-- Generated by graphviz version 2.28.0 (20170704.0136)
 -->
<!-- Title: _anonymous_0 Pages: 1 -->
<svg width="824pt" height="656pt"
 viewBox="0.00 0.00 823.58 655.97" xmlns="http://www.w3.org/2000/svg" xmlns:xlink="http://www.w3.org/1999/xlink">
<g id="graph1" class="graph" transform="scale(1 1) rotate(0) translate(4 651.973)">
<title>_anonymous_0</title>
<polygon fill="white" stroke="white" points="-4,5 -4,-651.973 820.575,-651.973 820.575,5 -4,5"/>
<!-- wpt_08 -->
<g id="node1" class="node"><title>wpt_08</title>
<ellipse fill="none" stroke="black" cx="104.522" cy="-364.706" rx="39.9593" ry="40.1111"/>
<text text-anchor="middle" x="104.522" y="-361.006" font-family="Times,serif" font-size="14.00">wpt_08</text>
</g>
<!-- wpt_13 -->
<g id="node15" class="node"><title>wpt_13</title>
<ellipse fill="none" stroke="black" cx="215.729" cy="-430.319" rx="39.9593" ry="40.1111"/>
<text text-anchor="middle" x="215.729" y="-426.619" font-family="Times,serif" font-size="14.00">wpt_13</text>
</g>
<!-- wpt_08&#45;&#45;wpt_13 -->
<g id="edge42" class="edge"><title>wpt_08&#45;&#45;wpt_13</title>
<path fill="none" stroke="black" d="M139.404,-385.286C152.653,-393.103 167.734,-402.001 180.972,-409.811"/>
</g>
<!-- wpt_12 -->
<g id="node16" class="node"><title>wpt_12</title>
<ellipse fill="none" stroke="black" cx="147.087" cy="-521.865" rx="39.9593" ry="40.1111"/>
<text text-anchor="middle" x="147.087" y="-518.165" font-family="Times,serif" font-size="14.00">wpt_12</text>
</g>
<!-- wpt_08&#45;&#45;wpt_12 -->
<g id="edge44" class="edge"><title>wpt_08&#45;&#45;wpt_12</title>
<path fill="none" stroke="black" d="M115.153,-403.958C121.679,-428.051 130.004,-458.79 136.518,-482.841"/>
</g>
<!-- wpt_09 -->
<g id="node2" class="node"><title>wpt_09</title>
<ellipse fill="none" stroke="black" cx="256.128" cy="-304.636" rx="39.9593" ry="40.1111"/>
<text text-anchor="middle" x="256.128" y="-300.936" font-family="Times,serif" font-size="14.00">wpt_09</text>
</g>
<!-- wpt_14 -->
<g id="node14" class="node"><title>wpt_14</title>
<ellipse fill="none" stroke="black" cx="349.468" cy="-409.571" rx="39.9593" ry="40.1111"/>
<text text-anchor="middle" x="349.468" y="-405.871" font-family="Times,serif" font-size="14.00">wpt_14</text>
</g>
<!-- wpt_09&#45;&#45;wpt_14 -->
<g id="edge22" class="edge"><title>wpt_09&#45;&#45;wpt_14</title>
<path fill="none" stroke="black" d="M283.125,-334.987C295.509,-348.909 310.154,-365.374 322.531,-379.288"/>
</g>
<!-- wpt_09&#45;&#45;wpt_13 -->
<g id="edge56" class="edge"><title>wpt_09&#45;&#45;wpt_13</title>
<path fill="none" stroke="black" d="M243.787,-343.028C238.822,-358.476 233.105,-376.26 228.133,-391.729"/>
</g>
<!-- wpt_00 -->
<g id="node3" class="node"><title>wpt_00</title>
<ellipse fill="none" stroke="black" cx="300.614" cy="-40.3051" rx="39.9593" ry="40.1111"/>
<text text-anchor="middle" x="300.614" y="-36.6051" font-family="Times,serif" font-size="14.00">wpt_00</text>
</g>
<!-- wpt_01 -->
<g id="node4" class="node"><title>wpt_01</title>
<ellipse fill="none" stroke="black" cx="406.709" cy="-110.338" rx="39.9593" ry="40.1111"/>
<text text-anchor="middle" x="406.709" y="-106.638" font-family="Times,serif" font-size="14.00">wpt_01</text>
</g>
<!-- wpt_00&#45;&#45;wpt_01 -->
<g id="edge6" class="edge"><title>wpt_00&#45;&#45;wpt_01</title>
<path fill="none" stroke="black" d="M334.475,-62.6563C346.725,-70.7424 360.552,-79.8699 372.806,-87.9584"/>
</g>
<!-- wpt_05 -->
<g id="node8" class="node"><title>wpt_05</title>
<ellipse fill="none" stroke="black" cx="270.329" cy="-164.691" rx="39.9593" ry="40.1111"/>
<text text-anchor="middle" x="270.329" y="-160.991" font-family="Times,serif" font-size="14.00">wpt_05</text>
</g>
<!-- wpt_00&#45;&#45;wpt_05 -->
<g id="edge2" class="edge"><title>wpt_00&#45;&#45;wpt_05</title>
<path fill="none" stroke="black" d="M291.031,-79.6617C287.496,-94.1812 283.491,-110.629 279.953,-125.164"/>
</g>
<!-- wpt_02 -->
<g id="node5" class="node"><title>wpt_02</title>
<ellipse fill="none" stroke="black" cx="548.236" cy="-105.04" rx="39.9593" ry="40.1111"/>
<text text-anchor="middle" x="548.236" y="-101.34" font-family="Times,serif" font-size="14.00">wpt_02</text>
</g>
<!-- wpt_01&#45;&#45;wpt_02 -->
<g id="edge32" class="edge"><title>wpt_01&#45;&#45;wpt_02</title>
<path fill="none" stroke="black" d="M446.887,-108.834C466.009,-108.118 488.822,-107.264 507.958,-106.548"/>
</g>
<!-- wpt_01&#45;&#45;wpt_05 -->
<g id="edge4" class="edge"><title>wpt_01&#45;&#45;wpt_05</title>
<path fill="none" stroke="black" d="M369.082,-125.334C350.002,-132.938 326.896,-142.147 307.834,-149.744"/>
</g>
<!-- wpt_06 -->
<g id="node9" class="node"><title>wpt_06</title>
<ellipse fill="none" stroke="black" cx="510.042" cy="-206.568" rx="39.9593" ry="40.1111"/>
<text text-anchor="middle" x="510.042" y="-202.868" font-family="Times,serif" font-size="14.00">wpt_06</text>
</g>
<!-- wpt_01&#45;&#45;wpt_06 -->
<g id="edge26" class="edge"><title>wpt_01&#45;&#45;wpt_06</title>
<path fill="none" stroke="black" d="M436.32,-137.913C450.156,-150.799 466.59,-166.103 480.427,-178.988"/>
</g>
<!-- wpt_02&#45;&#45;wpt_06 -->
<g id="edge46" class="edge"><title>wpt_02&#45;&#45;wpt_06</title>
<path fill="none" stroke="black" d="M534.014,-142.846C530.833,-151.302 527.458,-160.273 524.276,-168.732"/>
</g>
<!-- wpt_07 -->
<g id="node10" class="node"><title>wpt_07</title>
<ellipse fill="none" stroke="black" cx="644.339" cy="-220.104" rx="39.9593" ry="40.1111"/>
<text text-anchor="middle" x="644.339" y="-216.404" font-family="Times,serif" font-size="14.00">wpt_07</text>
</g>
<!-- wpt_02&#45;&#45;wpt_07 -->
<g id="edge50" class="edge"><title>wpt_02&#45;&#45;wpt_07</title>
<path fill="none" stroke="black" d="M574.243,-136.178C587.918,-152.551 604.633,-172.565 618.311,-188.941"/>
</g>
<!-- wpt_03 -->
<g id="node6" class="node"><title>wpt_03</title>
<ellipse fill="none" stroke="black" cx="775.423" cy="-179.546" rx="39.9593" ry="40.1111"/>
<text text-anchor="middle" x="775.423" y="-175.846" font-family="Times,serif" font-size="14.00">wpt_03</text>
</g>
<!-- wpt_03&#45;&#45;wpt_07 -->
<g id="edge52" class="edge"><title>wpt_03&#45;&#45;wpt_07</title>
<path fill="none" stroke="black" d="M736.802,-191.496C719.886,-196.73 700.073,-202.86 683.136,-208.1"/>
</g>
<!-- wpt_04 -->
<g id="node7" class="node"><title>wpt_04</title>
<ellipse fill="none" stroke="black" cx="155.37" cy="-231.479" rx="39.9593" ry="40.1111"/>
<text text-anchor="middle" x="155.37" y="-227.779" font-family="Times,serif" font-size="14.00">wpt_04</text>
</g>
<!-- wpt_04&#45;&#45;wpt_08 -->
<g id="edge40" class="edge"><title>wpt_04&#45;&#45;wpt_08</title>
<path fill="none" stroke="black" d="M140.935,-269.3C134.065,-287.302 125.868,-308.777 118.993,-326.79"/>
</g>
<!-- wpt_04&#45;&#45;wpt_09 -->
<g id="edge12" class="edge"><title>wpt_04&#45;&#45;wpt_09</title>
<path fill="none" stroke="black" d="M188.083,-255.231C199.461,-263.492 212.214,-272.752 223.579,-281.003"/>
</g>
<!-- wpt_04&#45;&#45;wpt_05 -->
<g id="edge20" class="edge"><title>wpt_04&#45;&#45;wpt_05</title>
<path fill="none" stroke="black" d="M190.173,-211.259C204.448,-202.966 220.944,-193.383 235.247,-185.073"/>
</g>
<!-- wpt_05&#45;&#45;wpt_09 -->
<g id="edge28" class="edge"><title>wpt_05&#45;&#45;wpt_09</title>
<path fill="none" stroke="black" d="M266.259,-204.794C264.358,-223.532 262.099,-245.788 260.198,-264.527"/>
</g>
<!-- wpt_06&#45;&#45;wpt_07 -->
<g id="edge8" class="edge"><title>wpt_06&#45;&#45;wpt_07</title>
<path fill="none" stroke="black" d="M550.336,-210.629C567.333,-212.343 587.079,-214.333 604.074,-216.045"/>
</g>
<!-- wpt_10 -->
<g id="node18" class="node"><title>wpt_10</title>
<ellipse fill="none" stroke="black" cx="457.741" cy="-337.702" rx="39.9593" ry="40.1111"/>
<text text-anchor="middle" x="457.741" y="-334.002" font-family="Times,serif" font-size="14.00">wpt_10</text>
</g>
<!-- wpt_06&#45;&#45;wpt_10 -->
<g id="edge16" class="edge"><title>wpt_06&#45;&#45;wpt_10</title>
<path fill="none" stroke="black" d="M495.055,-244.146C488.052,-261.704 479.734,-282.56 472.73,-300.119"/>
</g>
<!-- wpt_11 -->
<g id="node17" class="node"><title>wpt_11</title>
<ellipse fill="none" stroke="black" cx="625.048" cy="-375.221" rx="39.9593" ry="40.1111"/>
<text text-anchor="middle" x="625.048" y="-371.521" font-family="Times,serif" font-size="14.00">wpt_11</text>
</g>
<!-- wpt_07&#45;&#45;wpt_11 -->
<g id="edge54" class="edge"><title>wpt_07&#45;&#45;wpt_11</title>
<path fill="none" stroke="black" d="M639.321,-260.454C636.463,-283.434 632.895,-312.126 630.041,-335.073"/>
</g>
<!-- wpt_17 -->
<g id="node11" class="node"><title>wpt_17</title>
<ellipse fill="none" stroke="black" cx="72.1674" cy="-490.047" rx="39.9593" ry="40.1111"/>
<text text-anchor="middle" x="72.1674" y="-486.347" font-family="Times,serif" font-size="14.00">wpt_17</text>
</g>
<!-- wpt_16 -->
<g id="node12" class="node"><title>wpt_16</title>
<ellipse fill="none" stroke="black" cx="40.1525" cy="-607.668" rx="39.9593" ry="40.1111"/>
<text text-anchor="middle" x="40.1525" y="-603.968" font-family="Times,serif" font-size="14.00">wpt_16</text>
</g>
<!-- wpt_16&#45;&#45;wpt_17 -->
<g id="edge14" class="edge"><title>wpt_16&#45;&#45;wpt_17</title>
<path fill="none" stroke="black" d="M50.813,-568.502C54.2691,-555.805 58.1008,-541.727 61.5535,-529.042"/>
</g>
<!-- wpt_15 -->
<g id="node13" class="node"><title>wpt_15</title>
<ellipse fill="none" stroke="black" cx="490.673" cy="-445.782" rx="39.9593" ry="40.1111"/>
<text text-anchor="middle" x="490.673" y="-442.082" font-family="Times,serif" font-size="14.00">wpt_15</text>
</g>
<!-- wpt_14&#45;&#45;wpt_15 -->
<g id="edge18" class="edge"><title>wpt_14&#45;&#45;wpt_15</title>
<path fill="none" stroke="black" d="M388.427,-419.562C408.018,-424.586 431.709,-430.661 451.351,-435.698"/>
</g>
<!-- wpt_13&#45;&#45;wpt_17 -->
<g id="edge58" class="edge"><title>wpt_13&#45;&#45;wpt_17</title>
<path fill="none" stroke="black" d="M178.385,-445.856C157.117,-454.705 130.562,-465.752 109.325,-474.588"/>
</g>
<!-- wpt_13&#45;&#45;wpt_14 -->
<g id="edge34" class="edge"><title>wpt_13&#45;&#45;wpt_14</title>
<path fill="none" stroke="black" d="M255.493,-424.15C272.587,-421.498 292.524,-418.405 309.626,-415.752"/>
</g>
<!-- wpt_12&#45;&#45;wpt_17 -->
<g id="edge10" class="edge"><title>wpt_12&#45;&#45;wpt_17</title>
<path fill="none" stroke="black" d="M110.066,-506.143C109.771,-506.017 109.476,-505.892 109.181,-505.767"/>
</g>
<!-- wpt_12&#45;&#45;wpt_16 -->
<g id="edge36" class="edge"><title>wpt_12&#45;&#45;wpt_16</title>
<path fill="none" stroke="black" d="M115.582,-547.145C101.782,-558.218 85.619,-571.186 71.8025,-582.273"/>
</g>
<!-- wpt_12&#45;&#45;wpt_13 -->
<g id="edge30" class="edge"><title>wpt_12&#45;&#45;wpt_13</title>
<path fill="none" stroke="black" d="M171.288,-489.589C177.85,-480.838 184.953,-471.364 191.516,-462.612"/>
</g>
<!-- wpt_11&#45;&#45;wpt_15 -->
<g id="edge24" class="edge"><title>wpt_11&#45;&#45;wpt_15</title>
<path fill="none" stroke="black" d="M589.391,-393.945C569.953,-404.152 545.961,-416.75 526.497,-426.971"/>
</g>
<!-- wpt_10&#45;&#45;wpt_15 -->
<g id="edge48" class="edge"><title>wpt_10&#45;&#45;wpt_15</title>
<path fill="none" stroke="black" d="M469.537,-376.416C472.564,-386.35 475.82,-397.036 478.848,-406.975"/>
</g>
<!-- wpt_10&#45;&#45;wpt_14 -->
<g id="edge38" class="edge"><title>wpt_10&#45;&#45;wpt_14</title>
<path fill="none" stroke="black" d="M424.076,-360.048C411.04,-368.701 396.146,-378.587 383.112,-387.239"/>
</g>
</g>
</svg>
