<?xml version="1.0" encoding="UTF-8" standalone="no"?>
<!-- Generator: Adobe Illustrator 19.0.1, SVG Export Plug-In . SVG Version: 6.00 Build 0)  -->

<svg
   xmlns:dc="http://purl.org/dc/elements/1.1/"
   xmlns:cc="http://creativecommons.org/ns#"
   xmlns:rdf="http://www.w3.org/1999/02/22-rdf-syntax-ns#"
   xmlns:svg="http://www.w3.org/2000/svg"
   xmlns="http://www.w3.org/2000/svg"
   xmlns:sodipodi="http://sodipodi.sourceforge.net/DTD/sodipodi-0.dtd"
   xmlns:inkscape="http://www.inkscape.org/namespaces/inkscape"
   version="1.1"
   x="0px"
   y="0px"
   viewBox="0 0 99.999998 99.5"
   xml:space="preserve"
   id="svg2"
   inkscape:version="0.48.4 r9939"
   width="100%"
   height="100%"
   sodipodi:docname="police.svg"><metadata
     id="metadata24"><rdf:RDF><cc:Work
         rdf:about=""><dc:format>image/svg+xml</dc:format><dc:type
           rdf:resource="http://purl.org/dc/dcmitype/StillImage" /></cc:Work></rdf:RDF></metadata><defs
     id="defs22" /><sodipodi:namedview
     pagecolor="#ffffff"
     bordercolor="#666666"
     borderopacity="1"
     objecttolerance="10"
     gridtolerance="10"
     guidetolerance="10"
     inkscape:pageopacity="0"
     inkscape:pageshadow="2"
     inkscape:window-width="1920"
     inkscape:window-height="1176"
     id="namedview20"
     showgrid="false"
     inkscape:zoom="3.337544"
     inkscape:cx="11.269714"
     inkscape:cy="33.794662"
     inkscape:window-x="0"
     inkscape:window-y="24"
     inkscape:window-maximized="1"
     inkscape:current-layer="svg2"
     fit-margin-top="0"
     fit-margin-left="0"
     fit-margin-right="0"
     fit-margin-bottom="0" /><style
     type="text/css"
     id="style4">
	.st0{fill:#FFFFFF;}
	.st1{fill:#0033A0;}
	.st2{fill:#0099FF;}
	.st3{fill:#FFCD00;}
	.st4{fill:#97D700;}
	.st5{fill:#E40028;}
	.st6{fill:#E6E6E6;}
	.st7{fill:#EA7600;}
	.st8{fill:#007A33;}
	.st9{fill:#981D97;}
</style><path
     transform="matrix(0.88061846,0,0,0.99331668,24.802109,16.986419)"
     d="m 85.392134,32.984024 a 56.778278,50.336414 0 1 1 -113.556557,0 56.778278,50.336414 0 1 1 113.556557,0 z"
     sodipodi:ry="50.336414"
     sodipodi:rx="56.778278"
     sodipodi:cy="32.984024"
     sodipodi:cx="28.613855"
     id="path3823"
     style="fill:#ffffff;fill-opacity:1;fill-rule:nonzero;stroke:none"
     sodipodi:type="arc" /><path
     style="fill:#000080;fill-opacity:1;fill-rule:nonzero;stroke:none"
     d="M 50 -0.25 C 22.385762 -0.25 1.5533243e-16 22.135763 0 49.75 C 0 77.364237 22.385762 99.75 50 99.75 C 77.614238 99.75 100 77.364237 100 49.75 C 100 22.135763 77.614238 -0.25 50 -0.25 z M 49.84375 11.53125 C 51.513222 11.465133 53.214823 12.083896 55 13.40625 C 57.644708 15.38978 60.018778 17.509234 62.53125 19.625 C 68.481842 24.78218 75.104363 27.942117 82.90625 29 C 84.889781 29.26447 86.860219 29.274015 88.84375 29.40625 C 90.033868 29.538485 90.317431 29.918102 89.65625 30.84375 C 88.995073 31.901633 88.074661 32.973366 87.28125 34.03125 L 82.09375 40.375 C 80.639161 42.226296 79.451971 44.213513 79.1875 46.59375 C 77.865146 46.197044 76.541104 45.764472 75.21875 45.5 C 74.557573 45.367765 73.786178 45.257235 73.125 45.125 C 68.761233 44.463822 64.270018 43.795721 59.90625 43.53125 C 54.352363 43.266779 48.772636 43.274014 43.21875 43.40625 C 37.135922 43.538485 31.044343 44.067116 25.09375 45.125 C 22.713514 45.521705 20.341752 46.064808 18.09375 46.59375 C 17.82928 46.59375 17.576971 46.71875 17.3125 46.71875 C 17.048029 45.793103 16.896706 44.738148 16.5 43.8125 C 15.574352 41.696734 14.526634 39.57728 13.46875 37.59375 C 12.543103 36.006924 11.644398 34.40656 10.71875 32.6875 C 10.454279 32.026323 10.163485 31.504927 10.03125 30.84375 C 9.8990144 29.918102 10.168102 29.53125 11.09375 29.53125 C 13.077281 29.399015 14.922719 29.288486 16.90625 29.15625 C 25.898256 28.362838 33.590201 24.885783 39.9375 18.40625 C 41.524325 16.819425 43.093441 15.235839 44.8125 13.78125 C 46.531561 12.326661 48.174278 11.59737 49.84375 11.53125 z M 42.8125 25.40625 L 42.8125 30.71875 L 42.8125 32.15625 C 42.680264 33.610839 43.230602 34.692117 44.15625 35.75 C 45.610839 37.469061 47.57897 38.785867 49.5625 39.84375 C 49.826972 39.975985 50.360529 39.975985 50.625 39.84375 C 52.07959 38.785867 53.677647 37.839133 55 36.78125 C 56.586825 35.458896 57.632235 33.755237 57.5 31.375 L 57.5 30.71875 L 57.5 28.59375 L 57.5 25.40625 L 42.8125 25.40625 z M 47.34375 45.375 C 55.716839 45.238051 65.249449 45.782998 74.96875 47.75 C 76.555574 48.01447 77.990147 48.423029 79.3125 48.6875 C 79.3125 48.6875 77.998002 49.480603 75.75 50.40625 C 66.757995 54.108841 42.845162 62.184743 21.6875 50.8125 C 20.629617 50.151323 19.408869 49.480913 18.21875 48.6875 C 18.21875 48.6875 19.941807 48.278942 22.71875 47.75 C 27.702371 46.857411 36.57835 45.551077 47.34375 45.375 z M 75.90625 52.65625 C 76.567427 55.036487 76.8125 57.417792 76.8125 60.0625 C 76.8125 67.732152 74.046651 74.359599 68.625 79.78125 C 63.20335 85.202901 56.607152 88 48.9375 88 C 41.267847 88 34.640401 85.202901 29.21875 79.78125 C 23.797099 74.359599 21 67.732152 21 60.0625 C 21 57.550027 21.283559 55.310501 21.8125 53.0625 C 42.970162 64.434743 66.914244 56.491076 75.90625 52.65625 z "
     id="path3815" /><rect
     style="fill:none;stroke:none"
     id="rect3120"
     width="99.5"
     height="99.5"
     x="0.249998"
     y="0" /></svg>