<?xml version="1.0" encoding="UTF-8" standalone="no"?>
<!-- Generator: Adobe Illustrator 16.0.0, SVG Export Plug-In . SVG Version: 6.00 Build 0)  -->

<svg
   xmlns:dc="http://purl.org/dc/elements/1.1/"
   xmlns:cc="http://creativecommons.org/ns#"
   xmlns:rdf="http://www.w3.org/1999/02/22-rdf-syntax-ns#"
   xmlns:svg="http://www.w3.org/2000/svg"
   xmlns="http://www.w3.org/2000/svg"
   xmlns:sodipodi="http://sodipodi.sourceforge.net/DTD/sodipodi-0.dtd"
   xmlns:inkscape="http://www.inkscape.org/namespaces/inkscape"
   version="1.1"
   id="Capa_1"
   x="0px"
   y="0px"
   width="100.00001"
   height="100"
   viewBox="0 0 100.00001 100"
   xml:space="preserve"
   inkscape:version="0.48.4 r9939"
   sodipodi:docname="weapon.svg"><metadata
     id="metadata43"><rdf:RDF><cc:Work
         rdf:about=""><dc:format>image/svg+xml</dc:format><dc:type
           rdf:resource="http://purl.org/dc/dcmitype/StillImage" /></cc:Work></rdf:RDF></metadata><defs
     id="defs41" /><sodipodi:namedview
     pagecolor="#ffffff"
     bordercolor="#666666"
     borderopacity="1"
     objecttolerance="10"
     gridtolerance="10"
     guidetolerance="10"
     inkscape:pageopacity="0"
     inkscape:pageshadow="2"
     inkscape:window-width="1920"
     inkscape:window-height="1176"
     id="namedview39"
     showgrid="false"
     fit-margin-top="0"
     fit-margin-left="0"
     fit-margin-right="0"
     fit-margin-bottom="0"
     inkscape:zoom="0.26022658"
     inkscape:cx="-797.88026"
     inkscape:cy="226.75667"
     inkscape:window-x="0"
     inkscape:window-y="24"
     inkscape:window-maximized="1"
     inkscape:current-layer="Capa_1" /><path
     sodipodi:type="arc"
     style="fill:#000000;fill-opacity:1;fill-rule:nonzero;stroke:none"
     id="path3000"
     sodipodi:cx="-1293.4221"
     sodipodi:cy="-3.2563918"
     sodipodi:rx="451.06738"
     sodipodi:ry="413.02557"
     d="m -842.35474,-3.2563918 a 451.06738,413.02557 0 1 1 -902.13476,0 451.06738,413.02557 0 1 1 902.13476,0 z"
     transform="matrix(0.11084819,0,0,0.12105788,193.37351,50.394212)" /><rect
     style="fill:none;stroke:none"
     id="rect3020"
     width="100"
     height="100"
     x="4.9999999e-06"
     y="2.8421709e-14" /><g
     id="g3"
     transform="matrix(0.1323187,0,0,0.1323187,19.999959,19.999977)"
     style="fill:#ffffff"><g
       id="g5"
       style="fill:#ffffff"><path
         d="M 445.304,81.494 H 76.938 c -4.5,0 -8.151,3.649 -8.151,8.149 v 77.906 c 0,4.308 3.386,7.758 7.625,8.045 L 0.552,363.097 c -1.679,4.167 0.603,8.86 5.102,8.86 h 99.703 c 4.496,0 9.514,-3.899 11.193,-8.079 l 32.735,-81.471 c 15.499,9.697 33.732,15.384 53.32,15.384 55.669,0 100.953,-45.284 100.953,-100.953 0,-7.251 -0.806,-14.316 -2.268,-21.139 h 144.006 c 4.505,0 8.155,-3.649 8.155,-8.149 V 89.644 c 0,-4.501 -3.651,-8.15 -8.147,-8.15 z m -242.692,184.9 c -15.521,0 -29.801,-5.138 -41.373,-13.742 l 17.594,-43.785 c 9.303,12.984 19.14,24.514 27.469,29.367 3.116,1.823 6.538,2.692 9.904,2.692 6.763,0 13.341,-3.475 16.981,-9.722 5.464,-9.361 2.347,-21.356 -7.019,-26.81 -4.009,-2.633 -12.7,-13.992 -22.37,-28.695 h 65.068 c 2.124,6.672 3.294,13.767 3.294,21.139 -0.005,38.422 -31.134,69.556 -69.548,69.556 z"
         id="path7"
         inkscape:connector-curvature="0"
         style="fill:#ffffff" /></g></g><g
     id="g9"
     transform="translate(-176.72549,-176.72549)" /><g
     id="g11"
     transform="translate(-176.72549,-176.72549)" /><g
     id="g13"
     transform="translate(-176.72549,-176.72549)" /><g
     id="g15"
     transform="translate(-176.72549,-176.72549)" /><g
     id="g17"
     transform="translate(-176.72549,-176.72549)" /><g
     id="g19"
     transform="translate(-176.72549,-176.72549)" /><g
     id="g21"
     transform="translate(-176.72549,-176.72549)" /><g
     id="g23"
     transform="translate(-176.72549,-176.72549)" /><g
     id="g25"
     transform="translate(-176.72549,-176.72549)" /><g
     id="g27"
     transform="translate(-176.72549,-176.72549)" /><g
     id="g29"
     transform="translate(-176.72549,-176.72549)" /><g
     id="g31"
     transform="translate(-176.72549,-176.72549)" /><g
     id="g33"
     transform="translate(-176.72549,-176.72549)" /><g
     id="g35"
     transform="translate(-176.72549,-176.72549)" /><g
     id="g37"
     transform="translate(-176.72549,-176.72549)" /></svg>