<?xml version="1.0" encoding="UTF-8" standalone="no"?>
<!-- Generator: Adobe Illustrator 19.0.0, SVG Export Plug-In . SVG Version: 6.00 Build 0)  -->

<svg
   xmlns:dc="http://purl.org/dc/elements/1.1/"
   xmlns:cc="http://creativecommons.org/ns#"
   xmlns:rdf="http://www.w3.org/1999/02/22-rdf-syntax-ns#"
   xmlns:svg="http://www.w3.org/2000/svg"
   xmlns="http://www.w3.org/2000/svg"
   xmlns:sodipodi="http://sodipodi.sourceforge.net/DTD/sodipodi-0.dtd"
   xmlns:inkscape="http://www.inkscape.org/namespaces/inkscape"
   version="1.1"
   id="Layer_1"
   x="0px"
   y="0px"
   viewBox="0 0 100 100.00001"
   xml:space="preserve"
   inkscape:version="0.48.4 r9939"
   width="100%"
   height="100%"
   sodipodi:docname="drugs.svg"><metadata
     id="metadata49"><rdf:RDF><cc:Work
         rdf:about=""><dc:format>image/svg+xml</dc:format><dc:type
           rdf:resource="http://purl.org/dc/dcmitype/StillImage" /></cc:Work></rdf:RDF></metadata><defs
     id="defs47" /><sodipodi:namedview
     pagecolor="#ffffff"
     bordercolor="#666666"
     borderopacity="1"
     objecttolerance="10"
     gridtolerance="10"
     guidetolerance="10"
     inkscape:pageopacity="0"
     inkscape:pageshadow="2"
     inkscape:window-width="1920"
     inkscape:window-height="1176"
     id="namedview45"
     showgrid="false"
     fit-margin-top="0"
     fit-margin-left="0"
     fit-margin-right="0"
     fit-margin-bottom="0"
     inkscape:zoom="0.38945313"
     inkscape:cx="-695.93221"
     inkscape:cy="128.38346"
     inkscape:window-x="0"
     inkscape:window-y="24"
     inkscape:window-maximized="1"
     inkscape:current-layer="Layer_1"
     showguides="true"
     inkscape:guide-bbox="true"
     inkscape:object-nodes="true" /><path
     sodipodi:type="arc"
     style="fill:#d40000;fill-opacity:1;fill-rule:nonzero;stroke:none"
     id="path2984"
     sodipodi:cx="-127.54873"
     sodipodi:cy="12.395367"
     sodipodi:rx="38.582355"
     sodipodi:ry="26.326784"
     d="m -88.966373,12.395367 a 38.582355,26.326784 0 1 1 -77.164707,0 38.582355,26.326784 0 1 1 77.164707,0 z"
     transform="matrix(1.2959292,0,0,1.8992066,215.29412,26.458644)" /><path
     sodipodi:type="arc"
     style="fill:#ffffff;fill-opacity:1;fill-rule:nonzero;stroke:none"
     id="path2983"
     sodipodi:cx="-44.483185"
     sodipodi:cy="34.863914"
     sodipodi:rx="24.738098"
     sodipodi:ry="34.27021"
     d="m -19.745087,34.863914 a 24.738098,34.27021 0 1 1 -49.476196,0 24.738098,34.27021 0 1 1 49.476196,0 z"
     transform="matrix(1.6169392,0,0,1.1671945,121.92661,9.3070369)" /><rect
     style="fill:none;stroke:none"
     id="rect3004"
     width="98"
     height="98.000008"
     x="1"
     y="1.0000024" /><path
     style="fill:#d40000;fill-opacity:1;fill-rule:nonzero;stroke:none"
     d="M 40 20 L 40 40 L 20 40 L 20 60 L 40 60 L 40 80 L 60 80 L 60 60 L 80 60 L 80 40 L 60 40 L 60 20 L 40 20 z "
     transform="translate(-1.1853026e-6,0)"
     id="rect2986" /></svg>