<?xml version="1.0" encoding="UTF-8" standalone="no"?>
<!-- Generator: Adobe Illustrator 19.1.0, SVG Export Plug-In . SVG Version: 6.00 Build 0)  -->

<svg
   xmlns:dc="http://purl.org/dc/elements/1.1/"
   xmlns:cc="http://creativecommons.org/ns#"
   xmlns:rdf="http://www.w3.org/1999/02/22-rdf-syntax-ns#"
   xmlns:svg="http://www.w3.org/2000/svg"
   xmlns="http://www.w3.org/2000/svg"
   xmlns:sodipodi="http://sodipodi.sourceforge.net/DTD/sodipodi-0.dtd"
   xmlns:inkscape="http://www.inkscape.org/namespaces/inkscape"
   version="1.1"
   id="Capa_1"
   x="0px"
   y="0px"
   viewBox="0 0 100 100"
   xml:space="preserve"
   inkscape:version="0.48.4 r9939"
   width="100%"
   height="100%"
   sodipodi:docname="victim-triaged.svg"><metadata
     id="metadata52"><rdf:RDF><cc:Work
         rdf:about=""><dc:format>image/svg+xml</dc:format><dc:type
           rdf:resource="http://purl.org/dc/dcmitype/StillImage" /><dc:title /></cc:Work></rdf:RDF></metadata><defs
     id="defs50" /><sodipodi:namedview
     pagecolor="#ffffff"
     bordercolor="#666666"
     borderopacity="1"
     objecttolerance="10"
     gridtolerance="10"
     guidetolerance="10"
     inkscape:pageopacity="0"
     inkscape:pageshadow="2"
     inkscape:window-width="1920"
     inkscape:window-height="1176"
     id="namedview48"
     showgrid="false"
     inkscape:zoom="3.0422344"
     inkscape:cx="118.13959"
     inkscape:cy="45.118313"
     inkscape:window-x="0"
     inkscape:window-y="24"
     inkscape:window-maximized="1"
     inkscape:current-layer="Capa_1"
     inkscape:snap-smooth-nodes="true"
     inkscape:object-nodes="true"
     inkscape:snap-global="false"
     fit-margin-top="0"
     fit-margin-left="0"
     fit-margin-right="0"
     fit-margin-bottom="0" /><rect
     style="fill:none;fill-opacity:1;fill-rule:nonzero;stroke:none"
     id="rect3850"
     width="100"
     height="100"
     x="2.2439376e-06"
     y="0" /><path
     style="fill:#ffd5d5;stroke:none"
     d="m 97.586273,34.976094 c 1.555918,1.555918 2.413726,3.62287 2.413726,5.824426 0,2.199273 -0.857808,4.268507 -2.413726,5.824425 l -9.887606,9.887606 c -1.959727,1.959726 -4.567372,3.038831 -7.339278,3.038831 -2.77419,0 -5.381835,-1.079105 -7.341561,-3.038831 L 62.36367,45.858393 13.38671,94.83558 c -1.482913,1.482913 -3.4517647,2.297375 -5.5460938,2.297375 -2.0943292,0 -4.0654625,-0.814462 -5.5460939,-2.297375 -3.05936307,-3.057081 -3.05936307,-8.032824 0,-11.092187 l 30.8605567,-30.860556 -17.347799,0 0.01141,9.048049 c 0.0046,1.984822 -0.766552,3.851011 -2.169615,5.256356 -1.403064,1.405345 -3.269253,2.178741 -5.256356,2.178741 l -0.1528541,0 c -2.0441382,0 -3.9627992,-0.791647 -5.4046468,-2.226651 -1.439566,-1.437284 -2.23121329,-3.34682 -2.22893189,-5.381832 0.002281,-3.896639 0.004563,-9.025236 0.006844,-13.464849 0,-6.166635 5.01908939,-11.183444 11.18800679,-11.183444 l 21.41098,0 9.038923,-9.038923 -6.926343,-6.926343 -5.044185,5.048747 c -1.412189,1.412189 -3.289785,2.192429 -5.288295,2.192429 0,0 0,0 -0.0023,0 -1.996229,0 -3.873825,-0.777958 -5.286014,-2.190148 l -0.109508,-0.109507 c -1.455536,-1.455536 -2.25859,-3.385604 -2.263153,-5.434305 -0.0023,-2.048701 0.793929,-3.974206 2.24262,-5.422898 2.568862,-2.56658 5.883742,-5.88146 8.854131,-8.849567 4.683723,-4.683723 12.305895,-4.6814416 16.991899,0.00228 l 11.25873,11.258731 c 0.03194,-3.376479 1.366561,-6.679952 3.844167,-9.1598391 5.119471,-5.1194712 13.448878,-5.1194712 18.568349,0 2.479889,2.4798871 3.84645,5.7765161 3.84645,9.2853161 0,3.506518 -1.366561,6.803147 -3.84645,9.283033 -2.477605,2.477606 -5.78336,3.812227 -9.159838,3.846448 l 10.042742,10.042742 5.961311,-5.96131 c 3.212218,-3.212217 8.438915,-3.212217 11.650904,0 z"
     id="path3048"
     inkscape:connector-curvature="0"
     sodipodi:nodetypes="csssssccscscccssscccscccccsssccccccsssccsc" /><path
     inkscape:connector-curvature="0"
     id="path12"
     d="m 97.586271,34.976094 c 1.555917,1.555918 2.413725,3.62287 2.413725,5.824426 0,2.199273 -0.857808,4.268507 -2.413725,5.824425 l -9.887607,9.887606 c -1.959726,1.959726 -4.567371,3.038831 -7.339277,3.038831 -2.774188,0 -5.381833,-1.079105 -7.341559,-3.038831 L 62.36367,45.858393 13.38671,94.83558 c -1.482913,1.482913 -3.4517644,2.297375 -5.5460936,2.297375 -2.0943291,0 -4.0654625,-0.814462 -5.5460938,-2.297375 -3.05936321,-3.057081 -3.05936321,-8.032824 0,-11.092187 l 30.8605564,-30.860556 -17.347799,0 0.01141,9.048049 c 0.0046,1.984822 -0.766552,3.851011 -2.169615,5.256356 -1.403064,1.405345 -3.269253,2.178741 -5.2563558,2.178741 l -0.152854,0 c -2.0441383,0 -3.9627993,-0.791647 -5.4046468,-2.226651 -1.4395661,-1.437284 -2.23121343,-3.34682 -2.22893203,-5.381832 0.002281,-3.896639 0.004563,-9.025236 0.006844,-13.464849 0,-6.166635 5.01908943,-11.183444 11.18800663,-11.183444 l 21.41098,0 9.038923,-9.038923 -6.926343,-6.926344 -5.044185,5.048748 c -1.412189,1.412189 -3.289785,2.192429 -5.288295,2.192429 0,0 0,0 -0.0023,0 -1.996229,0 -3.873825,-0.777958 -5.286014,-2.190148 l -0.109508,-0.109507 c -1.455536,-1.455536 -2.25859,-3.385604 -2.263153,-5.434305 -0.0023,-2.048701 0.793929,-3.974206 2.242621,-5.422898 2.568861,-2.56658 5.883741,-5.8814605 8.85413,-8.8495675 4.683723,-4.683723 12.305895,-4.6814416 16.991899,0.00228 l 11.25873,11.2587305 c 0.03194,-3.376478 1.366561,-6.679952 3.844167,-9.1598385 5.119471,-5.1194713 13.448878,-5.1194713 18.568349,0 2.479887,2.4798865 3.846448,5.7765165 3.846448,9.2853155 0,3.506519 -1.366561,6.803148 -3.846448,9.283034 -2.477605,2.477606 -5.78336,3.812227 -9.159838,3.846448 l 10.042742,10.042742 5.961309,-5.96131 c 3.212217,-3.212217 8.438915,-3.212217 11.650904,0 z m -0.551872,5.824426 c 0,-0.702673 -0.136884,-1.387094 -0.399246,-2.019043 -0.262361,-0.631949 -0.647919,-1.211426 -1.145265,-1.708772 -2.055545,-2.055545 -5.400084,-2.055545 -7.45791,0 l -7.008474,7.008474 c -0.579477,0.579477 -1.519416,0.579477 -2.098892,0 L 64.494729,29.651297 c -0.495064,-0.495065 -0.574913,-1.273024 -0.191638,-1.859345 0.385558,-0.588602 1.129296,-0.825868 1.784059,-0.568069 3.766598,1.47835 8.048794,0.586321 10.907394,-2.272279 3.962799,-3.962799 3.962799,-10.410048 0,-14.375129 -3.9628,-3.9627988 -10.410048,-3.9605174 -14.372848,0 -2.860881,2.860881 -3.75291,7.143077 -2.272278,10.909676 0.255517,0.652481 0.01825,1.396219 -0.56807,1.781777 -0.588602,0.385557 -1.36428,0.305708 -1.861626,-0.191638 L 43.321016,8.4775835 C 39.793965,4.9505324 34.05167,4.948251 30.524619,8.4753021 c -2.970388,2.9703879 -6.285268,6.2852689 -8.85413,8.8518489 -0.887466,0.885185 -1.373405,2.064671 -1.373405,3.319443 0.0023,1.257054 0.497346,2.443384 1.393938,3.342257 l 0.109507,0.109508 c 0.426623,0.426622 0.921688,0.755145 1.46238,0.978722 0.540693,0.223578 1.124733,0.342211 1.729305,0.342211 1.204581,0 2.338439,-0.469969 3.191685,-1.323215 l 6.091349,-6.098193 c 0.27605,-0.278332 0.654763,-0.435749 1.047165,-0.435749 0.394683,0 0.771114,0.157417 1.049446,0.435749 l 9.022954,9.022954 c 0.579476,0.579476 0.579476,1.517133 0,2.09661 L 34.872748,39.639285 c -0.278332,0.278331 -0.654763,0.435748 -1.047165,0.435748 l -22.024677,0 c -4.5331502,0 -8.222181,3.686749 -8.222181,8.217618 -0.00228,4.441895 -0.00456,9.570491 -0.00684,13.46713 -0.00228,1.238802 0.4813763,2.4046 1.3574356,3.278378 0.880622,0.878341 2.0555453,1.361998 3.3103176,1.361998 l 0.1528541,0 c 1.1931745,0 2.3133437,-0.465406 3.1574637,-1.307244 0.841838,-0.84412 1.304963,-1.966571 1.302682,-3.157464 l -0.01369,-10.533244 c 0,-0.394683 0.155136,-0.771114 0.433467,-1.051727 0.278331,-0.278331 0.657044,-0.433467 1.049446,-0.433467 l 22.414797,0 c 0.600009,0 1.140702,0.360462 1.368843,0.914843 0.230422,0.554382 0.102663,1.190893 -0.321678,1.615235 L 4.390905,85.840003 c -1.9004098,1.902691 -1.9004098,4.996276 0,6.898967 0.9216873,0.921687 2.1468014,1.428159 3.4494833,1.428159 1.3026818,0 2.5277957,-0.506472 3.4494837,-1.428159 L 61.314224,42.712336 c 0.579476,-0.579476 1.519415,-0.579476 2.098892,0 l 11.701322,11.701323 c 1.400783,1.400782 3.262408,2.171897 5.244949,2.171897 1.980259,0 3.841885,-0.771115 5.242667,-2.171897 l 9.887606,-9.885325 c 0.99492,-0.994692 1.544739,-2.320188 1.544739,-3.727814 z"
     style="fill:#000000;stroke:none"
     sodipodi:nodetypes="csssssccscscccssscccscccccsssccccccsssccsccssscsssccsccccssscccsssccsssssssccsssccccsscsccsccssscss" /></svg>