<?xml version="1.0" encoding="UTF-8" standalone="no"?>
<!DOCTYPE svg PUBLIC "-//W3C//DTD SVG 1.1//EN"
 "http://www.w3.org/Graphics/SVG/1.1/DTD/svg11.dtd">
<!-- Generated by graphviz version 2.28.0 (20170704.0136)
 -->
<!-- Title: _anonymous_0 Pages: 1 -->
<svg width="683pt" height="1029pt"
 viewBox="0.00 0.00 683.10 1028.92" xmlns="http://www.w3.org/2000/svg" xmlns:xlink="http://www.w3.org/1999/xlink">
<g id="graph1" class="graph" transform="scale(1 1) rotate(0) translate(4 1024.92)">
<title>_anonymous_0</title>
<polygon fill="white" stroke="white" points="-4,5 -4,-1024.92 680.101,-1024.92 680.101,5 -4,5"/>
<!-- wpt_22 -->
<g id="node1" class="node"><title>wpt_22</title>
<ellipse fill="none" stroke="black" cx="291.427" cy="-301.371" rx="39.9593" ry="40.1111"/>
<text text-anchor="middle" x="291.427" y="-297.671" font-family="Times,serif" font-size="14.00">wpt_22</text>
</g>
<!-- wpt_17 -->
<g id="node2" class="node"><title>wpt_17</title>
<ellipse fill="none" stroke="black" cx="409.308" cy="-306.169" rx="39.9593" ry="40.1111"/>
<text text-anchor="middle" x="409.308" y="-302.469" font-family="Times,serif" font-size="14.00">wpt_17</text>
</g>
<!-- wpt_17&#45;&#45;wpt_22 -->
<g id="edge72" class="edge"><title>wpt_17&#45;&#45;wpt_22</title>
<path fill="none" stroke="black" d="M368.74,-304.518C356.885,-304.035 343.929,-303.508 332.07,-303.025"/>
</g>
<!-- wpt_21 -->
<g id="node10" class="node"><title>wpt_21</title>
<ellipse fill="none" stroke="black" cx="335.647" cy="-186.509" rx="39.9593" ry="40.1111"/>
<text text-anchor="middle" x="335.647" y="-182.809" font-family="Times,serif" font-size="14.00">wpt_21</text>
</g>
<!-- wpt_17&#45;&#45;wpt_21 -->
<g id="edge42" class="edge"><title>wpt_17&#45;&#45;wpt_21</title>
<path fill="none" stroke="black" d="M388.2,-271.879C378.422,-255.995 366.823,-237.155 357.014,-221.219"/>
</g>
<!-- wpt_18 -->
<g id="node12" class="node"><title>wpt_18</title>
<ellipse fill="none" stroke="black" cx="318.574" cy="-428" rx="39.9593" ry="40.1111"/>
<text text-anchor="middle" x="318.574" y="-424.3" font-family="Times,serif" font-size="14.00">wpt_18</text>
</g>
<!-- wpt_17&#45;&#45;wpt_18 -->
<g id="edge52" class="edge"><title>wpt_17&#45;&#45;wpt_18</title>
<path fill="none" stroke="black" d="M385.231,-338.498C372.106,-356.121 355.906,-377.873 342.763,-395.52"/>
</g>
<!-- wpt_16 -->
<g id="node3" class="node"><title>wpt_16</title>
<ellipse fill="none" stroke="black" cx="447.151" cy="-169.381" rx="39.9593" ry="40.1111"/>
<text text-anchor="middle" x="447.151" y="-165.681" font-family="Times,serif" font-size="14.00">wpt_16</text>
</g>
<!-- wpt_16&#45;&#45;wpt_17 -->
<g id="edge14" class="edge"><title>wpt_16&#45;&#45;wpt_17</title>
<path fill="none" stroke="black" d="M436.307,-208.579C431.24,-226.895 425.221,-248.649 420.154,-266.965"/>
</g>
<!-- wpt_16&#45;&#45;wpt_21 -->
<g id="edge30" class="edge"><title>wpt_16&#45;&#45;wpt_21</title>
<path fill="none" stroke="black" d="M407.211,-175.516C396.962,-177.091 385.937,-178.784 375.683,-180.359"/>
</g>
<!-- wpt_20 -->
<g id="node13" class="node"><title>wpt_20</title>
<ellipse fill="none" stroke="black" cx="482.219" cy="-40.3051" rx="39.9593" ry="40.1111"/>
<text text-anchor="middle" x="482.219" y="-36.6051" font-family="Times,serif" font-size="14.00">wpt_20</text>
</g>
<!-- wpt_16&#45;&#45;wpt_20 -->
<g id="edge44" class="edge"><title>wpt_16&#45;&#45;wpt_20</title>
<path fill="none" stroke="black" d="M457.768,-130.304C462.162,-114.128 467.247,-95.4112 471.638,-79.2496"/>
</g>
<!-- wpt_15 -->
<g id="node4" class="node"><title>wpt_15</title>
<ellipse fill="none" stroke="black" cx="109.79" cy="-589.326" rx="39.9593" ry="40.1111"/>
<text text-anchor="middle" x="109.79" y="-585.626" font-family="Times,serif" font-size="14.00">wpt_15</text>
</g>
<!-- wpt_19 -->
<g id="node11" class="node"><title>wpt_19</title>
<ellipse fill="none" stroke="black" cx="163.409" cy="-450.578" rx="39.9593" ry="40.1111"/>
<text text-anchor="middle" x="163.409" y="-446.878" font-family="Times,serif" font-size="14.00">wpt_19</text>
</g>
<!-- wpt_15&#45;&#45;wpt_19 -->
<g id="edge16" class="edge"><title>wpt_15&#45;&#45;wpt_19</title>
<path fill="none" stroke="black" d="M124.442,-551.413C132.007,-531.835 141.212,-508.017 148.775,-488.446"/>
</g>
<!-- wpt_14 -->
<g id="node5" class="node"><title>wpt_14</title>
<ellipse fill="none" stroke="black" cx="233.412" cy="-540.227" rx="39.9593" ry="40.1111"/>
<text text-anchor="middle" x="233.412" y="-536.527" font-family="Times,serif" font-size="14.00">wpt_14</text>
</g>
<!-- wpt_14&#45;&#45;wpt_15 -->
<g id="edge38" class="edge"><title>wpt_14&#45;&#45;wpt_15</title>
<path fill="none" stroke="black" d="M195.649,-555.225C180.312,-561.317 162.634,-568.338 147.321,-574.42"/>
</g>
<!-- wpt_14&#45;&#45;wpt_18 -->
<g id="edge48" class="edge"><title>wpt_14&#45;&#45;wpt_18</title>
<path fill="none" stroke="black" d="M257.816,-508.067C269.219,-493.04 282.763,-475.192 294.166,-460.164"/>
</g>
<!-- wpt_13 -->
<g id="node6" class="node"><title>wpt_13</title>
<ellipse fill="none" stroke="black" cx="447.331" cy="-508.05" rx="39.9593" ry="40.1111"/>
<text text-anchor="middle" x="447.331" y="-504.35" font-family="Times,serif" font-size="14.00">wpt_13</text>
</g>
<!-- wpt_13&#45;&#45;wpt_18 -->
<g id="edge36" class="edge"><title>wpt_13&#45;&#45;wpt_18</title>
<path fill="none" stroke="black" d="M412.826,-486.598C394.204,-475.02 371.296,-460.778 352.727,-449.233"/>
</g>
<!-- wpt_12 -->
<g id="node7" class="node"><title>wpt_12</title>
<ellipse fill="none" stroke="black" cx="556.824" cy="-354.227" rx="39.9593" ry="40.1111"/>
<text text-anchor="middle" x="556.824" y="-350.527" font-family="Times,serif" font-size="14.00">wpt_12</text>
</g>
<!-- wpt_12&#45;&#45;wpt_17 -->
<g id="edge10" class="edge"><title>wpt_12&#45;&#45;wpt_17</title>
<path fill="none" stroke="black" d="M518.451,-341.725C496.682,-334.634 469.524,-325.786 447.745,-318.691"/>
</g>
<!-- wpt_11 -->
<g id="node8" class="node"><title>wpt_11</title>
<ellipse fill="none" stroke="black" cx="40.1525" cy="-717.14" rx="39.9593" ry="40.1111"/>
<text text-anchor="middle" x="40.1525" y="-713.44" font-family="Times,serif" font-size="14.00">wpt_11</text>
</g>
<!-- wpt_11&#45;&#45;wpt_15 -->
<g id="edge28" class="edge"><title>wpt_11&#45;&#45;wpt_15</title>
<path fill="none" stroke="black" d="M59.5504,-681.537C69.2091,-663.809 80.8517,-642.44 90.496,-624.739"/>
</g>
<!-- wpt_10 -->
<g id="node9" class="node"><title>wpt_10</title>
<ellipse fill="none" stroke="black" cx="213.392" cy="-670.62" rx="39.9593" ry="40.1111"/>
<text text-anchor="middle" x="213.392" y="-666.92" font-family="Times,serif" font-size="14.00">wpt_10</text>
</g>
<!-- wpt_10&#45;&#45;wpt_15 -->
<g id="edge62" class="edge"><title>wpt_10&#45;&#45;wpt_15</title>
<path fill="none" stroke="black" d="M181.463,-645.566C168.74,-635.582 154.131,-624.119 141.436,-614.158"/>
</g>
<!-- wpt_10&#45;&#45;wpt_14 -->
<g id="edge34" class="edge"><title>wpt_10&#45;&#45;wpt_14</title>
<path fill="none" stroke="black" d="M219.562,-630.434C221.998,-614.57 224.791,-596.378 227.228,-580.505"/>
</g>
<!-- wpt_21&#45;&#45;wpt_22 -->
<g id="edge46" class="edge"><title>wpt_21&#45;&#45;wpt_22</title>
<path fill="none" stroke="black" d="M321.168,-224.119C316.281,-236.812 310.828,-250.977 305.939,-263.676"/>
</g>
<!-- wpt_18&#45;&#45;wpt_22 -->
<g id="edge40" class="edge"><title>wpt_18&#45;&#45;wpt_22</title>
<path fill="none" stroke="black" d="M310.059,-388.281C306.825,-373.195 303.144,-356.022 299.912,-340.949"/>
</g>
<!-- wpt_18&#45;&#45;wpt_19 -->
<g id="edge20" class="edge"><title>wpt_18&#45;&#45;wpt_19</title>
<path fill="none" stroke="black" d="M278.615,-433.814C255.449,-437.185 226.376,-441.416 203.233,-444.783"/>
</g>
<!-- wpt_08 -->
<g id="node14" class="node"><title>wpt_08</title>
<ellipse fill="none" stroke="black" cx="634.948" cy="-484.858" rx="39.9593" ry="40.1111"/>
<text text-anchor="middle" x="634.948" y="-481.158" font-family="Times,serif" font-size="14.00">wpt_08</text>
</g>
<!-- wpt_08&#45;&#45;wpt_12 -->
<g id="edge58" class="edge"><title>wpt_08&#45;&#45;wpt_12</title>
<path fill="none" stroke="black" d="M614.217,-450.194C602.916,-431.298 588.968,-407.974 577.651,-389.052"/>
</g>
<!-- wpt_09 -->
<g id="node15" class="node"><title>wpt_09</title>
<ellipse fill="none" stroke="black" cx="555.979" cy="-607.903" rx="39.9593" ry="40.1111"/>
<text text-anchor="middle" x="555.979" y="-604.203" font-family="Times,serif" font-size="14.00">wpt_09</text>
</g>
<!-- wpt_08&#45;&#45;wpt_09 -->
<g id="edge22" class="edge"><title>wpt_08&#45;&#45;wpt_09</title>
<path fill="none" stroke="black" d="M613.16,-518.806C602.204,-535.879 588.955,-556.522 577.97,-573.638"/>
</g>
<!-- wpt_09&#45;&#45;wpt_13 -->
<g id="edge70" class="edge"><title>wpt_09&#45;&#45;wpt_13</title>
<path fill="none" stroke="black" d="M526.291,-580.618C510.96,-566.528 492.309,-549.387 476.983,-535.302"/>
</g>
<!-- wpt_00 -->
<g id="node16" class="node"><title>wpt_00</title>
<ellipse fill="none" stroke="black" cx="485.689" cy="-890.385" rx="39.9593" ry="40.1111"/>
<text text-anchor="middle" x="485.689" y="-886.685" font-family="Times,serif" font-size="14.00">wpt_00</text>
</g>
<!-- wpt_01 -->
<g id="node17" class="node"><title>wpt_01</title>
<ellipse fill="none" stroke="black" cx="338.372" cy="-917.86" rx="39.9593" ry="40.1111"/>
<text text-anchor="middle" x="338.372" y="-914.16" font-family="Times,serif" font-size="14.00">wpt_01</text>
</g>
<!-- wpt_00&#45;&#45;wpt_01 -->
<g id="edge6" class="edge"><title>wpt_00&#45;&#45;wpt_01</title>
<path fill="none" stroke="black" d="M445.823,-897.82C424.776,-901.745 399.029,-906.547 378.015,-910.467"/>
</g>
<!-- wpt_04 -->
<g id="node20" class="node"><title>wpt_04</title>
<ellipse fill="none" stroke="black" cx="525.91" cy="-755.171" rx="39.9593" ry="40.1111"/>
<text text-anchor="middle" x="525.91" y="-751.471" font-family="Times,serif" font-size="14.00">wpt_04</text>
</g>
<!-- wpt_00&#45;&#45;wpt_04 -->
<g id="edge54" class="edge"><title>wpt_00&#45;&#45;wpt_04</title>
<path fill="none" stroke="black" d="M497.215,-851.638C502.601,-833.533 508.997,-812.029 514.383,-793.924"/>
</g>
<!-- wpt_05 -->
<g id="node21" class="node"><title>wpt_05</title>
<ellipse fill="none" stroke="black" cx="400.333" cy="-822.47" rx="39.9593" ry="40.1111"/>
<text text-anchor="middle" x="400.333" y="-818.77" font-family="Times,serif" font-size="14.00">wpt_05</text>
</g>
<!-- wpt_00&#45;&#45;wpt_05 -->
<g id="edge2" class="edge"><title>wpt_00&#45;&#45;wpt_05</title>
<path fill="none" stroke="black" d="M453.906,-865.096C446.796,-859.439 439.254,-853.438 432.143,-847.78"/>
</g>
<!-- wpt_02 -->
<g id="node18" class="node"><title>wpt_02</title>
<ellipse fill="none" stroke="black" cx="205.623" cy="-931.906" rx="39.9593" ry="40.1111"/>
<text text-anchor="middle" x="205.623" y="-928.206" font-family="Times,serif" font-size="14.00">wpt_02</text>
</g>
<!-- wpt_01&#45;&#45;wpt_02 -->
<g id="edge50" class="edge"><title>wpt_01&#45;&#45;wpt_02</title>
<path fill="none" stroke="black" d="M298.183,-922.113C281.7,-923.857 262.65,-925.872 246.134,-927.62"/>
</g>
<!-- wpt_01&#45;&#45;wpt_05 -->
<g id="edge4" class="edge"><title>wpt_01&#45;&#45;wpt_05</title>
<path fill="none" stroke="black" d="M360.392,-883.96C366.235,-874.964 372.544,-865.251 378.384,-856.26"/>
</g>
<!-- wpt_06 -->
<g id="node22" class="node"><title>wpt_06</title>
<ellipse fill="none" stroke="black" cx="254.753" cy="-809.921" rx="39.9593" ry="40.1111"/>
<text text-anchor="middle" x="254.753" y="-806.221" font-family="Times,serif" font-size="14.00">wpt_06</text>
</g>
<!-- wpt_01&#45;&#45;wpt_06 -->
<g id="edge32" class="edge"><title>wpt_01&#45;&#45;wpt_06</title>
<path fill="none" stroke="black" d="M313.51,-885.767C302.823,-871.971 290.357,-855.879 279.664,-842.077"/>
</g>
<!-- wpt_03 -->
<g id="node19" class="node"><title>wpt_03</title>
<ellipse fill="none" stroke="black" cx="83.6001" cy="-980.612" rx="39.9593" ry="40.1111"/>
<text text-anchor="middle" x="83.6001" y="-976.912" font-family="Times,serif" font-size="14.00">wpt_03</text>
</g>
<!-- wpt_02&#45;&#45;wpt_03 -->
<g id="edge68" class="edge"><title>wpt_02&#45;&#45;wpt_03</title>
<path fill="none" stroke="black" d="M168.017,-946.917C153.171,-952.843 136.147,-959.638 121.293,-965.567"/>
</g>
<!-- wpt_02&#45;&#45;wpt_06 -->
<g id="edge60" class="edge"><title>wpt_02&#45;&#45;wpt_06</title>
<path fill="none" stroke="black" d="M220.765,-894.311C226.742,-879.47 233.597,-862.451 239.577,-847.602"/>
</g>
<!-- wpt_07 -->
<g id="node23" class="node"><title>wpt_07</title>
<ellipse fill="none" stroke="black" cx="112.826" cy="-848.979" rx="39.9593" ry="40.1111"/>
<text text-anchor="middle" x="112.826" y="-845.279" font-family="Times,serif" font-size="14.00">wpt_07</text>
</g>
<!-- wpt_02&#45;&#45;wpt_07 -->
<g id="edge64" class="edge"><title>wpt_02&#45;&#45;wpt_07</title>
<path fill="none" stroke="black" d="M175.495,-904.982C165.122,-895.713 153.507,-885.333 143.121,-876.052"/>
</g>
<!-- wpt_03&#45;&#45;wpt_07 -->
<g id="edge66" class="edge"><title>wpt_03&#45;&#45;wpt_07</title>
<path fill="none" stroke="black" d="M92.3689,-941.118C96.068,-924.457 100.365,-905.103 104.064,-888.445"/>
</g>
<!-- wpt_04&#45;&#45;wpt_09 -->
<g id="edge12" class="edge"><title>wpt_04&#45;&#45;wpt_09</title>
<path fill="none" stroke="black" d="M534.047,-715.318C538.343,-694.278 543.599,-668.539 547.888,-647.532"/>
</g>
<!-- wpt_04&#45;&#45;wpt_05 -->
<g id="edge26" class="edge"><title>wpt_04&#45;&#45;wpt_05</title>
<path fill="none" stroke="black" d="M490.261,-774.276C473.293,-783.37 453.051,-794.218 436.072,-803.317"/>
</g>
<!-- wpt_05&#45;&#45;wpt_06 -->
<g id="edge56" class="edge"><title>wpt_05&#45;&#45;wpt_06</title>
<path fill="none" stroke="black" d="M360.167,-819.008C339.8,-817.252 315.136,-815.126 294.788,-813.372"/>
</g>
<!-- wpt_06&#45;&#45;wpt_10 -->
<g id="edge18" class="edge"><title>wpt_06&#45;&#45;wpt_10</title>
<path fill="none" stroke="black" d="M243.232,-771.118C237.543,-751.958 230.695,-728.895 224.995,-709.698"/>
</g>
<!-- wpt_06&#45;&#45;wpt_07 -->
<g id="edge8" class="edge"><title>wpt_06&#45;&#45;wpt_07</title>
<path fill="none" stroke="black" d="M215.971,-820.594C195.945,-826.105 171.581,-832.81 151.562,-838.319"/>
</g>
<!-- wpt_07&#45;&#45;wpt_11 -->
<g id="edge24" class="edge"><title>wpt_07&#45;&#45;wpt_11</title>
<path fill="none" stroke="black" d="M93.3512,-813.649C82.9241,-794.733 70.1168,-771.499 59.6816,-752.568"/>
</g>
</g>
</svg>
