<?xml version="1.0" encoding="UTF-8" standalone="no"?>
<!DOCTYPE svg PUBLIC "-//W3C//DTD SVG 1.1//EN"
 "http://www.w3.org/Graphics/SVG/1.1/DTD/svg11.dtd">
<!-- Generated by graphviz version 2.28.0 (20170704.0136)
 -->
<!-- Title: _anonymous_0 Pages: 1 -->
<svg width="1074pt" height="609pt"
 viewBox="0.00 0.00 1074.49 608.53" xmlns="http://www.w3.org/2000/svg" xmlns:xlink="http://www.w3.org/1999/xlink">
<g id="graph1" class="graph" transform="scale(1 1) rotate(0) translate(4 604.525)">
<title>_anonymous_0</title>
<polygon fill="white" stroke="white" points="-4,5 -4,-604.525 1071.49,-604.525 1071.49,5 -4,5"/>
<!-- wpt_17 -->
<g id="node1" class="node"><title>wpt_17</title>
<ellipse fill="none" stroke="black" cx="160.586" cy="-179.494" rx="39.9593" ry="40.1111"/>
<text text-anchor="middle" x="160.586" y="-175.794" font-family="Times,serif" font-size="14.00">wpt_17</text>
</g>
<!-- wpt_21 -->
<g id="node9" class="node"><title>wpt_21</title>
<ellipse fill="none" stroke="black" cx="40.1525" cy="-233.173" rx="39.9593" ry="40.1111"/>
<text text-anchor="middle" x="40.1525" y="-229.473" font-family="Times,serif" font-size="14.00">wpt_21</text>
</g>
<!-- wpt_17&#45;&#45;wpt_21 -->
<g id="edge36" class="edge"><title>wpt_17&#45;&#45;wpt_21</title>
<path fill="none" stroke="black" d="M123.469,-196.038C108.817,-202.568 92.0144,-210.058 77.354,-216.592"/>
</g>
<!-- wpt_18 -->
<g id="node11" class="node"><title>wpt_18</title>
<ellipse fill="none" stroke="black" cx="133.904" cy="-41.2163" rx="39.9593" ry="40.1111"/>
<text text-anchor="middle" x="133.904" y="-37.5163" font-family="Times,serif" font-size="14.00">wpt_18</text>
</g>
<!-- wpt_17&#45;&#45;wpt_18 -->
<g id="edge44" class="edge"><title>wpt_17&#45;&#45;wpt_18</title>
<path fill="none" stroke="black" d="M152.94,-139.869C149.367,-121.354 145.124,-99.3628 141.551,-80.847"/>
</g>
<!-- wpt_16 -->
<g id="node2" class="node"><title>wpt_16</title>
<ellipse fill="none" stroke="black" cx="164.357" cy="-295.445" rx="39.9593" ry="40.1111"/>
<text text-anchor="middle" x="164.357" y="-291.745" font-family="Times,serif" font-size="14.00">wpt_16</text>
</g>
<!-- wpt_16&#45;&#45;wpt_17 -->
<g id="edge16" class="edge"><title>wpt_16&#45;&#45;wpt_17</title>
<path fill="none" stroke="black" d="M163.038,-254.891C162.668,-243.528 162.267,-231.18 161.898,-219.829"/>
</g>
<!-- wpt_16&#45;&#45;wpt_21 -->
<g id="edge24" class="edge"><title>wpt_16&#45;&#45;wpt_21</title>
<path fill="none" stroke="black" d="M128.432,-277.433C112.097,-269.243 92.8041,-259.571 76.4272,-251.36"/>
</g>
<!-- wpt_20 -->
<g id="node12" class="node"><title>wpt_20</title>
<ellipse fill="none" stroke="black" cx="82.904" cy="-409.908" rx="39.9593" ry="40.1111"/>
<text text-anchor="middle" x="82.904" y="-406.208" font-family="Times,serif" font-size="14.00">wpt_20</text>
</g>
<!-- wpt_16&#45;&#45;wpt_20 -->
<g id="edge40" class="edge"><title>wpt_16&#45;&#45;wpt_20</title>
<path fill="none" stroke="black" d="M141.016,-328.245C130.203,-343.44 117.379,-361.462 106.531,-376.706"/>
</g>
<!-- wpt_15 -->
<g id="node3" class="node"><title>wpt_15</title>
<ellipse fill="none" stroke="black" cx="958.093" cy="-142.011" rx="39.9593" ry="40.1111"/>
<text text-anchor="middle" x="958.093" y="-138.311" font-family="Times,serif" font-size="14.00">wpt_15</text>
</g>
<!-- wpt_19 -->
<g id="node10" class="node"><title>wpt_19</title>
<ellipse fill="none" stroke="black" cx="882.501" cy="-40.3051" rx="39.9593" ry="40.1111"/>
<text text-anchor="middle" x="882.501" y="-36.6051" font-family="Times,serif" font-size="14.00">wpt_19</text>
</g>
<!-- wpt_15&#45;&#45;wpt_19 -->
<g id="edge18" class="edge"><title>wpt_15&#45;&#45;wpt_19</title>
<path fill="none" stroke="black" d="M933.967,-109.551C925.239,-97.8075 915.387,-84.552 906.657,-72.8054"/>
</g>
<!-- wpt_14 -->
<g id="node4" class="node"><title>wpt_14</title>
<ellipse fill="none" stroke="black" cx="811.884" cy="-149.582" rx="39.9593" ry="40.1111"/>
<text text-anchor="middle" x="811.884" y="-145.882" font-family="Times,serif" font-size="14.00">wpt_14</text>
</g>
<!-- wpt_14&#45;&#45;wpt_15 -->
<g id="edge20" class="edge"><title>wpt_14&#45;&#45;wpt_15</title>
<path fill="none" stroke="black" d="M852.223,-147.493C872.678,-146.434 897.449,-145.151 917.885,-144.093"/>
</g>
<!-- wpt_14&#45;&#45;wpt_19 -->
<g id="edge56" class="edge"><title>wpt_14&#45;&#45;wpt_19</title>
<path fill="none" stroke="black" d="M833.841,-115.605C842.343,-102.448 852.057,-87.4162 860.558,-74.261"/>
</g>
<!-- wpt_13 -->
<g id="node5" class="node"><title>wpt_13</title>
<ellipse fill="none" stroke="black" cx="267.603" cy="-64.0527" rx="39.9593" ry="40.1111"/>
<text text-anchor="middle" x="267.603" y="-60.3527" font-family="Times,serif" font-size="14.00">wpt_13</text>
</g>
<!-- wpt_13&#45;&#45;wpt_18 -->
<g id="edge30" class="edge"><title>wpt_13&#45;&#45;wpt_18</title>
<path fill="none" stroke="black" d="M227.851,-57.2628C210.763,-54.3441 190.831,-50.9396 173.734,-48.0194"/>
</g>
<!-- wpt_12 -->
<g id="node6" class="node"><title>wpt_12</title>
<ellipse fill="none" stroke="black" cx="288.982" cy="-216.566" rx="39.9593" ry="40.1111"/>
<text text-anchor="middle" x="288.982" y="-212.866" font-family="Times,serif" font-size="14.00">wpt_12</text>
</g>
<!-- wpt_12&#45;&#45;wpt_17 -->
<g id="edge12" class="edge"><title>wpt_12&#45;&#45;wpt_17</title>
<path fill="none" stroke="black" d="M250.111,-205.343C234.02,-200.697 215.402,-195.321 199.325,-190.679"/>
</g>
<!-- wpt_12&#45;&#45;wpt_16 -->
<g id="edge38" class="edge"><title>wpt_12&#45;&#45;wpt_16</title>
<path fill="none" stroke="black" d="M254.928,-238.12C237.343,-249.25 215.949,-262.791 198.37,-273.917"/>
</g>
<!-- wpt_12&#45;&#45;wpt_13 -->
<g id="edge32" class="edge"><title>wpt_12&#45;&#45;wpt_13</title>
<path fill="none" stroke="black" d="M283.365,-176.495C280.235,-154.166 276.349,-126.449 273.22,-104.121"/>
</g>
<!-- wpt_11 -->
<g id="node7" class="node"><title>wpt_11</title>
<ellipse fill="none" stroke="black" cx="1026.34" cy="-289.653" rx="39.9593" ry="40.1111"/>
<text text-anchor="middle" x="1026.34" y="-285.953" font-family="Times,serif" font-size="14.00">wpt_11</text>
</g>
<!-- wpt_11&#45;&#45;wpt_15 -->
<g id="edge54" class="edge"><title>wpt_11&#45;&#45;wpt_15</title>
<path fill="none" stroke="black" d="M1009.29,-252.777C998.831,-230.143 985.483,-201.266 975.039,-178.672"/>
</g>
<!-- wpt_10 -->
<g id="node8" class="node"><title>wpt_10</title>
<ellipse fill="none" stroke="black" cx="933.904" cy="-217.887" rx="39.9593" ry="40.1111"/>
<text text-anchor="middle" x="933.904" y="-214.187" font-family="Times,serif" font-size="14.00">wpt_10</text>
</g>
<!-- wpt_10&#45;&#45;wpt_15 -->
<g id="edge64" class="edge"><title>wpt_10&#45;&#45;wpt_15</title>
<path fill="none" stroke="black" d="M946.282,-179.06C946.329,-178.914 946.375,-178.768 946.421,-178.622"/>
</g>
<!-- wpt_10&#45;&#45;wpt_14 -->
<g id="edge42" class="edge"><title>wpt_10&#45;&#45;wpt_14</title>
<path fill="none" stroke="black" d="M898.611,-198.131C882.422,-189.068 863.277,-178.351 847.098,-169.294"/>
</g>
<!-- wpt_10&#45;&#45;wpt_11 -->
<g id="edge6" class="edge"><title>wpt_10&#45;&#45;wpt_11</title>
<path fill="none" stroke="black" d="M965.715,-242.585C975.011,-249.802 985.17,-257.69 994.47,-264.91"/>
</g>
<!-- wpt_08 -->
<g id="node13" class="node"><title>wpt_08</title>
<ellipse fill="none" stroke="black" cx="424.215" cy="-260.343" rx="39.9593" ry="40.1111"/>
<text text-anchor="middle" x="424.215" y="-256.643" font-family="Times,serif" font-size="14.00">wpt_08</text>
</g>
<!-- wpt_08&#45;&#45;wpt_12 -->
<g id="edge52" class="edge"><title>wpt_08&#45;&#45;wpt_12</title>
<path fill="none" stroke="black" d="M385.824,-247.915C367.552,-242 345.753,-234.944 327.468,-229.025"/>
</g>
<!-- wpt_09 -->
<g id="node14" class="node"><title>wpt_09</title>
<ellipse fill="none" stroke="black" cx="692.877" cy="-242.049" rx="39.9593" ry="40.1111"/>
<text text-anchor="middle" x="692.877" y="-238.349" font-family="Times,serif" font-size="14.00">wpt_09</text>
</g>
<!-- wpt_09&#45;&#45;wpt_14 -->
<g id="edge22" class="edge"><title>wpt_09&#45;&#45;wpt_14</title>
<path fill="none" stroke="black" d="M724.769,-217.269C741.844,-204.002 762.816,-187.707 779.904,-174.43"/>
</g>
<!-- wpt_00 -->
<g id="node15" class="node"><title>wpt_00</title>
<ellipse fill="none" stroke="black" cx="598.924" cy="-456.449" rx="39.9593" ry="40.1111"/>
<text text-anchor="middle" x="598.924" y="-452.749" font-family="Times,serif" font-size="14.00">wpt_00</text>
</g>
<!-- wpt_01 -->
<g id="node16" class="node"><title>wpt_01</title>
<ellipse fill="none" stroke="black" cx="735.27" cy="-508.65" rx="39.9593" ry="40.1111"/>
<text text-anchor="middle" x="735.27" y="-504.95" font-family="Times,serif" font-size="14.00">wpt_01</text>
</g>
<!-- wpt_00&#45;&#45;wpt_01 -->
<g id="edge8" class="edge"><title>wpt_00&#45;&#45;wpt_01</title>
<path fill="none" stroke="black" d="M636.904,-470.99C655.815,-478.23 678.611,-486.958 697.494,-494.187"/>
</g>
<!-- wpt_04 -->
<g id="node19" class="node"><title>wpt_04</title>
<ellipse fill="none" stroke="black" cx="559.103" cy="-303.554" rx="39.9593" ry="40.1111"/>
<text text-anchor="middle" x="559.103" y="-299.854" font-family="Times,serif" font-size="14.00">wpt_04</text>
</g>
<!-- wpt_00&#45;&#45;wpt_04 -->
<g id="edge50" class="edge"><title>wpt_00&#45;&#45;wpt_04</title>
<path fill="none" stroke="black" d="M588.669,-417.075C582.724,-394.247 575.263,-365.6 569.323,-342.795"/>
</g>
<!-- wpt_02 -->
<g id="node17" class="node"><title>wpt_02</title>
<ellipse fill="none" stroke="black" cx="882.096" cy="-551.368" rx="39.9593" ry="40.1111"/>
<text text-anchor="middle" x="882.096" y="-547.668" font-family="Times,serif" font-size="14.00">wpt_02</text>
</g>
<!-- wpt_01&#45;&#45;wpt_02 -->
<g id="edge34" class="edge"><title>wpt_01&#45;&#45;wpt_02</title>
<path fill="none" stroke="black" d="M773.847,-519.874C795.258,-526.103 821.816,-533.83 843.267,-540.071"/>
</g>
<!-- wpt_05 -->
<g id="node20" class="node"><title>wpt_05</title>
<ellipse fill="none" stroke="black" cx="743.89" cy="-376.587" rx="39.9593" ry="40.1111"/>
<text text-anchor="middle" x="743.89" y="-372.887" font-family="Times,serif" font-size="14.00">wpt_05</text>
</g>
<!-- wpt_01&#45;&#45;wpt_05 -->
<g id="edge4" class="edge"><title>wpt_01&#45;&#45;wpt_05</title>
<path fill="none" stroke="black" d="M737.903,-468.309C738.963,-452.076 740.182,-433.389 741.243,-417.136"/>
</g>
<!-- wpt_06 -->
<g id="node21" class="node"><title>wpt_06</title>
<ellipse fill="none" stroke="black" cx="844.573" cy="-448.735" rx="39.9593" ry="40.1111"/>
<text text-anchor="middle" x="844.573" y="-445.035" font-family="Times,serif" font-size="14.00">wpt_06</text>
</g>
<!-- wpt_01&#45;&#45;wpt_06 -->
<g id="edge26" class="edge"><title>wpt_01&#45;&#45;wpt_06</title>
<path fill="none" stroke="black" d="M770.758,-489.197C782.976,-482.5 796.657,-475.001 808.89,-468.295"/>
</g>
<!-- wpt_03 -->
<g id="node18" class="node"><title>wpt_03</title>
<ellipse fill="none" stroke="black" cx="1011.14" cy="-560.22" rx="39.9593" ry="40.1111"/>
<text text-anchor="middle" x="1011.14" y="-556.52" font-family="Times,serif" font-size="14.00">wpt_03</text>
</g>
<!-- wpt_02&#45;&#45;wpt_03 -->
<g id="edge2" class="edge"><title>wpt_02&#45;&#45;wpt_03</title>
<path fill="none" stroke="black" d="M922.219,-554.121C937.608,-555.176 955.168,-556.381 970.596,-557.439"/>
</g>
<!-- wpt_07 -->
<g id="node22" class="node"><title>wpt_07</title>
<ellipse fill="none" stroke="black" cx="980.527" cy="-436.007" rx="39.9593" ry="40.1111"/>
<text text-anchor="middle" x="980.527" y="-432.307" font-family="Times,serif" font-size="14.00">wpt_07</text>
</g>
<!-- wpt_02&#45;&#45;wpt_07 -->
<g id="edge58" class="edge"><title>wpt_02&#45;&#45;wpt_07</title>
<path fill="none" stroke="black" d="M908.474,-520.454C922.597,-503.902 939.943,-483.572 954.077,-467.007"/>
</g>
<!-- wpt_03&#45;&#45;wpt_07 -->
<g id="edge60" class="edge"><title>wpt_03&#45;&#45;wpt_07</title>
<path fill="none" stroke="black" d="M1001.45,-520.918C997.88,-506.419 993.832,-489.994 990.255,-475.479"/>
</g>
<!-- wpt_04&#45;&#45;wpt_08 -->
<g id="edge46" class="edge"><title>wpt_04&#45;&#45;wpt_08</title>
<path fill="none" stroke="black" d="M520.81,-291.287C502.584,-285.449 480.841,-278.483 462.603,-272.64"/>
</g>
<!-- wpt_04&#45;&#45;wpt_09 -->
<g id="edge14" class="edge"><title>wpt_04&#45;&#45;wpt_09</title>
<path fill="none" stroke="black" d="M595.657,-286.748C614.533,-278.069 637.498,-267.511 656.367,-258.835"/>
</g>
<!-- wpt_05&#45;&#45;wpt_09 -->
<g id="edge28" class="edge"><title>wpt_05&#45;&#45;wpt_09</title>
<path fill="none" stroke="black" d="M729.544,-338.752C722.589,-320.41 714.256,-298.431 707.292,-280.065"/>
</g>
<!-- wpt_05&#45;&#45;wpt_06 -->
<g id="edge48" class="edge"><title>wpt_05&#45;&#45;wpt_06</title>
<path fill="none" stroke="black" d="M776.579,-400.011C787.833,-408.076 800.435,-417.106 811.704,-425.181"/>
</g>
<!-- wpt_06&#45;&#45;wpt_07 -->
<g id="edge10" class="edge"><title>wpt_06&#45;&#45;wpt_07</title>
<path fill="none" stroke="black" d="M884.629,-444.985C902.174,-443.342 922.723,-441.419 940.289,-439.774"/>
</g>
<!-- wpt_07&#45;&#45;wpt_11 -->
<g id="edge62" class="edge"><title>wpt_07&#45;&#45;wpt_11</title>
<path fill="none" stroke="black" d="M992.564,-397.554C999.244,-376.212 1007.53,-349.739 1014.22,-328.357"/>
</g>
</g>
</svg>
