<?xml version="1.0" encoding="UTF-8" standalone="no"?>
<!DOCTYPE svg PUBLIC "-//W3C//DTD SVG 1.1//EN"
 "http://www.w3.org/Graphics/SVG/1.1/DTD/svg11.dtd">
<!-- Generated by graphviz version 2.28.0 (20170704.0136)
 -->
<!-- Title: _anonymous_0 Pages: 1 -->
<svg width="1219pt" height="601pt"
 viewBox="0.00 0.00 1218.59 600.59" xmlns="http://www.w3.org/2000/svg" xmlns:xlink="http://www.w3.org/1999/xlink">
<g id="graph1" class="graph" transform="scale(1 1) rotate(0) translate(4 596.586)">
<title>_anonymous_0</title>
<polygon fill="white" stroke="white" points="-4,5 -4,-596.586 1215.59,-596.586 1215.59,5 -4,5"/>
<!-- wpt_08 -->
<g id="node1" class="node"><title>wpt_08</title>
<ellipse fill="none" stroke="black" cx="255.519" cy="-197.29" rx="39.9593" ry="40.1111"/>
<text text-anchor="middle" x="255.519" y="-193.59" font-family="Times,serif" font-size="14.00">wpt_08</text>
</g>
<!-- wpt_12 -->
<g id="node16" class="node"><title>wpt_12</title>
<ellipse fill="none" stroke="black" cx="294.108" cy="-344.401" rx="39.9593" ry="40.1111"/>
<text text-anchor="middle" x="294.108" y="-340.701" font-family="Times,serif" font-size="14.00">wpt_12</text>
</g>
<!-- wpt_08&#45;&#45;wpt_12 -->
<g id="edge2" class="edge"><title>wpt_08&#45;&#45;wpt_12</title>
<path fill="none" stroke="black" d="M265.759,-236.327C271.341,-257.607 278.23,-283.873 283.82,-305.182"/>
</g>
<!-- wpt_09 -->
<g id="node2" class="node"><title>wpt_09</title>
<ellipse fill="none" stroke="black" cx="539.451" cy="-320.852" rx="39.9593" ry="40.1111"/>
<text text-anchor="middle" x="539.451" y="-317.152" font-family="Times,serif" font-size="14.00">wpt_09</text>
</g>
<!-- wpt_14 -->
<g id="node14" class="node"><title>wpt_14</title>
<ellipse fill="none" stroke="black" cx="582.003" cy="-405.805" rx="39.9593" ry="40.1111"/>
<text text-anchor="middle" x="582.003" y="-402.105" font-family="Times,serif" font-size="14.00">wpt_14</text>
</g>
<!-- wpt_09&#45;&#45;wpt_14 -->
<g id="edge22" class="edge"><title>wpt_09&#45;&#45;wpt_14</title>
<path fill="none" stroke="black" d="M557.744,-357.373C559.771,-361.42 561.835,-365.541 563.861,-369.585"/>
</g>
<!-- wpt_13 -->
<g id="node15" class="node"><title>wpt_13</title>
<ellipse fill="none" stroke="black" cx="431.354" cy="-414.378" rx="39.9593" ry="40.1111"/>
<text text-anchor="middle" x="431.354" y="-410.678" font-family="Times,serif" font-size="14.00">wpt_13</text>
</g>
<!-- wpt_09&#45;&#45;wpt_13 -->
<g id="edge46" class="edge"><title>wpt_09&#45;&#45;wpt_13</title>
<path fill="none" stroke="black" d="M508.764,-347.403C494.158,-360.04 476.733,-375.115 462.118,-387.761"/>
</g>
<!-- wpt_10 -->
<g id="node18" class="node"><title>wpt_10</title>
<ellipse fill="none" stroke="black" cx="666.528" cy="-275.716" rx="39.9593" ry="40.1111"/>
<text text-anchor="middle" x="666.528" y="-272.016" font-family="Times,serif" font-size="14.00">wpt_10</text>
</g>
<!-- wpt_09&#45;&#45;wpt_10 -->
<g id="edge20" class="edge"><title>wpt_09&#45;&#45;wpt_10</title>
<path fill="none" stroke="black" d="M577.578,-307.31C593.662,-301.597 612.346,-294.961 628.427,-289.249"/>
</g>
<!-- wpt_00 -->
<g id="node3" class="node"><title>wpt_00</title>
<ellipse fill="none" stroke="black" cx="473.413" cy="-46.7977" rx="39.9593" ry="40.1111"/>
<text text-anchor="middle" x="473.413" y="-43.0977" font-family="Times,serif" font-size="14.00">wpt_00</text>
</g>
<!-- wpt_04 -->
<g id="node7" class="node"><title>wpt_04</title>
<ellipse fill="none" stroke="black" cx="329.757" cy="-71.2846" rx="39.9593" ry="40.1111"/>
<text text-anchor="middle" x="329.757" y="-67.5846" font-family="Times,serif" font-size="14.00">wpt_04</text>
</g>
<!-- wpt_00&#45;&#45;wpt_04 -->
<g id="edge44" class="edge"><title>wpt_00&#45;&#45;wpt_04</title>
<path fill="none" stroke="black" d="M433.397,-53.6187C413.472,-57.015 389.454,-61.1089 369.558,-64.5002"/>
</g>
<!-- wpt_05 -->
<g id="node8" class="node"><title>wpt_05</title>
<ellipse fill="none" stroke="black" cx="599.206" cy="-127.873" rx="39.9593" ry="40.1111"/>
<text text-anchor="middle" x="599.206" y="-124.173" font-family="Times,serif" font-size="14.00">wpt_05</text>
</g>
<!-- wpt_00&#45;&#45;wpt_05 -->
<g id="edge12" class="edge"><title>wpt_00&#45;&#45;wpt_05</title>
<path fill="none" stroke="black" d="M507.455,-68.7378C525.354,-80.2742 547.234,-94.3761 565.137,-105.915"/>
</g>
<!-- wpt_01 -->
<g id="node4" class="node"><title>wpt_01</title>
<ellipse fill="none" stroke="black" cx="711.325" cy="-40.3051" rx="39.9593" ry="40.1111"/>
<text text-anchor="middle" x="711.325" y="-36.6051" font-family="Times,serif" font-size="14.00">wpt_01</text>
</g>
<!-- wpt_01&#45;&#45;wpt_05 -->
<g id="edge28" class="edge"><title>wpt_01&#45;&#45;wpt_05</title>
<path fill="none" stroke="black" d="M679.496,-65.1642C664.347,-76.9963 646.274,-91.1115 631.114,-102.951"/>
</g>
<!-- wpt_06 -->
<g id="node9" class="node"><title>wpt_06</title>
<ellipse fill="none" stroke="black" cx="769.46" cy="-168.614" rx="39.9593" ry="40.1111"/>
<text text-anchor="middle" x="769.46" y="-164.914" font-family="Times,serif" font-size="14.00">wpt_06</text>
</g>
<!-- wpt_01&#45;&#45;wpt_06 -->
<g id="edge26" class="edge"><title>wpt_01&#45;&#45;wpt_06</title>
<path fill="none" stroke="black" d="M727.984,-77.0732C735.768,-94.2534 745.014,-114.659 752.799,-131.84"/>
</g>
<!-- wpt_02 -->
<g id="node5" class="node"><title>wpt_02</title>
<ellipse fill="none" stroke="black" cx="1170.43" cy="-128.287" rx="39.9593" ry="40.1111"/>
<text text-anchor="middle" x="1170.43" y="-124.587" font-family="Times,serif" font-size="14.00">wpt_02</text>
</g>
<!-- wpt_03 -->
<g id="node6" class="node"><title>wpt_03</title>
<ellipse fill="none" stroke="black" cx="1042.13" cy="-144.57" rx="39.9593" ry="40.1111"/>
<text text-anchor="middle" x="1042.13" y="-140.87" font-family="Times,serif" font-size="14.00">wpt_03</text>
</g>
<!-- wpt_02&#45;&#45;wpt_03 -->
<g id="edge52" class="edge"><title>wpt_02&#45;&#45;wpt_03</title>
<path fill="none" stroke="black" d="M1130.19,-133.394C1114.91,-135.334 1097.51,-137.542 1082.23,-139.48"/>
</g>
<!-- wpt_07 -->
<g id="node10" class="node"><title>wpt_07</title>
<ellipse fill="none" stroke="black" cx="911.519" cy="-172.086" rx="39.9593" ry="40.1111"/>
<text text-anchor="middle" x="911.519" y="-168.386" font-family="Times,serif" font-size="14.00">wpt_07</text>
</g>
<!-- wpt_03&#45;&#45;wpt_07 -->
<g id="edge36" class="edge"><title>wpt_03&#45;&#45;wpt_07</title>
<path fill="none" stroke="black" d="M1002.59,-152.9C986.372,-156.317 967.629,-160.265 951.379,-163.689"/>
</g>
<!-- wpt_04&#45;&#45;wpt_08 -->
<g id="edge42" class="edge"><title>wpt_04&#45;&#45;wpt_08</title>
<path fill="none" stroke="black" d="M309.274,-106.05C298.974,-123.533 286.519,-144.673 276.192,-162.201"/>
</g>
<!-- wpt_05&#45;&#45;wpt_10 -->
<g id="edge24" class="edge"><title>wpt_05&#45;&#45;wpt_10</title>
<path fill="none" stroke="black" d="M616.02,-164.798C626.341,-187.463 639.508,-216.38 649.811,-239.005"/>
</g>
<!-- wpt_06&#45;&#45;wpt_07 -->
<g id="edge10" class="edge"><title>wpt_06&#45;&#45;wpt_07</title>
<path fill="none" stroke="black" d="M809.789,-169.599C828.983,-170.069 851.882,-170.628 871.09,-171.098"/>
</g>
<!-- wpt_11 -->
<g id="node17" class="node"><title>wpt_11</title>
<ellipse fill="none" stroke="black" cx="808.533" cy="-258.022" rx="39.9593" ry="40.1111"/>
<text text-anchor="middle" x="808.533" y="-254.322" font-family="Times,serif" font-size="14.00">wpt_11</text>
</g>
<!-- wpt_06&#45;&#45;wpt_11 -->
<g id="edge56" class="edge"><title>wpt_06&#45;&#45;wpt_11</title>
<path fill="none" stroke="black" d="M785.691,-205.754C787.872,-210.744 790.109,-215.863 792.29,-220.853"/>
</g>
<!-- wpt_06&#45;&#45;wpt_10 -->
<g id="edge16" class="edge"><title>wpt_06&#45;&#45;wpt_10</title>
<path fill="none" stroke="black" d="M741.333,-197.88C726.809,-212.992 709.139,-231.378 694.62,-246.485"/>
</g>
<!-- wpt_07&#45;&#45;wpt_11 -->
<g id="edge18" class="edge"><title>wpt_07&#45;&#45;wpt_11</title>
<path fill="none" stroke="black" d="M880.62,-197.87C867.586,-208.746 852.443,-221.382 839.411,-232.257"/>
</g>
<!-- wpt_17 -->
<g id="node11" class="node"><title>wpt_17</title>
<ellipse fill="none" stroke="black" cx="374.175" cy="-552.281" rx="39.9593" ry="40.1111"/>
<text text-anchor="middle" x="374.175" y="-548.581" font-family="Times,serif" font-size="14.00">wpt_17</text>
</g>
<!-- wpt_16 -->
<g id="node12" class="node"><title>wpt_16</title>
<ellipse fill="none" stroke="black" cx="161.978" cy="-398.972" rx="39.9593" ry="40.1111"/>
<text text-anchor="middle" x="161.978" y="-395.272" font-family="Times,serif" font-size="14.00">wpt_16</text>
</g>
<!-- wpt_20 -->
<g id="node19" class="node"><title>wpt_20</title>
<ellipse fill="none" stroke="black" cx="40.1525" cy="-452.751" rx="39.9593" ry="40.1111"/>
<text text-anchor="middle" x="40.1525" y="-449.051" font-family="Times,serif" font-size="14.00">wpt_20</text>
</g>
<!-- wpt_16&#45;&#45;wpt_20 -->
<g id="edge38" class="edge"><title>wpt_16&#45;&#45;wpt_20</title>
<path fill="none" stroke="black" d="M125.095,-415.253C109.969,-421.931 92.487,-429.648 77.3298,-436.339"/>
</g>
<!-- wpt_15 -->
<g id="node13" class="node"><title>wpt_15</title>
<ellipse fill="none" stroke="black" cx="767.15" cy="-387.561" rx="39.9593" ry="40.1111"/>
<text text-anchor="middle" x="767.15" y="-383.861" font-family="Times,serif" font-size="14.00">wpt_15</text>
</g>
<!-- wpt_19 -->
<g id="node20" class="node"><title>wpt_19</title>
<ellipse fill="none" stroke="black" cx="632.905" cy="-543.209" rx="39.9593" ry="40.1111"/>
<text text-anchor="middle" x="632.905" y="-539.509" font-family="Times,serif" font-size="14.00">wpt_19</text>
</g>
<!-- wpt_14&#45;&#45;wpt_19 -->
<g id="edge54" class="edge"><title>wpt_14&#45;&#45;wpt_19</title>
<path fill="none" stroke="black" d="M596.047,-443.715C603.11,-462.779 611.65,-485.832 618.73,-504.946"/>
</g>
<!-- wpt_18 -->
<g id="node21" class="node"><title>wpt_18</title>
<ellipse fill="none" stroke="black" cx="520.399" cy="-508.838" rx="39.9593" ry="40.1111"/>
<text text-anchor="middle" x="520.399" y="-505.138" font-family="Times,serif" font-size="14.00">wpt_18</text>
</g>
<!-- wpt_14&#45;&#45;wpt_18 -->
<g id="edge40" class="edge"><title>wpt_14&#45;&#45;wpt_18</title>
<path fill="none" stroke="black" d="M561.319,-440.4C554.817,-451.274 547.639,-463.279 541.134,-474.159"/>
</g>
<!-- wpt_13&#45;&#45;wpt_17 -->
<g id="edge50" class="edge"><title>wpt_13&#45;&#45;wpt_17</title>
<path fill="none" stroke="black" d="M415.88,-451.696C407.744,-471.319 397.799,-495.306 389.661,-514.933"/>
</g>
<!-- wpt_13&#45;&#45;wpt_14 -->
<g id="edge34" class="edge"><title>wpt_13&#45;&#45;wpt_14</title>
<path fill="none" stroke="black" d="M471.725,-412.08C493.427,-410.845 520.103,-409.327 541.782,-408.094"/>
</g>
<!-- wpt_13&#45;&#45;wpt_18 -->
<g id="edge30" class="edge"><title>wpt_13&#45;&#45;wpt_18</title>
<path fill="none" stroke="black" d="M459.04,-443.748C469.762,-455.121 482.01,-468.114 492.73,-479.486"/>
</g>
<!-- wpt_12&#45;&#45;wpt_16 -->
<g id="edge48" class="edge"><title>wpt_12&#45;&#45;wpt_16</title>
<path fill="none" stroke="black" d="M256.95,-359.748C238.937,-367.187 217.351,-376.102 199.314,-383.552"/>
</g>
<!-- wpt_12&#45;&#45;wpt_13 -->
<g id="edge32" class="edge"><title>wpt_12&#45;&#45;wpt_13</title>
<path fill="none" stroke="black" d="M330.167,-362.787C350.34,-373.072 375.401,-385.849 395.535,-396.115"/>
</g>
<!-- wpt_10&#45;&#45;wpt_15 -->
<g id="edge8" class="edge"><title>wpt_10&#45;&#45;wpt_15</title>
<path fill="none" stroke="black" d="M693.492,-305.688C707.929,-321.736 725.662,-341.446 740.11,-357.506"/>
</g>
<!-- wpt_10&#45;&#45;wpt_14 -->
<g id="edge4" class="edge"><title>wpt_10&#45;&#45;wpt_14</title>
<path fill="none" stroke="black" d="M644.541,-309.556C632.116,-328.678 616.628,-352.515 604.174,-371.683"/>
</g>
<!-- wpt_10&#45;&#45;wpt_11 -->
<g id="edge6" class="edge"><title>wpt_10&#45;&#45;wpt_11</title>
<path fill="none" stroke="black" d="M706.462,-270.74C725.822,-268.328 749.021,-265.437 768.407,-263.022"/>
</g>
<!-- wpt_18&#45;&#45;wpt_19 -->
<g id="edge14" class="edge"><title>wpt_18&#45;&#45;wpt_19</title>
<path fill="none" stroke="black" d="M559.117,-520.666C570.431,-524.123 582.797,-527.901 594.115,-531.358"/>
</g>
</g>
</svg>
