<?xml version="1.0" encoding="UTF-8" standalone="no"?>
<!DOCTYPE svg PUBLIC "-//W3C//DTD SVG 1.1//EN"
 "http://www.w3.org/Graphics/SVG/1.1/DTD/svg11.dtd">
<!-- Generated by graphviz version 2.28.0 (20170704.0136)
 -->
<!-- Title: _anonymous_0 Pages: 1 -->
<svg width="750pt" height="654pt"
 viewBox="0.00 0.00 750.34 654.45" xmlns="http://www.w3.org/2000/svg" xmlns:xlink="http://www.w3.org/1999/xlink">
<g id="graph1" class="graph" transform="scale(1 1) rotate(0) translate(4 650.447)">
<title>_anonymous_0</title>
<polygon fill="white" stroke="white" points="-4,5 -4,-650.447 747.337,-650.447 747.337,5 -4,5"/>
<!-- wpt_08 -->
<g id="node1" class="node"><title>wpt_08</title>
<ellipse fill="none" stroke="black" cx="583.558" cy="-543.005" rx="39.9593" ry="40.1111"/>
<text text-anchor="middle" x="583.558" y="-539.305" font-family="Times,serif" font-size="14.00">wpt_08</text>
</g>
<!-- wpt_09 -->
<g id="node2" class="node"><title>wpt_09</title>
<ellipse fill="none" stroke="black" cx="470.318" cy="-430.947" rx="39.9593" ry="40.1111"/>
<text text-anchor="middle" x="470.318" y="-427.247" font-family="Times,serif" font-size="14.00">wpt_09</text>
</g>
<!-- wpt_08&#45;&#45;wpt_09 -->
<g id="edge12" class="edge"><title>wpt_08&#45;&#45;wpt_09</title>
<path fill="none" stroke="black" d="M554.69,-514.438C537.653,-497.579 516.162,-476.312 499.134,-459.462"/>
</g>
<!-- wpt_13 -->
<g id="node13" class="node"><title>wpt_13</title>
<ellipse fill="none" stroke="black" cx="580.527" cy="-466.667" rx="39.9593" ry="40.1111"/>
<text text-anchor="middle" x="580.527" y="-462.967" font-family="Times,serif" font-size="14.00">wpt_13</text>
</g>
<!-- wpt_08&#45;&#45;wpt_13 -->
<g id="edge32" class="edge"><title>wpt_08&#45;&#45;wpt_13</title>
<path fill="none" stroke="black" d="M581.954,-502.601C581.948,-502.458 581.942,-502.315 581.937,-502.172"/>
</g>
<!-- wpt_12 -->
<g id="node14" class="node"><title>wpt_12</title>
<ellipse fill="none" stroke="black" cx="702.185" cy="-537.379" rx="39.9593" ry="40.1111"/>
<text text-anchor="middle" x="702.185" y="-533.679" font-family="Times,serif" font-size="14.00">wpt_12</text>
</g>
<!-- wpt_08&#45;&#45;wpt_12 -->
<g id="edge10" class="edge"><title>wpt_08&#45;&#45;wpt_12</title>
<path fill="none" stroke="black" d="M623.72,-541.1C635.953,-540.52 649.404,-539.882 661.661,-539.301"/>
</g>
<!-- wpt_14 -->
<g id="node12" class="node"><title>wpt_14</title>
<ellipse fill="none" stroke="black" cx="454.138" cy="-565.18" rx="39.9593" ry="40.1111"/>
<text text-anchor="middle" x="454.138" y="-561.48" font-family="Times,serif" font-size="14.00">wpt_14</text>
</g>
<!-- wpt_09&#45;&#45;wpt_14 -->
<g id="edge20" class="edge"><title>wpt_09&#45;&#45;wpt_14</title>
<path fill="none" stroke="black" d="M465.463,-471.221C463.416,-488.211 461.036,-507.948 458.989,-524.934"/>
</g>
<!-- wpt_09&#45;&#45;wpt_13 -->
<g id="edge44" class="edge"><title>wpt_09&#45;&#45;wpt_13</title>
<path fill="none" stroke="black" d="M508.555,-443.34C519.372,-446.846 531.149,-450.663 541.985,-454.175"/>
</g>
<!-- wpt_10 -->
<g id="node16" class="node"><title>wpt_10</title>
<ellipse fill="none" stroke="black" cx="348.162" cy="-490.857" rx="39.9593" ry="40.1111"/>
<text text-anchor="middle" x="348.162" y="-487.157" font-family="Times,serif" font-size="14.00">wpt_10</text>
</g>
<!-- wpt_09&#45;&#45;wpt_10 -->
<g id="edge16" class="edge"><title>wpt_09&#45;&#45;wpt_10</title>
<path fill="none" stroke="black" d="M433.998,-448.76C418.385,-456.417 400.174,-465.348 384.553,-473.009"/>
</g>
<!-- wpt_00 -->
<g id="node3" class="node"><title>wpt_00</title>
<ellipse fill="none" stroke="black" cx="305.378" cy="-40.3051" rx="39.9593" ry="40.1111"/>
<text text-anchor="middle" x="305.378" y="-36.6051" font-family="Times,serif" font-size="14.00">wpt_00</text>
</g>
<!-- wpt_01 -->
<g id="node4" class="node"><title>wpt_01</title>
<ellipse fill="none" stroke="black" cx="298.707" cy="-180.312" rx="39.9593" ry="40.1111"/>
<text text-anchor="middle" x="298.707" y="-176.612" font-family="Times,serif" font-size="14.00">wpt_01</text>
</g>
<!-- wpt_00&#45;&#45;wpt_01 -->
<g id="edge6" class="edge"><title>wpt_00&#45;&#45;wpt_01</title>
<path fill="none" stroke="black" d="M303.448,-80.8009C302.563,-99.3758 301.517,-121.343 300.632,-139.907"/>
</g>
<!-- wpt_02 -->
<g id="node5" class="node"><title>wpt_02</title>
<ellipse fill="none" stroke="black" cx="153.97" cy="-223.487" rx="39.9593" ry="40.1111"/>
<text text-anchor="middle" x="153.97" y="-219.787" font-family="Times,serif" font-size="14.00">wpt_02</text>
</g>
<!-- wpt_01&#45;&#45;wpt_02 -->
<g id="edge26" class="edge"><title>wpt_01&#45;&#45;wpt_02</title>
<path fill="none" stroke="black" d="M259.92,-191.882C239.07,-198.102 213.441,-205.747 192.613,-211.96"/>
</g>
<!-- wpt_05 -->
<g id="node8" class="node"><title>wpt_05</title>
<ellipse fill="none" stroke="black" cx="400.194" cy="-293.725" rx="39.9593" ry="40.1111"/>
<text text-anchor="middle" x="400.194" y="-290.025" font-family="Times,serif" font-size="14.00">wpt_05</text>
</g>
<!-- wpt_01&#45;&#45;wpt_05 -->
<g id="edge22" class="edge"><title>wpt_01&#45;&#45;wpt_05</title>
<path fill="none" stroke="black" d="M325.637,-210.407C340.318,-226.813 358.438,-247.062 373.138,-263.49"/>
</g>
<!-- wpt_03 -->
<g id="node6" class="node"><title>wpt_03</title>
<ellipse fill="none" stroke="black" cx="40.1525" cy="-286.93" rx="39.9593" ry="40.1111"/>
<text text-anchor="middle" x="40.1525" y="-283.23" font-family="Times,serif" font-size="14.00">wpt_03</text>
</g>
<!-- wpt_02&#45;&#45;wpt_03 -->
<g id="edge2" class="edge"><title>wpt_02&#45;&#45;wpt_03</title>
<path fill="none" stroke="black" d="M118.581,-243.213C104.877,-250.852 89.221,-259.579 75.5192,-267.216"/>
</g>
<!-- wpt_07 -->
<g id="node10" class="node"><title>wpt_07</title>
<ellipse fill="none" stroke="black" cx="143.129" cy="-364.402" rx="39.9593" ry="40.1111"/>
<text text-anchor="middle" x="143.129" y="-360.702" font-family="Times,serif" font-size="14.00">wpt_07</text>
</g>
<!-- wpt_02&#45;&#45;wpt_07 -->
<g id="edge38" class="edge"><title>wpt_02&#45;&#45;wpt_07</title>
<path fill="none" stroke="black" d="M150.863,-263.868C149.411,-282.736 147.687,-305.147 146.236,-324.015"/>
</g>
<!-- wpt_03&#45;&#45;wpt_07 -->
<g id="edge40" class="edge"><title>wpt_03&#45;&#45;wpt_07</title>
<path fill="none" stroke="black" d="M72.4523,-311.23C84.7208,-320.46 98.6855,-330.966 110.943,-340.188"/>
</g>
<!-- wpt_04 -->
<g id="node7" class="node"><title>wpt_04</title>
<ellipse fill="none" stroke="black" cx="504.775" cy="-194.546" rx="39.9593" ry="40.1111"/>
<text text-anchor="middle" x="504.775" y="-190.846" font-family="Times,serif" font-size="14.00">wpt_04</text>
</g>
<!-- wpt_04&#45;&#45;wpt_05 -->
<g id="edge18" class="edge"><title>wpt_04&#45;&#45;wpt_05</title>
<path fill="none" stroke="black" d="M475.365,-222.437C460.986,-236.073 443.732,-252.436 429.383,-266.044"/>
</g>
<!-- wpt_05&#45;&#45;wpt_09 -->
<g id="edge30" class="edge"><title>wpt_05&#45;&#45;wpt_09</title>
<path fill="none" stroke="black" d="M418.618,-329.778C428.844,-349.789 441.528,-374.61 451.773,-394.658"/>
</g>
<!-- wpt_06 -->
<g id="node9" class="node"><title>wpt_06</title>
<ellipse fill="none" stroke="black" cx="267.923" cy="-355.512" rx="39.9593" ry="40.1111"/>
<text text-anchor="middle" x="267.923" y="-351.812" font-family="Times,serif" font-size="14.00">wpt_06</text>
</g>
<!-- wpt_05&#45;&#45;wpt_06 -->
<g id="edge34" class="edge"><title>wpt_05&#45;&#45;wpt_06</title>
<path fill="none" stroke="black" d="M363.7,-310.772C345.348,-319.345 323.156,-329.711 304.757,-338.306"/>
</g>
<!-- wpt_06&#45;&#45;wpt_07 -->
<g id="edge8" class="edge"><title>wpt_06&#45;&#45;wpt_07</title>
<path fill="none" stroke="black" d="M227.406,-358.398C213.314,-359.402 197.517,-360.527 183.442,-361.53"/>
</g>
<!-- wpt_11 -->
<g id="node15" class="node"><title>wpt_11</title>
<ellipse fill="none" stroke="black" cx="221.612" cy="-481.243" rx="39.9593" ry="40.1111"/>
<text text-anchor="middle" x="221.612" y="-477.543" font-family="Times,serif" font-size="14.00">wpt_11</text>
</g>
<!-- wpt_06&#45;&#45;wpt_11 -->
<g id="edge46" class="edge"><title>wpt_06&#45;&#45;wpt_11</title>
<path fill="none" stroke="black" d="M253.902,-393.577C248.099,-409.333 241.383,-427.565 235.585,-443.308"/>
</g>
<!-- wpt_07&#45;&#45;wpt_11 -->
<g id="edge42" class="edge"><title>wpt_07&#45;&#45;wpt_11</title>
<path fill="none" stroke="black" d="M165.619,-397.884C176.128,-413.529 188.61,-432.111 199.119,-447.756"/>
</g>
<!-- wpt_15 -->
<g id="node11" class="node"><title>wpt_15</title>
<ellipse fill="none" stroke="black" cx="301.932" cy="-606.142" rx="39.9593" ry="40.1111"/>
<text text-anchor="middle" x="301.932" y="-602.442" font-family="Times,serif" font-size="14.00">wpt_15</text>
</g>
<!-- wpt_14&#45;&#45;wpt_15 -->
<g id="edge14" class="edge"><title>wpt_14&#45;&#45;wpt_15</title>
<path fill="none" stroke="black" d="M415.336,-575.622C392.524,-581.762 363.772,-589.499 340.927,-595.648"/>
</g>
<!-- wpt_13&#45;&#45;wpt_14 -->
<g id="edge28" class="edge"><title>wpt_13&#45;&#45;wpt_14</title>
<path fill="none" stroke="black" d="M548.634,-491.526C529.474,-506.46 505.179,-525.397 486.021,-540.329"/>
</g>
<!-- wpt_12&#45;&#45;wpt_13 -->
<g id="edge24" class="edge"><title>wpt_12&#45;&#45;wpt_13</title>
<path fill="none" stroke="black" d="M667.323,-517.116C651.033,-507.648 631.685,-496.402 615.394,-486.934"/>
</g>
<!-- wpt_11&#45;&#45;wpt_15 -->
<g id="edge36" class="edge"><title>wpt_11&#45;&#45;wpt_15</title>
<path fill="none" stroke="black" d="M243.56,-515.372C254.893,-532.996 268.682,-554.437 280.011,-572.054"/>
</g>
<!-- wpt_10&#45;&#45;wpt_11 -->
<g id="edge4" class="edge"><title>wpt_10&#45;&#45;wpt_11</title>
<path fill="none" stroke="black" d="M308.121,-487.815C293.349,-486.693 276.615,-485.422 261.827,-484.298"/>
</g>
</g>
</svg>
