<?xml version="1.0" encoding="UTF-8" standalone="no"?>
<svg
   xmlns:dc="http://purl.org/dc/elements/1.1/"
   xmlns:cc="http://creativecommons.org/ns#"
   xmlns:rdf="http://www.w3.org/1999/02/22-rdf-syntax-ns#"
   xmlns:svg="http://www.w3.org/2000/svg"
   xmlns="http://www.w3.org/2000/svg"
   xmlns:sodipodi="http://sodipodi.sourceforge.net/DTD/sodipodi-0.dtd"
   xmlns:inkscape="http://www.inkscape.org/namespaces/inkscape"
   version="1.1"
   viewBox="0 0 99.999998 99.999997"
   enable-background="new 0 0 236.943 236.943"
   id="svg2"
   inkscape:version="0.48.4 r9939"
   width="100%"
   height="100%"
   sodipodi:docname="quadrotor.svg">
  <metadata
     id="metadata14">
    <rdf:RDF>
      <cc:Work
         rdf:about="">
        <dc:format>image/svg+xml</dc:format>
        <dc:type
           rdf:resource="http://purl.org/dc/dcmitype/StillImage" />
        <dc:title />
      </cc:Work>
    </rdf:RDF>
  </metadata>
  <defs
     id="defs12" />
  <sodipodi:namedview
     pagecolor="#ffffff"
     bordercolor="#666666"
     borderopacity="1"
     objecttolerance="10"
     gridtolerance="10"
     guidetolerance="10"
     inkscape:pageopacity="0"
     inkscape:pageshadow="2"
     inkscape:window-width="1920"
     inkscape:window-height="1176"
     id="namedview10"
     showgrid="false"
     showguides="true"
     inkscape:guide-bbox="true"
     inkscape:snap-object-midpoints="true"
     inkscape:snap-center="true"
     inkscape:snap-midpoints="true"
     inkscape:zoom="5.6343408"
     inkscape:cx="30.931337"
     inkscape:cy="53.141908"
     inkscape:window-x="0"
     inkscape:window-y="24"
     inkscape:window-maximized="1"
     inkscape:current-layer="svg2"
     fit-margin-top="0"
     fit-margin-left="0"
     fit-margin-right="0"
     fit-margin-bottom="0"
     inkscape:snap-global="false" />
  <path
     inkscape:connector-curvature="0"
     id="path8045"
     d="m 70.804797,37.205701 c 4.854896,5.992763 1.812967,10.850859 -6.794336,10.850859 -8.607304,0 -19.520573,-4.858096 -24.375467,-10.850859 -4.854897,-5.992766 -1.812969,-10.850861 6.794335,-10.850861 8.607304,0 19.520572,4.858095 24.375468,10.850861 z"
     style="fill:#f9f9f9;stroke:#ffffff;stroke-width:15.99999968000000017;stroke-miterlimit:4;stroke-opacity:1;stroke-dasharray:none;stroke-dashoffset:0" />
  <path
     inkscape:connector-curvature="0"
     id="path8047"
     d="m 60.364993,62.79429 c 4.854895,5.992763 1.812968,10.850859 -6.794336,10.850859 -8.607303,0 -19.520573,-4.858096 -24.375469,-10.850859 -4.854896,-5.992765 -1.812969,-10.850861 6.794335,-10.850861 8.607303,0 19.520573,4.858096 24.37547,10.850861 z"
     style="fill:#f9f9f9;stroke:#ffffff;stroke-width:15.99999968000000017;stroke-miterlimit:4;stroke-opacity:1;stroke-dasharray:none;stroke-dashoffset:0" />
  <path
     inkscape:connector-curvature="0"
     id="path8049"
     d="m 60.364993,62.794295 c 4.854895,5.992764 15.768164,10.850859 24.375466,10.850859 8.607302,0 11.649229,-4.858095 6.794336,-10.850859 C 86.679902,56.80153 75.766632,51.943434 67.159328,51.943434 c -8.607304,0 -11.649232,4.858096 -6.794335,10.850861 z"
     style="fill:#f9f9f9;stroke:#ffffff;stroke-width:15.99999968000000017;stroke-miterlimit:4;stroke-opacity:1;stroke-dasharray:none;stroke-dashoffset:0" />
  <path
     inkscape:connector-curvature="0"
     id="path2989"
     d="M 8.4652039,37.205701 C 13.320099,43.198464 24.233367,48.05656 32.840671,48.05656 c 8.607305,0 11.649232,-4.858096 6.794336,-10.850859 C 34.780112,31.212935 23.866843,26.35484 15.259539,26.35484 c -8.6073042,0 -11.6492317,4.858095 -6.7943351,10.850861 z"
     style="fill:#f9f9f9;stroke:#ffffff;stroke-width:15.99999968;stroke-miterlimit:4;stroke-opacity:1;stroke-dasharray:none;stroke-dashoffset:0" />
  <path
     style="fill:#f9f9f9;stroke:#008000;stroke-width:8;stroke-miterlimit:4;stroke-opacity:1;stroke-dasharray:none;stroke-dashoffset:0"
     d="m 60.364993,62.79429 c 4.854895,5.992763 1.812968,10.850859 -6.794336,10.850859 -8.607303,0 -19.520573,-4.858096 -24.375469,-10.850859 -4.854896,-5.992765 -1.812969,-10.850861 6.794335,-10.850861 8.607303,0 19.520573,4.858096 24.37547,10.850861 z"
     id="path2983"
     inkscape:connector-curvature="0" />
  <path
     style="fill:#f9f9f9;stroke:#008000;stroke-width:8;stroke-miterlimit:4;stroke-opacity:1;stroke-dasharray:none;stroke-dashoffset:0"
     d="m 70.804797,37.205701 c 4.854896,5.992763 1.812967,10.850859 -6.794336,10.850859 -8.607304,0 -19.520573,-4.858096 -24.375467,-10.850859 -4.854897,-5.992766 -1.812969,-10.850861 6.794335,-10.850861 8.607304,0 19.520572,4.858095 24.375468,10.850861 z"
     id="path2985"
     inkscape:connector-curvature="0" />
  <path
     style="fill:#f9f9f9;stroke:#008000;stroke-width:8;stroke-miterlimit:4;stroke-opacity:1;stroke-dasharray:none;stroke-dashoffset:0"
     d="m 60.364993,62.794295 c 4.854895,5.992764 15.768164,10.850859 24.375466,10.850859 8.607302,0 11.649229,-4.858095 6.794336,-10.850859 C 86.679902,56.80153 75.766632,51.943434 67.159328,51.943434 c -8.607304,0 -11.649232,4.858096 -6.794335,10.850861 z"
     id="path2987"
     inkscape:connector-curvature="0" />
  <path
     style="fill:#f9f9f9;stroke:#008000;stroke-width:8;stroke-miterlimit:4;stroke-opacity:1;stroke-dasharray:none;stroke-dashoffset:0"
     d="m 8.465204,37.205701 c 4.854895,5.992763 15.768163,10.850859 24.375467,10.850859 8.607305,0 11.649232,-4.858096 6.794336,-10.850859 C 34.780112,31.212935 23.866843,26.35484 15.259539,26.35484 c -8.607304,0 -11.649232,4.858095 -6.794335,10.850861 z"
     inkscape:connector-curvature="0" />
</svg>
