<?xml version="1.0" encoding="UTF-8" standalone="no"?>
<!-- Generator: Adobe Illustrator 19.1.0, SVG Export Plug-In . SVG Version: 6.00 Build 0)  -->

<svg
   xmlns:dc="http://purl.org/dc/elements/1.1/"
   xmlns:cc="http://creativecommons.org/ns#"
   xmlns:rdf="http://www.w3.org/1999/02/22-rdf-syntax-ns#"
   xmlns:svg="http://www.w3.org/2000/svg"
   xmlns="http://www.w3.org/2000/svg"
   xmlns:sodipodi="http://sodipodi.sourceforge.net/DTD/sodipodi-0.dtd"
   xmlns:inkscape="http://www.inkscape.org/namespaces/inkscape"
   version="1.1"
   id="Capa_1"
   x="0px"
   y="0px"
   viewBox="0 0 100 100"
   xml:space="preserve"
   inkscape:version="0.48.4 r9939"
   width="100%"
   height="100%"
   sodipodi:docname="victim.svg"><metadata
     id="metadata52"><rdf:RDF><cc:Work
         rdf:about=""><dc:format>image/svg+xml</dc:format><dc:type
           rdf:resource="http://purl.org/dc/dcmitype/StillImage" /><dc:title /></cc:Work></rdf:RDF></metadata><defs
     id="defs50" /><sodipodi:namedview
     pagecolor="#ffffff"
     bordercolor="#666666"
     borderopacity="1"
     objecttolerance="10"
     gridtolerance="10"
     guidetolerance="10"
     inkscape:pageopacity="0"
     inkscape:pageshadow="2"
     inkscape:window-width="1920"
     inkscape:window-height="1176"
     id="namedview48"
     showgrid="false"
     inkscape:zoom="3.0422343"
     inkscape:cx="38.734059"
     inkscape:cy="47.330274"
     inkscape:window-x="0"
     inkscape:window-y="24"
     inkscape:window-maximized="1"
     inkscape:current-layer="Capa_1"
     inkscape:snap-smooth-nodes="true"
     inkscape:object-nodes="true"
     inkscape:snap-global="false"
     fit-margin-top="0"
     fit-margin-left="0"
     fit-margin-right="0"
     fit-margin-bottom="0" /><rect
     style="fill:none;fill-opacity:1;fill-rule:nonzero;stroke:none"
     id="rect3850"
     width="100"
     height="100"
     x="2.2439376e-06"
     y="0" /><g
     id="g3852"
     transform="translate(-0.25049922,-328.87704)"><g
       transform="matrix(0.22814043,0,0,0.22814043,0.19335022,328.81989)"
       id="g3843"><path
         style="fill:#ffffff;stroke:none"
         d="m 427.99701,153.56 c 6.82,6.82 10.58,15.88 10.58,25.53 0,9.64 -3.76,18.71 -10.58,25.53 l -43.34,43.34 c -8.59,8.59 -20.02,13.32 -32.17,13.32 -12.16001,0 -23.59001,-4.73 -32.18001,-13.32 l -46.7,-46.7 -214.679001,214.68 c -6.5,6.5 -15.13,10.07 -24.31,10.07 -9.18,0 -17.82,-3.57 -24.31,-10.07 -13.4099997,-13.4 -13.4099997,-35.21 0,-48.62 L 145.578,232.05 l -76.040001,0 0.05,39.66 c 0.02,8.7 -3.36,16.88 -9.51,23.04 -6.15,6.16 -14.33,9.55 -23.04,9.55 l -0.67,0 c -8.96,0 -17.37,-3.47 -23.69,-9.76 -6.3099997,-6.3 -9.7799997,-14.67 -9.7699997,-23.59 0.01,-17.08 0.02,-39.56 0.03,-59.02 0,-27.03 21.9999997,-49.02 49.0399997,-49.02 l 93.850001,0 39.62,-39.62 -30.36,-30.359998 -22.11,22.129998 c -6.19,6.19 -14.42,9.61 -23.18,9.61 0,0 0,0 -0.01,0 -8.75,0 -16.980001,-3.41 -23.170001,-9.6 l -0.48,-0.48 c -6.38,-6.38 -9.9,-14.84 -9.92,-23.819998 -0.01,-8.98 3.48,-17.42 9.83,-23.77 11.26,-11.25 25.790001,-25.78 38.810001,-38.79 20.53,-20.53 53.94,-20.52 74.48,0.01 l 49.35,49.35 c 0.14,-14.8 5.99,-29.28 16.85,-40.15 22.44,-22.44 58.95,-22.44 81.39,0 10.87001,10.87 16.86001,25.32 16.86001,40.7 0,15.37 -5.99,29.819998 -16.86001,40.689998 -10.86,10.86 -25.35,16.71 -40.15,16.86 l 44.02,44.02 26.13001,-26.13 c 14.08,-14.08 36.99,-14.08 51.069,0 z"
         id="path3048"
         inkscape:connector-curvature="0"
         sodipodi:nodetypes="csssssccscscccssscccscccccsssccccccsssccsc" /><path
         inkscape:connector-curvature="0"
         id="path14"
         d="m 223.827,315.39 c 10.75,0 19.5,8.74 19.5,19.5 0,10.75 -8.75,19.5 -19.5,19.5 -10.75,0 -19.5,-8.75 -19.5,-19.5 0,-10.76 8.75,-19.5 19.5,-19.5 z m 6.5,19.5 c 0,-3.59 -2.92,-6.5 -6.5,-6.5 -3.59,0 -6.5,2.91 -6.5,6.5 0,3.58 2.91,6.5 6.5,6.5 3.581,0 6.5,-2.92 6.5,-6.5 z"
         style="fill:#000000;stroke:none" /><path
         inkscape:connector-curvature="0"
         id="path8"
         d="m 223.827,328.39 c 3.58,0 6.5,2.91 6.5,6.5 0,3.58 -2.92,6.5 -6.5,6.5 -3.59,0 -6.5,-2.92 -6.5,-6.5 0,-3.59 2.911,-6.5 6.5,-6.5 z"
         style="fill:#d40000;stroke:none" /><path
         inkscape:connector-curvature="0"
         id="path10"
         d="m 256.897,217.97 c 10.11,5.97 16.43,16.83 16.43,28.82 0,18.47 -15.02,33.5 -33.5,33.5 -5.99,0 -11.88,-1.61 -17.03,-4.66 -2.61,-1.54 -5.93,-1.08 -8.02,1.1 -3.42,3.59 -8.02,5.56 -12.95,5.56 -2.67,0 -5.23,-0.59 -7.57,-1.68 l 62.64,-62.64 z"
         style="fill:#aa0000;stroke:none" /><path
         inkscape:connector-curvature="0"
         id="path12"
         d="m 427.997,153.56 c 6.82,6.82 10.58,15.88 10.58,25.53 0,9.64 -3.76,18.71 -10.58,25.53 l -43.34,43.34 c -8.59,8.59 -20.02,13.32 -32.17,13.32 -12.16,0 -23.59,-4.73 -32.18,-13.32 l -46.7,-46.7 -7.3,7.3 c 12.4,8.56 20.02,22.72 20.02,38.23 0,25.64 -20.86,46.5 -46.5,46.5 -6.71,0 -13.32,-1.45 -19.38,-4.24 -5.34,4.05 -11.79,6.24 -18.62,6.24 -6.11,0 -12.05,-1.84 -17.08,-5.17 L 58.928,415.94 c -6.5,6.5 -15.13,10.07 -24.31,10.07 -9.18,0 -17.82,-3.57 -24.31,-10.07 -13.41,-13.4 -13.41,-35.21 0,-48.62 l 135.27,-135.27 h -76.04 l 0.05,39.66 c 0.02,8.7 -3.36,16.88 -9.51,23.04 -6.15,6.16 -14.33,9.55 -23.04,9.55 h -0.67 c -8.96,0 -17.37,-3.47 -23.69,-9.76 -6.31,-6.3 -9.78,-14.67 -9.77,-23.59 0.01,-17.08 0.02,-39.56 0.03,-59.02 0,-27.03 22,-49.02 49.04,-49.02 h 93.85 l 39.62,-39.62 -30.36,-30.36 -22.11,22.13 c -6.19,6.19 -14.42,9.61 -23.18,9.61 0,0 0,0 -0.01,0 -8.75,0 -16.98,-3.41 -23.17,-9.6 l -0.48,-0.48 c -6.38,-6.38 -9.9,-14.84 -9.92,-23.82 -0.01,-8.98 3.48,-17.42 9.83,-23.77 11.26,-11.25 25.79,-25.78 38.81,-38.79 20.53,-20.53 53.94,-20.52 74.48,0.01 l 49.35,49.35 c 0.14,-14.8 5.99,-29.28 16.85,-40.15 22.44,-22.44 58.95,-22.44 81.39,0 10.87,10.87 16.86,25.32 16.86,40.7 0,15.37 -5.99,29.82 -16.86,40.69 -10.86,10.86 -25.35,16.71 -40.15,16.86 l 44.02,44.02 26.13,-26.13 c 14.08,-14.08 36.99,-14.08 51.069,0 z m -2.419,25.53 c 0,-3.08 -0.6,-6.08 -1.75,-8.85 -1.15,-2.77 -2.84,-5.31 -5.02,-7.49 -9.01,-9.01 -23.67,-9.01 -32.69,0 l -30.72,30.72 c -2.54,2.54 -6.66,2.54 -9.2,0 l -63.25,-63.25 c -2.17,-2.17 -2.52,-5.58 -0.84,-8.15 1.69,-2.58 4.95,-3.62 7.82,-2.49 16.51,6.48 35.28,2.57 47.81,-9.96 17.37,-17.37 17.37,-45.63 0,-63.01 -17.37,-17.37 -45.63,-17.36 -63,0 -12.54,12.54 -16.45,31.31 -9.96,47.82 1.12,2.86 0.08,6.12 -2.49,7.81 -2.58,1.69 -5.98,1.34 -8.16,-0.84 l -63.99,-63.99 c -15.46,-15.46 -40.63,-15.47 -56.09,-0.01 -13.02,13.02 -27.55,27.55 -38.81,38.8 -3.89,3.88 -6.02,9.05 -6.02,14.55 0.01,5.51 2.18,10.71 6.11,14.65 l 0.48,0.48 c 1.87,1.87 4.04,3.31 6.41,4.29 2.37,0.98 4.93,1.5 7.58,1.5 5.28,0 10.25,-2.06 13.99,-5.8 l 26.7,-26.73 c 1.21,-1.22 2.87,-1.91 4.59,-1.91 1.73,0 3.38,0.69 4.6,1.91 l 39.55,39.55 c 2.54,2.54 2.54,6.65 0,9.19 L 153.107,174 c -1.22,1.22 -2.87,1.91 -4.59,1.91 h -96.54 c -19.87,0 -36.04,16.16 -36.04,36.02 -0.01,19.47 -0.02,41.95 -0.03,59.03 -0.01,5.43 2.11,10.54 5.95,14.37 3.86,3.85 9.01,5.97 14.51,5.97 h 0.67 c 5.23,0 10.14,-2.04 13.84,-5.73 3.69,-3.7 5.72,-8.62 5.71,-13.84 l -0.06,-46.17 c 0,-1.73 0.68,-3.38 1.9,-4.61 1.22,-1.22 2.88,-1.9 4.6,-1.9 h 98.25 c 2.63,0 5,1.58 6,4.01 1.01,2.43 0.45,5.22 -1.41,7.08 L 19.497,376.51 c -8.33,8.34 -8.33,21.9 0,30.24 4.04,4.04 9.41,6.26 15.12,6.26 5.71,0 11.08,-2.22 15.12,-6.26 l 219.27,-219.28 c 2.54,-2.54 6.66,-2.54 9.2,0 l 51.29,51.29 c 6.14,6.14 14.3,9.52 22.99,9.52 8.68,0 16.84,-3.38 22.98,-9.52 l 43.34,-43.33 c 4.361,-4.36 6.771,-10.17 6.771,-16.34 z m -152.25,67.7 c 0,-11.99 -6.32,-22.85 -16.43,-28.82 l -62.64,62.64 c 2.34,1.09 4.9,1.68 7.57,1.68 4.93,0 9.53,-1.97 12.95,-5.56 2.09,-2.18 5.41,-2.64 8.02,-1.1 5.15,3.05 11.04,4.66 17.03,4.66 18.479,0 33.5,-15.03 33.5,-33.5 z"
         style="fill:#000000;stroke:none" /></g></g></svg>