<?xml version="1.0" encoding="UTF-8" standalone="no"?>
<svg
   xmlns:dc="http://purl.org/dc/elements/1.1/"
   xmlns:cc="http://creativecommons.org/ns#"
   xmlns:rdf="http://www.w3.org/1999/02/22-rdf-syntax-ns#"
   xmlns:svg="http://www.w3.org/2000/svg"
   xmlns="http://www.w3.org/2000/svg"
   xmlns:sodipodi="http://sodipodi.sourceforge.net/DTD/sodipodi-0.dtd"
   xmlns:inkscape="http://www.inkscape.org/namespaces/inkscape"
   version="1.1"
   viewBox="0 0 99.999998 99.999997"
   enable-background="new 0 0 236.943 236.943"
   id="svg2"
   inkscape:version="0.48.4 r9939"
   width="100%"
   height="100%"
   sodipodi:docname="emsbot.svg">
  <metadata
     id="metadata14">
    <rdf:RDF>
      <cc:Work
         rdf:about="">
        <dc:format>image/svg+xml</dc:format>
        <dc:type
           rdf:resource="http://purl.org/dc/dcmitype/StillImage" />
        <dc:title />
      </cc:Work>
    </rdf:RDF>
  </metadata>
  <defs
     id="defs12" />
  <sodipodi:namedview
     pagecolor="#ffffff"
     bordercolor="#666666"
     borderopacity="1"
     objecttolerance="10"
     gridtolerance="10"
     guidetolerance="10"
     inkscape:pageopacity="0"
     inkscape:pageshadow="2"
     inkscape:window-width="1920"
     inkscape:window-height="1176"
     id="namedview10"
     showgrid="false"
     showguides="true"
     inkscape:guide-bbox="true"
     inkscape:snap-object-midpoints="true"
     inkscape:snap-center="true"
     inkscape:snap-midpoints="true"
     inkscape:zoom="2.8171704"
     inkscape:cx="31.93282"
     inkscape:cy="56.888762"
     inkscape:window-x="0"
     inkscape:window-y="24"
     inkscape:window-maximized="1"
     inkscape:current-layer="svg2"
     fit-margin-top="0"
     fit-margin-left="0"
     fit-margin-right="0"
     fit-margin-bottom="0" />
  <path
     sodipodi:type="arc"
     style="fill:#ffffff;fill-opacity:1;fill-rule:nonzero;stroke:none"
     id="path2986"
     sodipodi:cx="-118.02623"
     sodipodi:cy="-0.63289338"
     sodipodi:rx="36.384026"
     sodipodi:ry="24.670145"
     d="m -81.642204,-0.63289338 a 36.384026,24.670145 0 1 1 -72.768056,0 36.384026,24.670145 0 1 1 72.768056,0 z"
     transform="matrix(1.3742294,0,0,2.0267412,212.19511,51.282708)" />
  <path
     style="fill:#d40000;fill-opacity:1;fill-rule:nonzero;stroke:none"
     d="m 49.999998,-3e-6 c -27.614238,0 -50,22.385763 -50,50 0,27.614237 22.385762,50 50,50 27.614238,0 50,-22.385763 50,-50 0,-27.614237 -22.385762,-50 -50,-50 z m 6.75,17.03125 15.21875,0 c 1.427538,0 2.59375,1.134961 2.59375,2.5625 l 0,18.71875 0,5 0,10.15625 c 0,3.015796 -2.421704,5.4375 -5.4375,5.4375 l -1.15625,0 2.15625,3.25 c 1.25391,-0.509159 2.62582,-0.78125 4.0625,-0.78125 5.966044,0 10.8125,4.815213 10.8125,10.78125 0,5.966037 -4.846456,10.8125 -10.8125,10.8125 -5.966037,0 -10.78125,-4.846464 -10.78125,-10.8125 0,-2.966447 1.189247,-5.641519 3.125,-7.59375 l -3.78125,-5.65625 -10.59375,0 0,2.6875 c 4.926628,1.004094 8.65625,5.339288 8.65625,10.5625 0,5.966037 -4.846463,10.8125 -10.8125,10.8125 -5.966037,0 -10.8125,-4.846464 -10.8125,-10.8125 0,-5.223183 3.729657,-9.558371 8.65625,-10.5625 l 0,-2.6875 -10.59375,0 -3.78125,5.65625 c 1.935752,1.95223 3.125,4.627304 3.125,7.59375 0,5.966037 -4.815213,10.8125 -10.78125,10.8125 -5.966037,0 -10.8125,-4.846463 -10.8125,-10.8125 0,-5.966037 4.846463,-10.78125 10.8125,-10.78125 1.436316,0 2.808849,0.272336 4.0625,0.78125 l 2.15625,-3.25 -1.15625,0 c -3.015796,0 -5.4375,-2.421704 -5.4375,-5.4375 l 0,-15.15625 c 0,-3.015797 2.421704,-5.4375 5.4375,-5.4375 l 23.28125,0 0,-13.28125 c 0,-1.427539 1.166205,-2.5625 2.59375,-2.5625 z m -30.9375,52.96875 c -1.193206,0 -2.15625,0.963044 -2.15625,2.15625 0,1.193206 0.963044,2.15625 2.15625,2.15625 1.193206,0 2.15625,-0.963044 2.15625,-2.15625 0,-1.193206 -0.963044,-2.15625 -2.15625,-2.15625 z m 24.1875,0 c -1.193206,0 -2.15625,0.963044 -2.15625,2.15625 0,1.193206 0.963043,2.15625 2.15625,2.15625 1.193205,0 2.15625,-0.963044 2.15625,-2.15625 0,-1.193206 -0.963044,-2.15625 -2.15625,-2.15625 z m 24.1875,0 c -1.193206,0 -2.15625,0.963044 -2.15625,2.15625 0,1.193206 0.963044,2.15625 2.15625,2.15625 1.193213,0 2.15625,-0.963044 2.15625,-2.15625 0,-1.193206 -0.963037,-2.15625 -2.15625,-2.15625 z"
     id="path2983"
     inkscape:connector-curvature="0" />
  <rect
     style="fill:none;stroke:none"
     id="rect3094"
     width="100"
     height="100"
     x="-2e-06"
     y="-2.9999999e-06"
     rx="0" />
</svg>
