<?xml version="1.0" encoding="UTF-8" standalone="no"?>
<!-- Generator: Adobe Illustrator 16.0.0, SVG Export Plug-In . SVG Version: 6.00 Build 0)  -->

<svg
   xmlns:dc="http://purl.org/dc/elements/1.1/"
   xmlns:cc="http://creativecommons.org/ns#"
   xmlns:rdf="http://www.w3.org/1999/02/22-rdf-syntax-ns#"
   xmlns:svg="http://www.w3.org/2000/svg"
   xmlns="http://www.w3.org/2000/svg"
   xmlns:sodipodi="http://sodipodi.sourceforge.net/DTD/sodipodi-0.dtd"
   xmlns:inkscape="http://www.inkscape.org/namespaces/inkscape"
   version="1.1"
   id="Capa_1"
   x="0px"
   y="0px"
   width="100"
   height="99.5"
   viewBox="0 0 100 99.5"
   xml:space="preserve"
   inkscape:version="0.48.4 r9939"
   sodipodi:docname="firefighter.svg"><metadata
     id="metadata3044"><rdf:RDF><cc:Work
         rdf:about=""><dc:format>image/svg+xml</dc:format><dc:type
           rdf:resource="http://purl.org/dc/dcmitype/StillImage" /></cc:Work></rdf:RDF></metadata><defs
     id="defs3042" /><sodipodi:namedview
     pagecolor="#ffffff"
     bordercolor="#666666"
     borderopacity="1"
     objecttolerance="10"
     gridtolerance="10"
     guidetolerance="10"
     inkscape:pageopacity="0"
     inkscape:pageshadow="2"
     inkscape:window-width="1920"
     inkscape:window-height="1176"
     id="namedview3040"
     showgrid="false"
     inkscape:snap-center="false"
     inkscape:snap-object-midpoints="false"
     showguides="true"
     inkscape:guide-bbox="true"
     inkscape:object-nodes="true"
     inkscape:snap-smooth-nodes="true"
     inkscape:object-paths="false"
     inkscape:snap-midpoints="true"
     inkscape:zoom="2.6997323"
     inkscape:cx="-42.246762"
     inkscape:cy="39.549029"
     inkscape:window-x="0"
     inkscape:window-y="24"
     inkscape:window-maximized="1"
     inkscape:current-layer="Capa_1"
     fit-margin-top="0"
     fit-margin-left="0"
     fit-margin-right="0"
     fit-margin-bottom="0" /><path
     sodipodi:type="arc"
     style="fill:#ffffff;fill-opacity:1;fill-rule:nonzero;stroke:none"
     id="path2983"
     sodipodi:cx="-150.01488"
     sodipodi:cy="35.419571"
     sodipodi:rx="105.93643"
     sodipodi:ry="58.153915"
     d="m -44.078445,35.419571 a 105.93643,58.153915 0 1 1 -211.872865,0 105.93643,58.153915 0 1 1 211.872865,0 z"
     transform="matrix(0.47198116,0,0,0.85978734,120.8042,19.296701)" /><path
     style="fill:#aa8800;fill-opacity:1;fill-rule:nonzero;stroke:none"
     d="M 50 -0.25 C 22.385763 -0.25 1.5533243e-16 22.135762 0 49.75 C 9.4739031e-15 77.364238 22.385763 99.75 50 99.75 C 77.614237 99.75 100 77.364238 100 49.75 C 100 22.135762 77.614237 -0.25 50 -0.25 z M 44.8125 12.25 L 55.34375 12.25 C 56.548323 12.25 57.52052 13.232927 57.53125 14.4375 L 57.53125 16.5 C 66.729802 18.821539 73.625 27.170853 73.625 37.125 L 73.625 38.0625 C 70.996843 38.719539 68.337296 39.628228 65.90625 40.84375 C 59.051028 44.260356 50.971514 44.73745 50.0625 44.78125 C 49.164656 44.748398 41.073861 44.271306 34.21875 40.84375 C 31.798654 39.639178 29.159407 38.719539 26.53125 38.0625 L 26.53125 37.15625 C 26.53125 27.202102 33.426447 18.852791 42.625 16.53125 L 42.625 14.4375 C 42.625 13.232927 43.607928 12.25 44.8125 12.25 z M 50 24.8125 C 47.842721 24.8125 45.975947 26.138389 45.1875 28 C 44.924684 28.657039 44.8125 29.319457 44.8125 30.03125 C 44.8125 32.900323 47.130928 35.21875 50 35.21875 C 52.869073 35.21875 55.1875 32.911273 55.1875 30.03125 C 55.1875 29.319457 55.075316 28.657039 54.8125 28 C 54.035003 26.138389 52.15728 24.8125 50 24.8125 z M 18.03125 41.59375 C 20.747014 41.59375 23.684079 41.983455 26.53125 42.75 C 28.721382 43.330385 30.908314 44.147188 33 45.1875 C 40.895315 49.129737 50.0625 49.40625 50.0625 49.40625 C 50.0625 49.40625 59.229576 49.129737 67.125 45.1875 C 69.216576 44.136237 71.403618 43.299135 73.59375 42.71875 C 76.440921 41.963155 79.337388 41.59375 82.03125 41.59375 C 84.341839 41.59375 86.500945 41.880618 88.40625 42.40625 C 89.41382 42.680017 90.08761 43.647188 90 44.6875 C 89.704332 48.290267 89.029442 56.872484 77.53125 65.46875 L 77.53125 53.46875 C 77.53125 53.46875 75.267862 54.336026 73.40625 55.5625 L 73.40625 63.90625 C 73.40625 76.773273 62.929523 87.25 50.0625 87.25 C 37.195477 87.25 26.71875 76.773273 26.71875 63.90625 L 26.71875 55.65625 C 24.857138 54.385974 22.34375 53.46875 22.34375 53.46875 L 22.34375 65.46875 C 10.955066 56.872484 10.284717 48.268365 10 44.6875 C 9.923345 43.647188 10.61754 42.680016 11.625 42.40625 C 13.541365 41.880618 15.720662 41.59375 18.03125 41.59375 z "
     id="path3754" /><rect
     style="fill:none;stroke:none"
     id="rect3138"
     width="99.5"
     height="99.5"
     x="0.25"
     y="0" /></svg>