{
	"info": {
		"_postman_id": "04b3ef75-1f09-46ae-aa32-5dabb7b66552",
		"name": "prueba-tecnica-hulkstore",
		"schema": "https://schema.getpostman.com/json/collection/v2.1.0/collection.json",
		"_exporter_id": "9038089"
	},
	"item": [
		{
			"name": "obtener movimientos de un producto",
			"request": {
				"method": "GET",
				"header": [
					{
						"key": "Authorization",
						"value": "token",
						"type": "text"
					}
				],
				"url": {
					"raw": "localhost:8080/store/product/api/v1/product/27",
					"host": [
						"localhost"
					],
					"port": "8080",
					"path": [
						"store",
						"product",
						"api",
						"v1",
						"product",
						"27"
					]
				}
			},
			"response": []
		},
		{
			"name": "crear producto",
			"request": {
				"method": "PUT",
				"header": [
					{
						"key": "Authorization",
						"value": "token123",
						"type": "text"
					}
				],
				"body": {
					"mode": "raw",
					"raw": "{\r\n    \"productName\":\"mesas\",\r\n    \"productImage\":\"mesas.png\",\r\n    \"newInventaryProduct\": {\r\n        \"existInventaryQty\": \"600\",\r\n        \"existUnitPrice\": \"30\",\r\n        \"existTotalPrice\": null\r\n    }\r\n}",
					"options": {
						"raw": {
							"language": "json"
						}
					}
				},
				"url": {
					"raw": "localhost:8080/store/product/api/v1/product/27",
					"host": [
						"localhost"
					],
					"port": "8080",
					"path": [
						"store",
						"product",
						"api",
						"v1",
						"product",
						"27"
					]
				}
			},
			"response": []
		},
		{
			"name": "agregar inventario a un producto",
			"request": {
				"method": "PUT",
				"header": [
					{
						"key": "Authorization",
						"value": "token123",
						"type": "text"
					}
				],
				"body": {
					"mode": "raw",
					"raw": "{\r\n    \"inflowInventaryProduct\": {\r\n        \"inflowInventaryQty\": \"50\",\r\n        \"inflowUnitPrice\": \"35\",\r\n        \"inflowTotalPrice\": null\r\n    }\r\n}",
					"options": {
						"raw": {
							"language": "json"
						}
					}
				},
				"url": {
					"raw": "localhost:8080/store/product/api/v1/product-inflow/27",
					"host": [
						"localhost"
					],
					"port": "8080",
					"path": [
						"store",
						"product",
						"api",
						"v1",
						"product-inflow",
						"27"
					]
				}
			},
			"response": []
		},
		{
			"name": "descontar inventario a un producto",
			"request": {
				"method": "PUT",
				"header": [
					{
						"key": "Authorization",
						"value": "token123",
						"type": "text"
					}
				],
				"body": {
					"mode": "raw",
					"raw": "{\r\n    \"outflowInventaryProduct\": {\r\n        \"outflowInventaryQty\": \"1\",\r\n        \"outflowUnitPrice\": null,\r\n        \"outflowTotalPrice\": null\r\n    }\r\n}",
					"options": {
						"raw": {
							"language": "json"
						}
					}
				},
				"url": {
					"raw": "localhost:8080/store/product/api/v1/product-outflow/30",
					"host": [
						"localhost"
					],
					"port": "8080",
					"path": [
						"store",
						"product",
						"api",
						"v1",
						"product-outflow",
						"30"
					]
				}
			},
			"response": []
		},
		{
			"name": "obtener listado de productos",
			"request": {
				"method": "GET",
				"header": [
					{
						"key": "Authorization",
						"value": "token123",
						"type": "text"
					}
				],
				"url": {
					"raw": "localhost:8080/store/product/api/v1/product",
					"host": [
						"localhost"
					],
					"port": "8080",
					"path": [
						"store",
						"product",
						"api",
						"v1",
						"product"
					]
				}
			},
			"response": []
		}
	]
}