<?xml version="1.0" standalone="no"?>
<!DOCTYPE svg PUBLIC "-//W3C//DTD SVG 1.1//EN" "http://www.w3.org/Graphics/SVG/1.1/DTD/svg11.dtd" >
<svg xmlns="http://www.w3.org/2000/svg" xmlns:xlink="http://www.w3.org/1999/xlink" version="1.1" viewBox="-10 0 1119 1000">
  <g transform="matrix(1 0 0 -1 0 800)">
   <path fill="currentColor"
d="M1004.96 363.122c4.84961 -7.29395 5.65332 -16.9961 2.3291 -29.0615l-1.21191 -1.21289c0.801758 -4.84961 -0.410156 -10.9121 -3.63672 -18.2061c-3.22656 -7.27441 -4.84961 -12.1436 -4.84961 -14.5684c-0.821289 -2.44434 -2.22949 -5.6709 -4.24316 -9.71875
c-2.01367 -4.06738 -3.03027 -6.90332 -3.03027 -8.50684c-2.4248 -4.86914 -8.50684 -17.4238 -18.2061 -37.6436c-4.86914 -9.71875 -7.29395 -14.9795 -7.29395 -15.7812c0.782227 0.801758 3.03125 1.4082 6.66895 1.81934
c3.6377 0.391602 6.27734 1.81934 7.90039 4.24414c2.4248 3.22656 6.86426 4.84961 13.3564 4.84961c4.02832 0 7.0791 -2.01465 9.09277 -6.0625c2.01367 -4.06738 2.22852 -8.0957 0.605469 -12.1436c-0.821289 -2.4248 -1.64258 -5.47559 -2.4248 -9.11328
c-0.821289 -3.6377 -1.21191 -6.27734 -1.21191 -7.88086c-3.24609 -11.3613 -6.08203 -18.6357 -8.50684 -21.8623c-7.27441 -16.1914 -14.1582 -29.1367 -20.6309 -38.8555c-12.1436 -20.2393 -25.5 -41.2803 -40.0684 -63.1426
c-6.47266 -10.5205 -17.4043 -19.418 -32.7744 -26.7119c-4.84961 -2.4248 -10.1299 -4.84961 -15.7812 -7.27441c-5.6709 -2.4248 -11.9482 -5.06445 -18.8125 -7.90039c-6.88379 -2.81641 -12.3594 -5.45605 -16.3877 -7.88086
c-0.801758 0 -2.63965 -0.801758 -5.45605 -2.4248c-2.83594 -1.60352 -4.67383 -2.4248 -5.45605 -2.4248c-3.24609 -1.60352 -7.70508 -3.22656 -13.3564 -4.84961c-5.6709 -1.60352 -9.71875 -2.4248 -12.1436 -2.4248
c-11.3418 -4.04785 -18.6357 -6.88379 -21.8623 -8.50684c-3.24609 -1.60352 -7.09863 -2.81641 -11.5381 -3.6377c-4.45898 -0.801758 -9.30859 -1.4082 -14.5693 -1.81934c-5.28027 -0.390625 -9.52344 -0.99707 -12.75 -1.81836
c-1.62305 0 -6.88379 -1.21289 -15.7812 -3.6377c-28.3555 -7.29395 -44.5273 -10.9316 -48.5752 -10.9316c-3.24609 -0.782227 -7.88086 -1.81836 -13.9629 -3.03125s-9.52344 -1.81934 -10.3252 -1.81934c-1.64258 -0.801758 -6.08203 -1.60352 -13.3564 -2.4248
c-1.62305 0 -5.47559 -0.390625 -11.5381 -1.21191c-6.0625 -0.801758 -10.7363 -1.21289 -13.9629 -1.21289c-1.62305 -0.801758 -4.84961 -1.60352 -9.69922 -2.4248c-4.86914 -0.801758 -8.50684 -1.21289 -10.9316 -1.21289
c-11.3418 -0.801758 -21.4521 -0.801758 -30.3496 0c-8.91699 0.801758 -19.8291 2.03418 -32.7744 3.6377c-1.62305 0.821289 -3.6377 1.62305 -6.0625 2.4248s-4.45898 1.62305 -6.08203 2.4248c-1.62305 0 -7.27441 0.821289 -16.9932 2.4248
c-1.62305 0.821289 -2.83594 0.821289 -3.6377 0c-4.06738 -1.62305 -12.5547 -0.410156 -25.5 3.6377c-3.24609 0.821289 -6.49219 1.62305 -9.71875 2.4248c-7.29395 0.801758 -29.1367 6.88379 -65.5684 18.2061c-2.4248 0.801758 -6.08203 1.4082 -10.9316 1.81934
c-4.86914 0.411133 -7.70508 0.606445 -8.50684 0.606445c-6.47266 0.821289 -12.124 1.62305 -16.9932 2.4248c-4.84961 0.801758 -14.5684 3.22656 -29.1367 7.27441c-4.06738 0.821289 -6.49219 1.62305 -7.29395 2.4248
c-1.64258 0.821289 -10.5205 4.45898 -26.7119 10.9316c-3.24609 0.801758 -8.31055 3.03125 -15.1748 6.66895c-6.88379 3.65723 -12.3398 6.27734 -16.3877 7.90039s-8.31055 3.44141 -12.75 5.47559c-4.45898 2.01465 -9.11328 4.87012 -13.9629 8.50781
c-4.86914 3.65723 -8.50684 6.27734 -10.9316 7.90039c-6.49219 3.22656 -15.3896 10.1104 -26.7119 20.6504c-4.04785 4.04785 -10.5205 8.89746 -19.418 14.5684c-8.91699 5.65137 -14.5684 9.30859 -16.9932 10.9316c-20.2393 15.3701 -34.0059 29.5283 -41.2803 42.4932
c-1.62305 2.4248 -3.6377 5.24121 -6.0625 8.4873c-2.4248 3.22656 -4.45898 6.08203 -6.0625 8.50684c-9.71875 17.0127 -16.2109 28.7266 -19.4375 35.2188c-8.0957 18.6162 -11.7529 31.5811 -10.9316 38.8555l-1.21289 4.84961
c8.07617 3.22656 16.1914 3.22656 24.2871 0c2.4248 -1.62305 7.27441 -3.22656 14.5684 -4.84961l7.29395 1.21289c-7.27441 16.9932 -11.3418 26.3018 -12.1436 27.9248c-0.821289 1.62305 -1.42773 3.65723 -1.81836 6.08203
c-0.411133 2.4248 -0.822266 4.24316 -1.21289 5.45605c-0.411133 1.21191 -1.4082 4.2627 -3.03125 9.1123c-1.64258 4.84961 -2.63965 8.68262 -3.03027 11.5381c-0.411133 2.81641 -0.606445 9.50391 -0.606445 20.0244c0 15.3506 0.390625 25.8906 1.21191 31.5615
l6.0625 10.9316l32.7744 -15.7812v14.5684c0 20.2197 2.44434 39.6377 7.29395 58.2734c1.62305 8.07617 4.43945 18.2061 8.50684 30.3496c0.801758 2.4248 3.22656 4.43945 7.29395 6.0625c4.04785 1.62305 7.29395 2.01367 9.71875 1.21191
c9.69922 -4.04785 16.5635 -8.91699 20.6309 -14.5684l2.4248 -4.84961c0 0.801758 0.390625 1.21191 1.21191 1.21191l2.4248 6.0625c0.977539 9.23047 3.24609 20.2012 6.84473 32.9316c4.36035 15.4092 10.1094 30.291 16.4648 44.9971
c3.05078 7.0791 7.02051 16.3096 11.9092 27.71c7.27441 15.3506 12.1436 25.8906 14.5684 31.5615c0.801758 1.60352 1.60352 3.83301 2.4248 6.66895c0.801758 2.83594 1.60352 5.06543 2.4248 6.68848c1.62305 4.02832 4.6543 9.69922 9.11328 16.9932
c4.43945 7.27441 7.49023 12.9258 9.11328 16.9932c1.62305 2.4248 4.24316 7.27441 7.90039 14.5684c3.6377 7.27441 6.27734 12.9258 7.90039 16.9932c7.29395 12.1436 15.8008 25.0889 25.5 38.8555c6.47266 10.501 15.7812 23.4658 27.9248 38.8555
c8.07617 10.501 16.1914 21.041 24.2871 31.5615c1.62305 1.62305 4.84961 5.04492 9.71875 10.3252c4.86914 5.26074 8.50684 9.11328 10.9316 11.5381c4.84961 7.29395 8.50684 11.3223 10.9316 12.1436c4.04785 3.22656 8.07617 3.63672 12.1436 1.21191
c8.07617 -5.6709 14.1582 -10.1299 18.2061 -13.3564c1.62305 -1.64258 5.26074 -5.6709 10.9316 -12.1436c21.8623 -22.6641 35.2188 -36.8418 40.0684 -42.4932c1.62305 -1.62305 3.24609 -4.04785 4.86914 -7.27441c1.60352 -3.22656 3.22656 -5.26074 4.84961 -6.0625
c2.4248 -3.22656 7.0791 -9.30859 13.9629 -18.2061c4.32129 -5.6123 8.07617 -10.4033 11.2832 -14.3926c4.79102 -5.96484 9.21094 -11.9092 13.6504 -18.1475c4.45898 -6.27734 10.5215 -14.8623 18.1875 -25.7549c9.71875 -13.7666 15.3701 -22.2734 16.9932 -25.5
c1.60352 -1.64258 3.22656 -4.47852 4.84961 -8.50684c1.60352 -4.06738 2.81543 -6.90332 3.63672 -8.50684c4.04785 -8.0957 8.07617 -15.7812 12.1436 -23.0752c0.801758 -1.62305 1.60352 -2.4248 2.4248 -2.4248c1.60352 0.782227 2.81543 2.01465 3.63672 3.6377
c3.22656 8.0957 9.30859 15.3701 18.2256 21.8623c5.65137 3.22656 10.501 3.63672 14.5684 1.21191c4.02832 -2.4248 6.0625 -6.49219 6.0625 -12.1436c0 -1.64258 0.801758 -8.11523 2.4248 -19.4375c14.5879 -1.64258 26.3018 3.6377 35.2188 15.7812
c0.801758 2.4248 7.29395 10.1104 19.4375 23.0752c10.501 12.1436 16.9932 19.4375 19.418 21.8623c1.0166 1.03613 2.05273 2.05273 3.08887 3.06934c9.83594 9.69922 20.2002 18.6553 30.9951 27.2793c6.62891 5.2998 15.5068 12.5742 26.6338 21.8633
c2.4248 0.801758 3.63672 1.60352 3.63672 2.4248c1.62305 0.782227 4.43945 2.60059 8.50684 5.45605c4.04785 2.81641 7.0791 5.0459 9.11328 6.66895c2.01465 1.60352 5.47559 3.83301 10.3252 6.66895s8.89746 5.47559 12.1436 7.90039
c4.02832 2.4248 10.1104 6.6875 18.2061 12.75c8.07617 6.08203 13.7471 10.3252 16.9932 12.75c0.782227 0 2.60059 0.606445 5.45605 1.81934c2.83594 1.21289 4.24414 2.20996 4.24414 3.03125c1.60352 3.20703 3.83301 5.65137 6.66895 7.27441
c2.83594 1.60352 6.08203 2.62012 9.71973 3.03027c3.65723 0.391602 6.27734 1.21289 7.90039 2.42578c1.60352 1.21191 3.6377 0.605469 6.0625 -1.81934c2.44434 -2.44434 4.04785 -4.45898 4.86914 -6.08203c0.782227 -5.6709 2.01465 -13.7666 3.6377 -24.2871
c1.62305 -10.54 2.83496 -18.2256 3.65625 -23.0752c0 -1.62305 0.195312 -4.24316 0.605469 -7.88086c0.390625 -3.65723 0.99707 -6.29688 1.81836 -7.90039c0.801758 -4.04785 2.22949 -9.91406 4.26367 -17.5996c1.99512 -7.70508 3.42285 -13.5518 4.24414 -17.5996
c0.782227 -3.24609 1.81836 -8.0957 3.03125 -14.5684c1.21191 -6.49219 2.20898 -11.3418 3.03027 -14.5684c1.60352 -6.49219 3.6377 -15.585 6.0625 -27.3184c2.44434 -11.7529 4.2627 -20.0439 5.47559 -24.8936c1.21191 -4.86914 2.81543 -12.1436 4.84961 -21.8623
c1.99414 -9.71875 3.42188 -16.2109 4.24316 -19.4375c0 -1.64258 0.801758 -5.47559 2.4248 -11.5381c1.62305 -6.08203 2.81543 -10.7363 3.63672 -13.9629c0.782227 -10.5205 2.01465 -29.1367 3.6377 -55.8496c0.801758 -17.8145 1.21191 -31.5615 1.21191 -41.2803
c0 -5.6709 -0.411133 -18.6357 -1.21289 -38.8555c0 -3.24609 -0.214844 -8.31055 -0.605469 -15.1748c-0.411133 -6.88379 -0.606445 -11.5381 -0.606445 -13.9629c0 -4.84961 1.81836 -6.0625 5.45605 -3.6377s12.3203 7.68555 26.1064 15.7812
c7.27441 4.86914 13.7471 4.04785 19.418 -2.4248z" />
  </g>

</svg>
