<?xml version="1.0" encoding="UTF-8" standalone="no"?>
<!-- Created with Inkscape (http://www.inkscape.org/) -->

<svg
   width="128.0px"
   height="128.0px"
   viewBox="0 0 128.0 128.0"
   version="1.1"
   id="SVGRoot"
   sodipodi:docname="market.svg"
   inkscape:version="1.2.2 (1:1.2.2+202212051550+b0a8486541)"
   xmlns:inkscape="http://www.inkscape.org/namespaces/inkscape"
   xmlns:sodipodi="http://sodipodi.sourceforge.net/DTD/sodipodi-0.dtd"
   xmlns="http://www.w3.org/2000/svg"
   xmlns:svg="http://www.w3.org/2000/svg">
  <sodipodi:namedview
     id="namedview38447"
     pagecolor="#878787"
     bordercolor="#666666"
     borderopacity="1.0"
     inkscape:showpageshadow="2"
     inkscape:pageopacity="0"
     inkscape:pagecheckerboard="0"
     inkscape:deskcolor="#d1d1d1"
     inkscape:document-units="px"
     showgrid="true"
     inkscape:zoom="4.7627763"
     inkscape:cx="54.485028"
     inkscape:cy="47.976219"
     inkscape:window-width="1920"
     inkscape:window-height="1016"
     inkscape:window-x="0"
     inkscape:window-y="27"
     inkscape:window-maximized="1"
     inkscape:current-layer="layer1">
    <inkscape:grid
       type="xygrid"
       id="grid38570" />
  </sodipodi:namedview>
  <defs
     id="defs38442">
    <clipPath
       clipPathUnits="userSpaceOnUse"
       id="clipPath34913">
      <g
         id="g34921">
        <g
           id="g34919">
          <g
             id="g34917">
            <path
               d="M 0,0 H 612 V 792 H 0 Z"
               id="path34915" />
          </g>
        </g>
      </g>
    </clipPath>
    <clipPath
       clipPathUnits="userSpaceOnUse"
       id="clipPath1266">
      <path
         d="m 383.486,242.638 h 35.452 v 35.932 h -35.452 z"
         id="path1264" />
    </clipPath>
  </defs>
  <g
     inkscape:label="Layer 1"
     inkscape:groupmode="layer"
     id="layer1">
    <path
       d="m 30.763335,93.772799 c 2.413333,4.682667 5.362667,8.842671 8.746666,12.293331 h 6.752 c -1.304,-4.176 -2.370666,-8.279998 -3.218666,-12.293331 z"
       style="fill:#000000;fill-opacity:1;fill-rule:nonzero;stroke:none;stroke-width:2.66667"
       id="path1348"
       clip-path="none" />
    <path
       d="M 76.654,21.931734 H 64.888667 V 34.553067 H 80.547333 C 79.128667,28.795734 77.635333,24.478401 76.654,21.931734"
       style="fill:#000000;fill-opacity:1;fill-rule:nonzero;stroke:none;stroke-width:2.66667"
       id="path1352"
       clip-path="none" />
    <path
       d="M 48.133201,106.0672 H 63.106534 V 93.773867 H 44.861201 c 0.861333,4.013333 1.946667,8.117333 3.272,12.293333"
       style="fill:#000000;fill-opacity:1;fill-rule:nonzero;stroke:none;stroke-width:2.66667"
       id="path1356"
       clip-path="none" />
    <path
       d="M 64.889734,93.772799 V 106.06613 H 78.1244 c 1.325334,-4.176 2.413334,-8.282664 3.274667,-12.293331 z"
       style="fill:#000000;fill-opacity:1;fill-rule:nonzero;stroke:none;stroke-width:2.66667"
       id="path1360"
       clip-path="none" />
    <path
       d="m 64.889734,45.128267 v 38.069332 h 18.328 C 85.121733,68.586933 84.3404,55.554933 82.679067,45.128267 Z"
       style="fill:#000000;fill-opacity:1;fill-rule:nonzero;stroke:none;stroke-width:2.66667"
       id="path1364"
       clip-path="none" />
    <path
       d="M 63.107334,34.5528 V 21.931467 H 49.606001 c -0.978667,2.546667 -2.472,6.864 -3.888,12.621333 z"
       style="fill:#000000;fill-opacity:1;fill-rule:nonzero;stroke:none;stroke-width:2.66667"
       id="path1368"
       clip-path="none" />
    <path
       d="M 41.788135,45.128267 H 26.225469 c -1.602667,5.765333 -2.488,11.992 -2.488,18.498666 0,6.912 1.002666,13.506667 2.802666,19.570666 H 41.249468 C 39.380135,68.626933 40.142802,55.6056 41.788135,45.128267"
       style="fill:#000000;fill-opacity:1;fill-rule:nonzero;stroke:none;stroke-width:2.66667"
       id="path1372"
       clip-path="none" />
    <path
       d="M 101.774,45.128267 H 84.47 c 1.645334,10.477333 2.408,23.498666 0.538667,38.069332 h 16.450663 c 1.79734,-6.063999 2.8,-12.658666 2.8,-19.570666 0,-6.506666 -0.88266,-12.733333 -2.48533,-18.498666"
       style="fill:#000000;fill-opacity:1;fill-rule:nonzero;stroke:none;stroke-width:2.66667"
       id="path1376"
       clip-path="none" />
    <path
       d="m 79.996667,106.0672 h 8.490666 c 3.384,-3.45067 6.333334,-7.610666 8.746667,-12.293333 H 83.215334 c -0.848,4.013333 -1.914667,8.117333 -3.218667,12.293333"
       style="fill:#000000;fill-opacity:1;fill-rule:nonzero;stroke:none;stroke-width:2.66667"
       id="path1380"
       clip-path="none" />
    <path
       d="M 43.046001,83.198666 H 63.107334 V 45.129334 H 43.584668 C 41.926001,55.556 41.144668,68.588 43.046001,83.198666"
       style="fill:#000000;fill-opacity:1;fill-rule:nonzero;stroke:none;stroke-width:2.66667"
       id="path1384"
       clip-path="none" />
    <path
       d="M 97.779066,34.5528 C 95.437733,29.766133 92.541733,25.4968 89.2004,21.931467 H 78.557733 c 1.021333,2.733333 2.461333,7.04 3.813333,12.621333 z"
       style="fill:#000000;fill-opacity:1;fill-rule:nonzero;stroke:none;stroke-width:2.66667"
       id="path1388"
       clip-path="none" />
    <path
       d="m 47.700934,21.931734 h -8.904 c -3.341333,3.565333 -6.237333,7.834666 -8.578666,12.621333 h 13.669333 c 1.352,-5.581333 2.792,-9.890666 3.813333,-12.621333"
       style="fill:#000000;fill-opacity:1;fill-rule:nonzero;stroke:none;stroke-width:2.66667"
       id="path1392"
       clip-path="none" />
    <path
       d="m 43.880668,43.345867 h 19.226666 1.781333 17.496 1.797333 17.06933 C 100.49667,40.9112 99.608667,38.572534 98.606,36.337867 H 82.787334 80.974 64.888667 63.107334 45.291335 43.470001 29.390002 c -1.002667,2.234667 -1.890667,4.573333 -2.642667,7.008 h 15.328 z"
       style="fill:#000000;fill-opacity:1;fill-rule:nonzero;stroke:none;stroke-width:2.66667"
       id="path1396"
       clip-path="none" />
    <path
       d="m 82.978267,84.981066 h -18.088 -1.784 -19.821332 -1.797334 -14.405333 c 0.8,2.44 1.746667,4.776 2.8,7.008 h 12.8 1.816 18.607999 1.784 16.872 1.816 14.536 c 1.056,-2.232 2.000003,-4.568 2.802663,-7.008 H 84.770267 Z"
       style="fill:#000000;fill-opacity:1;fill-rule:nonzero;stroke:none;stroke-width:2.66667"
       id="path1400"
       clip-path="none" />
  </g>
</svg>
