<?xml version="1.0" standalone="no"?>
<!DOCTYPE svg PUBLIC "-//W3C//DTD SVG 1.1//EN" "http://www.w3.org/Graphics/SVG/1.1/DTD/svg11.dtd" >
<svg xmlns="http://www.w3.org/2000/svg" xmlns:xlink="http://www.w3.org/1999/xlink" version="1.1" viewBox="-10 0 1087 1000">
  <g transform="matrix(1 0 0 -1 0 800)">
   <path fill="currentColor"
d="M971.238 203.195c1.56445 -7.02051 0.392578 -13.6641 -3.53809 -19.7461c-3.91113 -6.23828 -9.36719 -10.1494 -16.3877 -11.6943c-19.5156 -5.47559 -31.21 -8.60449 -35.1016 -9.36719c-12.4766 -2.34668 -26.5176 -5.47559 -42.1035 -9.36719
c-15.625 -3.91113 -30.0371 -6.25781 -43.2959 -7.02051c-0.782227 0 -3.32422 -0.586914 -7.60645 -1.75977c-4.30176 -1.17285 -8.01758 -1.36816 -11.127 -0.585938c-4.67383 -1.58398 -11.6943 -2.54199 -21.0615 -2.93262
c-9.36719 -0.411133 -16.3682 -0.998047 -21.0615 -1.76074c-1.56445 -0.782227 -4.47852 -1.17285 -8.76074 -1.17285h-9.95312c-3.10938 -0.782227 -9.17188 -1.58398 -18.1279 -2.34668c-8.97559 -0.801758 -15.8008 -1.95508 -20.4746 -3.51953
c-0.801758 -0.782227 -2.34668 -0.782227 -4.69336 0c-3.12891 0.762695 -7.60742 0.762695 -13.4541 0c-5.84668 -0.782227 -10.1484 -0.99707 -12.8662 -0.585938c-2.7373 0.390625 -4.08691 -0.978516 -4.08691 -4.08789c0 -3.93066 -0.782227 -9.5625 -2.34668 -16.9736
c-1.58398 -7.41113 -2.34668 -11.8896 -2.34668 -13.4541c-0.801758 -3.12891 -1.17383 -7.60742 -1.17383 -13.4541v-12.2803c-0.801758 -4.69336 -2.34668 -9.73828 -4.69336 -15.2139c-1.42773 -3.55859 -4.47852 -15.2334 -9.13281 -35.0234
c-0.879883 -3.79395 -1.95508 -7.7832 -3.1084 -11.5186l-7.62598 -24.8145c-3.12891 -10.1299 -5.84668 -18.7148 -8.19336 -25.7354c-5.45605 -15.6055 -10.9121 -27.6904 -16.3682 -36.2754c-0.782227 -1.54492 -1.75977 -3.8916 -2.93359 -7.02051
c-1.17383 -3.10938 -2.15137 -5.45605 -2.91406 -7.02051c-6.25781 -8.58496 -10.5205 -13.6494 -12.8672 -15.2139c-5.45605 -3.10938 -10.5205 -2.71777 -15.1943 1.17383c-4.67383 3.91113 -8.97559 5.84668 -12.8672 5.84668
c-0.782227 0 -1.93555 0.411133 -3.5 1.17383c-2.34668 1.56445 -5.84668 4.30176 -10.54 8.19336c-4.67383 3.91113 -8.17383 6.62891 -10.5205 8.19336c-12.4961 8.58496 -21.8438 16.7783 -28.082 24.5615c-3.73535 4.34082 -6.90332 8.01758 -9.52344 11.0098
c-5.72949 6.55078 -10.9512 13.5322 -15.6445 20.8652c-3.10938 4.86914 -6.8252 10.6182 -11.1074 17.2471c-0.782227 0.782227 -1.74023 1.75977 -2.91309 2.93262s-1.75977 2.16992 -1.75977 2.93262c-1.58398 2.32715 -5.28027 7.58789 -11.127 15.7812
s-10.3447 14.627 -13.4541 19.3008c0 1.56445 -1.74023 5.84668 -5.25977 12.8672c-3.5 7.02051 -6.82422 12.4961 -9.93359 16.3877c-2.34668 3.10938 -5.6709 8.58496 -9.95312 16.3877s-7.99805 13.2588 -11.1074 16.3877
c-4.69336 6.23828 -7.02051 11.3027 -7.02051 15.2139c0.762695 2.34668 -0.801758 4.28223 -4.69336 5.84668c-0.469727 0.175781 -0.939453 0.332031 -1.40918 0.507812c-19.3594 7.02051 -39.7363 11.0098 -60.3086 10.3447
c-1.91602 -0.0585938 -3.55859 -0.15625 -4.9668 -0.3125c-10.9316 -1.56445 -22.6455 -1.17383 -35.1025 1.17285h-7.02051c-3.12891 -0.782227 -8.38965 -0.99707 -15.8008 -0.585938c-7.43066 0.391602 -12.4951 0.586914 -15.2129 0.586914
c-2.7373 0 -6.82422 0.390625 -12.2803 1.17285c-5.45605 0.762695 -8.97559 1.17383 -10.5205 1.17383h-30.8584c-4.36035 0 -8.93652 0.117188 -13.2969 0.449219c-21.5498 1.60352 -37.624 4.16504 -48.2422 7.72363c-3.12891 0.782227 -7.80273 1.75977 -14.041 2.93262
c-6.25781 1.15332 -10.9316 2.52246 -14.041 4.08691c-1.56445 0 -3.91113 0.782227 -7.02051 2.34668c-3.12891 1.54492 -5.45605 2.71777 -7.02051 3.5c-1.58398 0 -2.34668 1.54492 -2.34668 4.67383c-1.56445 10.9121 -3.10938 21.4326 -4.67383 31.582
c-0.782227 0.762695 -0.586914 1.93555 0.585938 3.5s1.34863 2.7373 0.585938 3.51953v11.1074c0 5.06445 -0.411133 8.76074 -1.17383 11.1074v2.34668v2.34668c0.782227 11.6943 3.8916 26.1064 9.36719 43.2764c1.54492 4.67383 3.8916 15.2139 7.02051 31.582
c3.8916 16.3877 8.56543 28.082 14.041 35.1025c0.762695 0.762695 1.54492 2.32715 2.32715 4.67383c0.762695 2.32715 1.17383 3.8916 1.17383 4.67383c0.782227 3.10938 2.15137 7.02051 4.10645 11.6943c1.93555 4.69336 3.30469 7.80273 4.08691 9.36719
c0.762695 2.32715 0.762695 3.8916 0 4.67383c-2.34668 2.34668 -2.73828 5.45605 -1.17383 9.36719c2.34668 4.69336 2.34668 7.80273 0 9.36719c-0.782227 0.782227 -0.391602 1.56445 1.17285 2.34668c4.67383 1.54492 7.02051 5.04492 7.02051 10.5205
c2.34668 2.32715 3.5 3.8916 3.5 4.67383c2.34668 5.43652 1.95605 9.34766 -1.15332 11.6943c-0.782227 0.762695 -1.17285 4.67383 -1.17285 11.6943c0.762695 10.1104 -1.17285 18.3037 -5.84668 24.5615c-2.34668 3.10938 -3.93066 10.1299 -4.69336 21.0615
c-0.782227 4.69336 -1.17285 7.80273 -1.17285 9.36719c-2.32715 3.8916 -1.56445 7.3916 2.34668 10.5205c1.56445 1.54492 1.93555 3.10938 1.17285 4.67383c-3.12891 17.1299 -5.08398 27.2793 -5.84668 30.4082c-0.782227 1.54492 -0.99707 3.30469 -0.585938 5.25977
c0.390625 1.93555 0.175781 3.69531 -0.586914 5.25977c-2.34668 19.4766 -2.73828 34.6904 -1.17383 45.6221c0.762695 3.8916 1.17383 9.73828 1.17383 17.541v18.7148c1.56445 17.1504 3.8916 33.5381 7.02051 49.1436c4.67383 19.4775 7.41113 30.4092 8.19336 32.7559
c0.762695 3.08984 3.8916 13.2393 9.34766 30.4092c7.02051 21.0605 14.4316 38.6016 22.2344 52.6426c0.782227 2.32715 2.34668 6.02344 4.69336 11.1074c2.32715 5.06445 3.8916 9.15137 4.67383 12.2803c0.762695 0.782227 2.34668 3.30469 4.67383 7.60645
c2.34668 4.2627 4.28223 7.58691 5.84668 9.93359c2.34668 3.8916 4.69336 5.84668 7.02051 5.84668c1.56445 0 2.7373 0.390625 3.51953 1.17285c2.34668 6.23828 8.58496 8.56543 18.7148 7.02051c0.762695 0 2.52246 0.175781 5.25977 0.585938
c2.71777 0.390625 4.86914 0.585938 6.43359 0.585938h12.8672s11.3027 -0.410156 12.8672 -1.17285c16.3682 -5.47559 26.498 -9.75781 30.4092 -12.8672c8.58496 -4.69336 23.0166 -11.6943 43.2949 -21.0615c2.34668 -0.782227 8.19336 -4.67383 17.5605 -11.6943
c7.02051 -6.25781 15.5859 -12.8672 25.7354 -19.8877c7.02051 -4.69336 15.9766 -12.1045 26.9082 -22.2344c1.56445 -1.56445 4.67383 -4.08691 9.36719 -7.60645c4.67383 -3.51953 7.7832 -6.43359 9.34766 -8.78027c3.91113 -3.12891 13.6494 -12.4961 29.2549 -28.082
c0.782227 0 4.10645 -2.93359 9.95312 -8.78027s10.3252 -10.3447 13.4541 -13.4541c1.56445 -2.34668 4.47852 -5.28027 8.78027 -8.78027c4.2627 -3.51953 7.19629 -6.04199 8.76074 -7.60645s3.51953 -4.08691 5.84668 -7.60645
c2.34668 -3.51953 3.91113 -6.06152 4.69336 -7.60645c3.10938 -2.34668 5.84668 -2.34668 8.19336 0c5.43652 4.67383 8.95605 7.41113 10.5205 8.19336c8.58496 6.23828 14.4316 4.28223 17.5605 -5.84766c3.10938 -8.60449 4.67383 -14.041 4.67383 -16.3877
s1.17285 -2.73828 3.5 -1.17383c2.32715 1.54492 4.28223 3.5 5.84668 5.84668c2.32715 3.08984 5.65137 4.47852 9.93359 4.08789c4.28223 -0.391602 7.21582 -2.54297 8.78027 -6.43457c2.34668 -3.91113 3.8916 -5.84668 4.67383 -5.84668
c1.56445 0 2.34668 1.17285 2.34668 3.51953c0.762695 0.782227 1.17285 1.56445 1.17285 2.34668c2.32715 3.10938 5.26074 8.56543 8.76074 16.3682c3.51953 7.7832 6.45312 13.6299 8.78027 17.541c1.56445 1.56445 9.36719 13.2588 23.4082 35.1016
c0.762695 1.54492 2.52246 5.04492 5.25977 10.5205c2.7373 5.43652 5.25977 9.34766 7.60645 11.6943c3.10938 3.8916 7.99805 10.5205 14.627 19.8877s11.8896 16.1729 15.8008 20.4746c3.8916 4.2627 9.93457 9.93359 18.1279 16.9541s13.8447 12.085 16.9736 15.2139
c8.56543 8.56543 21.8242 18.3037 39.7764 29.2354c6.23828 3.8916 15.3906 8.37012 27.4951 13.4541c12.085 5.06445 20.8652 9.15137 26.3213 12.2803c1.56445 0.762695 4.28223 1.34961 8.19336 1.75977c3.8916 0.391602 6.62891 0.978516 8.19336 1.76074
l2.32715 1.17285c5.45605 4.69336 10.54 5.86621 15.2139 3.51953c5.45605 -2.34668 10.54 -7.43066 15.2139 -15.2139c0.762695 -2.32715 2.71777 -6.04297 5.84668 -11.1074c3.10938 -5.08398 5.45605 -8.76074 7.02051 -11.1074
c10.1494 -17.9521 16.3877 -29.6465 18.7344 -35.1025c1.54492 -3.12891 6.21875 -12.1045 14.0215 -26.9082c7.7832 -15.6055 12.085 -24.1904 12.8672 -25.7354c0.762695 -0.782227 1.93652 -2.15137 3.50098 -4.08691
c1.56445 -1.95508 2.73828 -3.69531 3.52051 -5.25977c1.54492 -3.91113 3.69629 -10.1494 6.43359 -18.7148c2.71777 -8.60449 4.47754 -13.6689 5.25977 -15.2139c0.762695 -3.10938 2.13184 -8.58496 4.08691 -16.3682c1.95508 -7.80273 3.71484 -13.6494 5.2793 -17.541
l4.67383 -18.7139c3.10938 -10.9316 4.67383 -17.541 4.67383 -19.8877s0.390625 -6.84473 1.17285 -13.4541c0.782227 -6.62891 1.56445 -11.5176 2.34668 -14.627c0 -16.3682 0.390625 -26.9082 1.17285 -31.582c0.762695 -7.82227 0.371094 -17.5605 -1.17383 -29.2549
c-0.801758 -3.91113 -2.34668 -9.75781 -4.69336 -17.541c-2.32715 -7.80273 -3.5 -13.6494 -3.5 -17.541c-2.34668 -12.4961 -5.47559 -24.1904 -9.36719 -35.1025c-5.47559 -12.4961 -8.19336 -20.2988 -8.19336 -23.4082
c-0.782227 -0.782227 -1.93555 -2.15137 -3.5 -4.08691c-1.58398 -1.95508 -2.34668 -4.08691 -2.34668 -6.43359c-0.782227 -3.10938 -4.28223 -10.5205 -10.5205 -22.2148c-2.34668 -3.91113 -2.7373 -7.41113 -1.17285 -10.5205
c3.8916 -7.02051 9.36719 -17.9521 16.3877 -32.7559c0.762695 -1.56445 1.93555 -5.06445 3.5 -10.5205c1.54492 -3.12891 3.30469 -8.19336 5.25977 -15.2139s3.32422 -12.1045 4.10645 -15.2139c0.762695 -2.34668 1.34961 -5.28027 1.76074 -8.78027
c0.371094 -3.51953 0.958008 -6.43359 1.74023 -8.78027c5.45605 -18.7148 8.58496 -29.2354 9.36719 -31.582c0.762695 0 4.2627 -14.4316 10.5205 -43.2754c0.782227 -3.12891 1.75977 -8.38965 2.93359 -15.8008c1.17383 -7.43066 2.15137 -12.6914 2.93359 -15.8008z
" />
  </g>

</svg>
