<?xml version="1.0" encoding="UTF-8" standalone="no"?>
<!-- Created with Inkscape (http://www.inkscape.org/) -->

<svg
   width="128.0px"
   height="128.0px"
   viewBox="0 0 128.0 128.0"
   version="1.1"
   id="SVGRoot"
   sodipodi:docname="mouse-wo-outline.svg"
   inkscape:version="1.2.2 (1:1.2.2+202212051550+b0a8486541)"
   xmlns:inkscape="http://www.inkscape.org/namespaces/inkscape"
   xmlns:sodipodi="http://sodipodi.sourceforge.net/DTD/sodipodi-0.dtd"
   xmlns="http://www.w3.org/2000/svg"
   xmlns:svg="http://www.w3.org/2000/svg">
  <sodipodi:namedview
     id="namedview167530"
     pagecolor="#ffffff"
     bordercolor="#666666"
     borderopacity="1.0"
     inkscape:showpageshadow="2"
     inkscape:pageopacity="0.0"
     inkscape:pagecheckerboard="0"
     inkscape:deskcolor="#d1d1d1"
     inkscape:document-units="px"
     showgrid="true"
     inkscape:zoom="4.2835116"
     inkscape:cx="79.140675"
     inkscape:cy="86.961361"
     inkscape:window-width="1920"
     inkscape:window-height="1016"
     inkscape:window-x="0"
     inkscape:window-y="27"
     inkscape:window-maximized="1"
     inkscape:current-layer="layer1">
    <inkscape:grid
       type="xygrid"
       id="grid167653" />
  </sodipodi:namedview>
  <defs
     id="defs167525" />
  <g
     inkscape:label="Layer 1"
     inkscape:groupmode="layer"
     id="layer1">
    <path
       d="m 79.77801,87.086363 c -4.632462,0 -8.387701,-3.454819 -8.387701,-7.726779 0,-4.271959 3.755239,-7.732787 8.387701,-7.732787 4.632462,0 8.387701,3.460828 8.387701,7.732787 0,4.27196 -3.755239,7.726779 -8.387701,7.726779 m -31.55602,0 c -4.632462,0 -8.387701,-3.454819 -8.387701,-7.726779 0,-4.271959 3.755239,-7.732787 8.387701,-7.732787 4.63847,0 8.393709,3.460828 8.393709,7.732787 0,4.27196 -3.755239,7.726779 -8.393709,7.726779 M 86.585506,54.064298 c 2.751839,-7.264134 11.13954,-31.231568 4.620446,-37.594444 -7.708754,-7.5164853 -12.695711,-2.505495 -15.868136,0 -2.625663,2.0789 -3.701163,19.004511 -3.989565,31.183501 C 68.968932,47.208734 66.511503,46.974407 64,46.974407 c -2.517512,0 -4.97494,0.234327 -7.348251,0.678948 -0.288402,-12.17899 -1.363902,-29.104601 -3.995574,-31.183501 -3.172425,-2.505495 -8.159382,-7.5164853 -15.862127,0 -6.519094,6.362876 1.862598,30.33031 4.614437,37.594444 C 32.552131,60.325031 26.814126,70.154744 26.814126,81.234199 26.814126,100.1606 43.457343,115.5 64,115.5 c 20.536648,0 37.18587,-15.3394 37.18587,-34.265801 0,-11.079455 -5.738001,-20.909168 -14.600364,-27.169901"
       style="fill:#050505;fill-opacity:1;fill-rule:nonzero;stroke:none;stroke-width:6.00838"
       id="path117212" />
  </g>
</svg>
