<?xml version="1.0" encoding="UTF-8" standalone="no"?>
<svg
   version="1.1"
   viewBox="0 0 128 128"
   id="svg6"
   sodipodi:docname="keepers.svg"
   width="128"
   height="128"
   inkscape:version="1.2.2 (1:1.2.2+202212051550+b0a8486541)"
   xmlns:inkscape="http://www.inkscape.org/namespaces/inkscape"
   xmlns:sodipodi="http://sodipodi.sourceforge.net/DTD/sodipodi-0.dtd"
   xmlns="http://www.w3.org/2000/svg"
   xmlns:svg="http://www.w3.org/2000/svg">
  <defs
     id="defs10" />
  <sodipodi:namedview
     id="namedview8"
     pagecolor="#ffffff"
     bordercolor="#666666"
     borderopacity="1.0"
     inkscape:showpageshadow="2"
     inkscape:pageopacity="0.0"
     inkscape:pagecheckerboard="0"
     inkscape:deskcolor="#d1d1d1"
     showgrid="false"
     inkscape:zoom="2.4041631"
     inkscape:cx="143.29311"
     inkscape:cy="58.856241"
     inkscape:window-width="1920"
     inkscape:window-height="1016"
     inkscape:window-x="0"
     inkscape:window-y="27"
     inkscape:window-maximized="1"
     inkscape:current-layer="svg6" />
  <g
     transform="matrix(0.105,0,0,-0.105,-4.1855702,108.00056)"
     id="g4">
    <path
       fill="currentColor"
       d="m 1232.59,315.315 c -10.1885,-14.6855 -23.085,-27.5752 -35.4238,-40.7168 -3.207,-3.38281 -8.585,-4.75195 -13.1221,-7.11816 6.8447,-3.14844 13.5518,-6.23828 20.8457,-9.60156 -1.1338,-6.8252 -1.9355,-13.5713 -3.0303,-20.1416 -2.875,-17.2285 -13.2393,-32.6768 -28.3555,-41.4375 -12.2607,-7.09863 -25.9102,-11.3027 -40.4395,-13.6104 -10.6572,-1.68164 -20.9238,-5.70996 -31.542,-7.74414 -6.8838,-1.31055 -14.2363,-0.29394 -21.1592,-1.52637 -7.1572,-1.27148 -14.96,-2.58203 -20.9443,-6.33691 -22.2539,-13.9629 -46.8545,-21.4521 -71.68947,-28.7656 -26.3994,-7.7832 -52.5254,-16.6025 -79.0225,-24.0332 -31.5625,-8.8584 -63.5352,-16.25 -95.0781,-25.1475 -23.623,-6.66797 -46.6396,-15.4678 -70.3018,-21.9795 -33.9287,-9.34766 -68.1699,-17.541 -102.294,-26.1064 -12.5742,-3.16797 -25.207,-6.00391 -37.7812,-9.11328 -3.51953,-1.60352 -6.96094,-3.16797 -10.4609,-4.77148 -22.1367,-14.8623 -46.7959,-23.6426 -72.4912,-29.9785 -5.33887,-1.31055 -10.5996,-3.03125 -15.7422,-4.9668 -8.0957,-3.07031 -13.8252,-3.36328 -20.8262,4.73242 -3.44141,3.96973 -15.5264,2.62012 -22.9375,0.68457 -36.373,-9.48438 -71.8066,-2.19043 -107.437,4.12598 -13.082,2.30762 -26.6338,2.4248 -39.54,5.43652 -24.3076,5.6709 -48.0088,14.2949 -72.4922,18.7148 -23.1143,4.16504 -42.5322,15.8984 -63.2412,25.0898 -15.1943,6.74609 -29.8994,14.5488 -45.0156,21.4717 -15.4092,7.05957 -31.0928,13.3174 -43.2168,26.0674 -3.14844,3.30469 -9.15234,3.9502 -13.8457,5.80762 v 4.86914 c 1.54492,4.38086 2.20996,9.38672 4.81055,13.0244 4.10645,5.74902 8.03711,10.8525 16.7783,12.8867 8.31055,1.93555 14.959,10.6963 22.625,16.0352 4.14551,2.89453 9.03418,7.17676 13.375,6.94238 26.8301,-1.44727 44.5859,16.2695 64.7666,29.0195 8.34961,5.28027 17.5801,9.34766 25.2461,15.4492 11.9873,9.5625 23.3291,20.0049 34.2998,30.7402 7.3916,7.21582 15.3311,14.7051 20.1025,23.6221 9.05371,16.9346 14.6074,35.7666 24.1895,52.3301 9.71875,16.8174 22.4297,31.9336 34.0459,47.6172 10.7949,14.5879 21.5703,29.2148 32.9512,43.334 12.0459,14.9209 25.0693,29.0596 37.1934,43.9219 26.3994,32.3252 61.3447,53.9727 95.4492,76.6367 18.5381,12.3389 37.2129,24.5215 56.4355,35.7461 13.2197,7.72461 27.749,13.1416 41.1641,20.5332 12.4961,6.86426 24.0137,15.5273 36.5098,22.4111 14.0215,7.72461 28.4336,14.8623 43.1191,21.2764 17.2285,7.50879 34.9258,13.9619 52.7012,21.002 -1.58398,4.83008 -3.16797,9.60156 -4.73242,14.373 0.97754,-0.29297 1.95508,-0.56641 2.93262,-0.83984 3.77441,9.83594 7.19629,19.8096 11.4004,29.4502 8.50684,19.5752 17.4043,38.9541 26.2041,58.3916 7.29395,16.1328 14.5879,32.2461 22.0186,48.3203 3.28516,7.1377 9.52344,12.4961 17.0322,14.7646 1.91602,0.58691 3.83203,1.1543 5.74805,1.72168 19.2031,5.63184 39.8926,-3.05078 49.2793,-20.7285 0.89941,-1.70117 1.66211,-3.38281 1.64258,-5.10352 -0.0977,-11.459 -1.36914,-22.8984 -2.44434,-37.9951 5.06445,6.58984 9.73828,11.2637 12.6914,16.8369 3.40234,6.45312 5.33789,12.7695 14.1963,14.7646 4.18457,0.958 8.13477,6.74609 10.4424,11.2246 3.83301,7.4502 9.54297,15.3896 16.9932,10.8916 7.27441,-4.40039 14.5293,-13.9629 15.7031,-22.1172 2.01367,-14.0215 -0.72363,-28.7266 -1.56445,-45.3291 5.16211,8.17383 7.95898,17.5215 14.1191,21.1787 8.27148,4.92773 15.2139,-0.78223 16.9346,-12.085 3.98926,1.95508 7.02051,3.65625 10.208,4.94727 10.0322,4.06738 19.8486,9.30859 30.29098,11.6553 15.5469,3.48047 30.1543,-10.4424 30.6045,-29.4111 0.3516,-15.625 1.8184,-32.4424 -3.1679,-46.6592 -6.7666,-19.3008 -10.2861,-41.9844 -33.30275,-53.248 7.17675,-7.86133 13.72755,-14.2168 19.30085,-21.335 14.5098,-18.5576 29,-37.1543 42.6104,-56.3574 4.3798,-6.17969 6.1982,-14.2363 8.8769,-21.5498 2.0537,-5.6123 3.6182,-7.74414 10.3252,-3.85254 16.9541,9.85547 35.7471,9.62109 52.5254,1.15332 5.4756,-2.77734 8.1348,-15.0186 8.4668,-23.0752 0.332,-8.34961 -3.7158,-16.8955 -6.4727,-27.8662 5.8272,2.1709 10.6572,3.24609 14.7441,5.6123 16.0352,9.32812 32.9111,8.76074 50.0215,4.79102 11.8115,-2.7373 24.8936,-23.0361 22.3906,-36.1182 -2.1318,-11.166 -6.4335,-21.9219 -9.6796,-32.873 -0.8799,-2.97266 -1.4473,-6.00391 -2.21,-9.23047 25.4805,2.20996 20.9043,1.7793 28.2568,-15.4102 1.8574,-4.30176 -0.9981,-11.0088 -2.6602,-16.3086 -1.8769,-6.04297 -4.83,-11.7529 -6.6093,-15.918 6.2382,-5.14258 15.7422,-9.4248 15.7031,-13.6289 -0.078,-9.97363 -2.4444,-21.4521 -7.9981,-29.4697 z"
       id="path2" />
  </g>
</svg>
