<?xml version="1.0" encoding="UTF-8" standalone="no"?>
<!-- Created with Inkscape (http://www.inkscape.org/) -->

<svg
   width="128.0px"
   height="128.0px"
   viewBox="0 0 128.0 128.0"
   version="1.1"
   id="SVGRoot"
   sodipodi:docname="bird.svg"
   inkscape:version="1.2.2 (1:1.2.2+202212051550+b0a8486541)"
   xmlns:inkscape="http://www.inkscape.org/namespaces/inkscape"
   xmlns:sodipodi="http://sodipodi.sourceforge.net/DTD/sodipodi-0.dtd"
   xmlns="http://www.w3.org/2000/svg"
   xmlns:svg="http://www.w3.org/2000/svg">
  <sodipodi:namedview
     id="namedview167530"
     pagecolor="#ffffff"
     bordercolor="#666666"
     borderopacity="1.0"
     inkscape:showpageshadow="2"
     inkscape:pageopacity="0.0"
     inkscape:pagecheckerboard="0"
     inkscape:deskcolor="#d1d1d1"
     inkscape:document-units="px"
     showgrid="true"
     inkscape:zoom="4.2835116"
     inkscape:cx="79.140675"
     inkscape:cy="86.961361"
     inkscape:window-width="1920"
     inkscape:window-height="1016"
     inkscape:window-x="0"
     inkscape:window-y="27"
     inkscape:window-maximized="1"
     inkscape:current-layer="layer1">
    <inkscape:grid
       type="xygrid"
       id="grid167653" />
  </sodipodi:namedview>
  <defs
     id="defs167525" />
  <g
     inkscape:label="Layer 1"
     inkscape:groupmode="layer"
     id="layer1">
    <path
       d="M 113.11494,83.535801 C 109.91151,82.357603 103.08433,79.93752 95.072585,77.581123 l 5.910095,-13.597044 c 6.61702,3.50912 10.70568,10.049712 12.13226,19.551722 M 46.715509,112.97165 c -4.973907,-0.21653 -16.24003,-1.99338 -20.252273,-13.106658 l 13.686206,-0.420331 c 1.280096,3.859399 3.36901,8.196439 6.566067,13.526989 m 44.92438,-92.574537 c -4.273357,0.783343 -11.65461,2.706672 -18.341681,7.069189 l -5.795461,-9.40648 c 6.088419,-4.101403 14.004637,-3.337166 24.137142,2.337291 M 115.71334,41.33083 c -3.60464,0.08279 -11.16422,0.509491 -19.347921,2.43282 l -3.5537,-11.113275 c 9.317321,-1.885118 17.042481,0.98077 22.901621,8.680455 M 95.830453,46.444847 C 105.59358,43.992921 114.66889,43.80823 117.22271,43.80823 l 3.25438,0.07005 -1.31831,-1.993384 C 112.29339,31.45307 102.65763,27.568201 90.901127,30.465931 78.507755,33.56109 67.063311,43.336951 62.140353,47.998795 63.350394,40.693966 67.197052,34.73292 73.623009,30.230292 83.207811,23.466797 95.282751,22.37776 95.410123,22.371391 l 3.706548,-0.318432 -3.152476,-1.987015 C 82.984908,11.907717 72.604027,10.799574 65.038083,16.690565 57.363873,22.670717 54.10313,34.73292 51.727628,43.540747 c -1.095406,4.063192 -2.751252,10.215298 -3.967662,10.215298 -0.05095,0 -0.222903,-0.01911 -0.554072,-0.261115 C 38.149689,46.795122 27.38032,13.690936 27.272054,13.359767 L 26.998202,12.5 H 12.210222 L 7.5229037,25.816825 28.590362,64.060503 C 22.788532,78.574631 21.094474,90.32477 23.5464,99.011594 27.807019,114.3027 43.276444,115.5 47.919182,115.5 c 0.70055,0 1.108143,-0.0318 1.108143,-0.0318 l 2.05707,-0.15285 -1.089037,-1.75138 c -3.999505,-6.45143 -6.470537,-11.45718 -7.782477,-15.762377 -2.821307,-9.151735 -0.369381,-15.39937 8.47029,-21.545106 5.80183,-4.018612 20.723552,-2.865888 42.338713,3.324429 11.622766,3.337167 21.041986,6.97366 21.137516,7.005503 l 1.91059,0.738762 -0.21654,-2.031596 C 114.56699,73.1995 109.53576,65.066748 100.89989,61.111823 97.01502,59.315867 92.410494,58.41152 87.232791,58.41152 c -6.642491,0 -12.769122,1.464787 -16.405615,2.560193 4.954802,-6.763495 13.342299,-11.641873 25.003277,-14.526866"
       style="fill:#000000;fill-opacity:1;fill-rule:nonzero;stroke:none;stroke-width:6.36864"
       id="path117184" />
  </g>
</svg>
