<?xml version="1.0" encoding="UTF-8" standalone="no"?>
<!-- Created with Inkscape (http://www.inkscape.org/) -->

<svg
   width="128.0px"
   height="128.0px"
   viewBox="0 0 128.0 128.0"
   version="1.1"
   id="SVGRoot"
   sodipodi:docname="citadel.svg"
   inkscape:version="1.2.2 (1:1.2.2+202212051550+b0a8486541)"
   xmlns:inkscape="http://www.inkscape.org/namespaces/inkscape"
   xmlns:sodipodi="http://sodipodi.sourceforge.net/DTD/sodipodi-0.dtd"
   xmlns="http://www.w3.org/2000/svg"
   xmlns:svg="http://www.w3.org/2000/svg">
  <sodipodi:namedview
     id="namedview38447"
     pagecolor="#878787"
     bordercolor="#666666"
     borderopacity="1.0"
     inkscape:showpageshadow="2"
     inkscape:pageopacity="0"
     inkscape:pagecheckerboard="0"
     inkscape:deskcolor="#d1d1d1"
     inkscape:document-units="px"
     showgrid="true"
     inkscape:zoom="4.7627763"
     inkscape:cx="-11.442906"
     inkscape:cy="47.871238"
     inkscape:window-width="1920"
     inkscape:window-height="1043"
     inkscape:window-x="1920"
     inkscape:window-y="0"
     inkscape:window-maximized="1"
     inkscape:current-layer="layer1">
    <inkscape:grid
       type="xygrid"
       id="grid38570" />
  </sodipodi:namedview>
  <defs
     id="defs38442">
    <clipPath
       clipPathUnits="userSpaceOnUse"
       id="clipPath1266">
      <path
         d="m 383.486,242.638 h 35.452 v 35.932 h -35.452 z"
         id="path1264" />
    </clipPath>
  </defs>
  <g
     inkscape:label="Layer 1"
     inkscape:groupmode="layer"
     id="layer1">
    <path
       d="m 90.276803,57.025994 v -2.370667 h 0.0027 c 0.02133,-0.442666 0.384,-0.794666 0.829333,-0.794666 0.448,0 0.810667,0.352 0.829333,0.794666 h 0.0027 v 2.370667 z m 13.789337,2.752 -5.464004,-1.077333 v -8.330667 h 4.101334 V 36.167328 l -5.557334,3.061333 v 5.637333 H 94.46347 v -5.637333 h -6.842667 v 5.637333 h -2.682667 v -5.637333 l -5.423999,-3.061333 v 14.202666 h 4.101333 v 5.381333 l -20.248,-3.989333 v 52.005336 h 8.576 l -1.874666,-19.488003 0.032,-0.0027 c -0.282667,-4.56 2.298666,-8.474666 5.919999,-8.824 3.618667,-0.346666 6.898667,3.002667 7.493334,7.533333 l 0.02933,-0.0027 1.997333,20.784 h 26.368 z"
       style="fill:#000000;fill-opacity:1;fill-rule:nonzero;stroke:none;stroke-width:2.66667"
       id="path1268"
       clip-path="none" />
    <path
       d="m 44.784538,57.697994 h -4.762667 v -6.781333 h 0.01067 c 0.056,-1.266667 1.090667,-2.277333 2.370667,-2.277333 1.28,0 2.314666,1.010666 2.370666,2.277333 h 0.01067 z m 17,-13.688 h 3.287999 2.848 V 16.729995 l -12.421333,5.88 V 33.439328 H 49.501871 V 22.609995 H 34.208538 V 33.439328 H 28.211205 V 22.609995 l -12.122666,-5.88 v 27.279999 h 6.821333 v 67.258666 h 38.874666 v -3.408 -52.655999 z"
       style="fill:#000000;fill-opacity:1;fill-rule:nonzero;stroke:none;stroke-width:2.66667"
       id="path1272"
       clip-path="none" />
  </g>
</svg>
