<?xml version="1.0" encoding="UTF-8" standalone="no"?>
<svg
   version="1.1"
   viewBox="0 0 128 128"
   id="svg10064"
   sodipodi:docname="corvid.svg"
   inkscape:version="1.2.2 (1:1.2.2+202212051550+b0a8486541)"
   width="128"
   height="128"
   xmlns:inkscape="http://www.inkscape.org/namespaces/inkscape"
   xmlns:sodipodi="http://sodipodi.sourceforge.net/DTD/sodipodi-0.dtd"
   xmlns="http://www.w3.org/2000/svg"
   xmlns:svg="http://www.w3.org/2000/svg">
  <defs
     id="defs10068" />
  <sodipodi:namedview
     id="namedview10066"
     pagecolor="#ffffff"
     bordercolor="#666666"
     borderopacity="1.0"
     inkscape:showpageshadow="2"
     inkscape:pageopacity="0.0"
     inkscape:pagecheckerboard="0"
     inkscape:deskcolor="#d1d1d1"
     showgrid="false"
     inkscape:zoom="4"
     inkscape:cx="22.25"
     inkscape:cy="93.625"
     inkscape:window-width="1920"
     inkscape:window-height="1016"
     inkscape:window-x="0"
     inkscape:window-y="27"
     inkscape:window-maximized="1"
     inkscape:current-layer="svg10064" />
  <path
     fill="currentColor"
     d="m 126.17424,88.894261 c 0.29357,0.58929 0.26835,1.25087 -0.0725,1.97982 -0.34495,0.73511 -0.90758,1.20125 -1.68985,1.39628 -0.0985,0 -0.73306,0.14787 -1.90958,0.44154 0.78432,1.76172 1.17653,2.6939 1.17653,2.79039 0,0.58724 -0.14786,1.02868 -0.44153,1.32235 -0.29357,0.29368 -0.80689,0.51342 -1.54198,0.66128 -0.73306,0.14581 -1.15192,0.21974 -1.24841,0.21974 -0.58724,0.19708 -1.51942,0.39211 -2.79039,0.58714 -1.27508,0.19913 -2.05735,0.34494 -2.35091,0.44143 -0.68579,0.0985 -1.12722,0.49075 -1.32225,1.17447 -0.29367,0.981509 -1.02878,1.763779 -2.20325,2.351019 -0.68579,0.19708 -2.49683,0.735 -5.43509,1.61591 -0.19708,0 -0.49075,0.0246 -0.88092,0.0739 -0.3922,0.0514 -0.68588,0.0739 -0.8809,0.0739 -0.88297,0.19708 -1.47021,0.63851 -1.76378,1.32224 -0.49075,1.08004 -1.41884,1.76378 -2.7904,2.05744 -0.88296,0.19708 -2.22992,0.34495 -4.04097,0.44143 -1.8131,0.0985 -2.9157,0.19708 -3.30586,0.29357 -1.08004,0.0985 -1.86231,0.34495 -2.35101,0.73511 -1.17448,0.97945 -2.98758,1.42088 -5.43509,1.32235 -0.88296,0 -1.88702,-0.0719 -3.01218,-0.21974 -1.12722,-0.14787 -2.32836,-0.29368 -3.59933,-0.44154 -1.27508,-0.14581 -2.30374,-0.21974 -3.08601,-0.21974 -0.0985,-0.0965 -0.44143,-0.14786 -1.02867,-0.14786 -0.58725,0 -1.00612,-0.0226 -1.24841,-0.0739 -0.2464,-0.0473 -0.56469,-0.14786 -0.95485,-0.29367 -0.39221,-0.14786 -0.7351,-0.36761 -1.02867,-0.66128 -0.0985,-0.0965 -0.29357,-0.0965 -0.58714,0 -1.07799,0.39221 -3.23193,1.22586 -6.46385,2.49683 h -1.76378 c -1.17448,-0.29572 -1.8131,-0.44153 -1.90958,-0.44153 -0.49281,-0.19708 -1.42294,-0.5893 -2.79245,-1.17654 -1.37361,-0.58724 -2.40228,-0.9774 -3.08601,-1.17448 -0.4928,-0.19503 -1.08004,-0.14571 -1.76378,0.14797 -2.34896,1.07799 -4.45563,1.37166 -6.3159,0.88091 -0.97945,-0.29367 -1.61601,-0.63656 -1.90968,-1.02877 -0.29357,-0.39017 -0.39211,-1.12527 -0.29357,-2.20326 l -0.14786,-0.44143 -1.02868,0.29367 c -0.97945,0.19708 -1.71455,0.0739 -2.20325,-0.3675 -0.49076,-0.43938 -0.68578,-1.14988 -0.58724,-2.12933 0.0965,-0.29367 0.14786,-0.4887 0.14786,-0.58724 0.19503,-2.546039 -1.078,-4.601429 -3.81917,-6.170179 -0.58724,-0.29368 -1.76378,-1.36961 -3.5255,-3.23194 -0.0985,-0.0965 -0.63851,-0.78432 -1.61591,-2.05735 v -0.88091 c -1.46815,-0.97945 -3.37773,-2.64469 -5.72875,-4.9957 -2.34897,-2.35101 -3.91771,-3.86839 -4.69998,-4.55416 -1.17448,-0.88297 -2.64264,-2.32641 -4.40641,-4.33453 -1.76378,-2.00608 -2.89099,-3.25449 -3.37969,-3.74523 -0.0985,-0.0965 -1.17448,-0.8316 -3.23193,-2.20316 4.30787,-0.29367 6.56035,-0.4887 6.75742,-0.58724 0.88091,0 2.20326,-0.1211 3.96703,-0.3675 1.76172,-0.2423 3.13328,-0.41477 4.11273,-0.51331 0.39016,-0.0944 1.17654,-0.14581 2.35101,-0.14581 1.17448,0 2.10461,-0.0493 2.7904,-0.14786 -2.54604,-2.0554 -3.9176,-3.13339 -4.11264,-3.23193 -4.60554,-3.13124 -7.69166,-5.14141 -9.25631,-6.02233 -3.72268,-2.05539 -6.66093,-3.23193 -8.81487,-3.52559 -0.0985,0 -1.27302,-0.44143 -3.5255,-1.32235 v -1.02868 c 0.88091,-0.78432 2.34907,-1.27302 4.40651,-1.4701 5.38371,-0.4887 9.89072,-1.22381 13.51476,-2.20326 0.78227,-0.19503 1.95881,-0.39006 3.5255,-0.58714 1.5667,-0.19503 2.59537,-0.29357 3.08612,-0.29357 3.42696,-0.58929 5.87651,-1.07799 7.34467,-1.47021 5.19072,-1.37156 9.0099,-2.05734 11.45949,-2.05734 0.39016,0 0.95484,-0.1211 1.68994,-0.3675 0.7351,-0.2423 1.14988,-0.41478 1.24841,-0.51331 0.39016,-0.0965 0.83159,-0.0965 1.32235,0 0.29367,0.0985 0.95484,0.26895 1.98351,0.51331 1.02867,0.2464 1.78633,0.3675 2.27708,0.3675 1.27097,0.19708 2.25247,0.44143 2.93826,0.735 0.39221,0.19708 1.41883,0.0985 3.08612,-0.29368 4.79647,-1.07594 9.10844,-1.56464 12.9276,-1.46815 2.35101,0.0985 6.46375,0.88286 12.34023,2.35101 3.23193,0.78638 6.46385,2.10872 9.69578,3.96694 1.85822,1.07799 3.7678,2.25452 5.72865,3.5255 1.17654,0.78432 1.32235,1.66728 0.44154,2.64468 4.89511,4.01625 7.49252,6.17019 7.7862,6.46386 3.32841,2.74323 5.14151,4.26059 5.43508,4.55427 0.9774,0.88091 2.05744,2.30384 3.23193,4.26059 0.29368,0.39221 0.2423,0.98151 -0.14786,1.76378 -0.49075,0.88091 -0.29367,1.42088 0.58725,1.61591 1.76378,0.39221 2.74117,0.63861 2.93825,0.7351 1.86027,0.68578 2.98747,2.05529 3.37969,4.11274 0.0965,0.49075 -0.2464,1.22585 -1.02867,2.20325 -0.0986,0.0985 -0.73306,0.63851 -1.90959,1.61591 1.76172,3.0368 2.69186,4.65271 2.7904,4.84774 z"
     id="path10060"
     style="stroke-width:0.105" />
</svg>
