# MagicaVoxel @ Ephtracy

# group
o Lily Pad

# material
mtllib Kerry3LilyPad.mtl
usemtl palette

# normals
vn -1 0 0
vn 1 0 0
vn 0 0 1
vn 0 0 -1
vn 0 -1 0
vn 0 1 0

# texcoords
vt 0.595703 0.5
vt 0.599609 0.5
vt 0.626953 0.5
vt 0.630859 0.5
vt 0.634766 0.5
vt 0.638672 0.5

# verts
v 3.6 0 0.4
v 3.6 0 -0.4
v 3.6 0.2 0.4
v 3.6 0.2 -0.4
v 3.8 0 0.8
v 3.8 0 0.4
v 3.8 0.2 0.8
v 3.8 0.2 0.4
v 4 0 1.2
v 4 0 0.8
v 4 0.2 1.2
v 4 0.2 0.8
v 4.2 0.2 0.8
v 4.2 0.2 0.6
v 4.2 0.4 0.8
v 4.2 0.4 0.6
v 4.4 0 1.4
v 4.4 0 1.2
v 4.4 0.2 1.4
v 4.4 0.2 1.2
v 4.4 0.2 1
v 4.4 0.2 0.8
v 4.4 0.2 0.6
v 4.4 0.2 0.4
v 4.4 0.4 1
v 4.4 0.4 0.8
v 4.4 0.4 0.6
v 4.4 0.4 0.4
v 4.8 0 1.6
v 4.8 0 1.4
v 4.8 0.2 1.6
v 4.8 0.2 1.4
v 5 0 -1.2
v 5 0 -1.8
v 5 0.2 -1.2
v 5 0.2 -1.8
v 5.2 0 -0.6
v 5.2 0 -1.2
v 5.2 0.2 -0.6
v 5.2 0.2 -1.2
v 5.4 0 0
v 5.4 0 -0.6
v 5.4 0.2 0
v 5.4 0.2 -0.6
v 4.2 0 -0.2
v 4.2 0 -0.4
v 4.2 0.2 -0.2
v 4.2 0.2 -0.4
v 4.6 0.2 1
v 4.6 0.2 0.8
v 4.6 0.2 0.6
v 4.6 0.2 0.4
v 4.6 0.4 1
v 4.6 0.4 0.8
v 4.6 0.4 0.6
v 4.6 0.4 0.4
v 4.8 0 0
v 4.8 0 -0.2
v 4.8 0.2 0.8
v 4.8 0.2 0.6
v 4.8 0.2 0
v 4.8 0.2 -0.2
v 4.8 0.4 0.8
v 4.8 0.4 0.6
v 5.8 0 1.6
v 5.8 0 1.4
v 5.8 0 -1.6
v 5.8 0 -1.8
v 5.8 0.2 1.6
v 5.8 0.2 1.4
v 5.8 0.2 -1.6
v 5.8 0.2 -1.8
v 6.2 0 1.4
v 6.2 0 1.2
v 6.2 0 -1.4
v 6.2 0 -1.6
v 6.2 0.2 1.4
v 6.2 0.2 1.2
v 6.2 0.2 -1.4
v 6.2 0.2 -1.6
v 6.6 0 1.2
v 6.6 0 0.8
v 6.6 0 -1
v 6.6 0 -1.4
v 6.6 0.2 1.2
v 6.6 0.2 0.8
v 6.6 0.2 -1
v 6.6 0.2 -1.4
v 6.8 0 0.8
v 6.8 0 0.4
v 6.8 0 -0.6
v 6.8 0 -1
v 6.8 0.2 0.8
v 6.8 0.2 0.4
v 6.8 0.2 -0.6
v 6.8 0.2 -1
v 7 0 0.4
v 7 0 -0.6
v 7 0.2 0.4
v 7 0.2 -0.6
v 4.8 0 1.6
v 4.8 0.2 1.6
v 5.8 0 1.6
v 5.8 0.2 1.6
v 4.4 0 1.4
v 4.4 0.2 1.4
v 4.8 0 1.4
v 4.8 0.2 1.4
v 5.8 0 1.4
v 5.8 0.2 1.4
v 6.2 0 1.4
v 6.2 0.2 1.4
v 4 0 1.2
v 4 0.2 1.2
v 4.4 0 1.2
v 4.4 0.2 1.2
v 6.2 0 1.2
v 6.2 0.2 1.2
v 6.6 0 1.2
v 6.6 0.2 1.2
v 4.4 0.2 1
v 4.4 0.4 1
v 4.6 0.2 1
v 4.6 0.4 1
v 3.8 0 0.8
v 3.8 0.2 0.8
v 4 0 0.8
v 4 0.2 0.8
v 4.2 0.2 0.8
v 4.2 0.4 0.8
v 4.4 0.2 0.8
v 4.4 0.4 0.8
v 4.6 0.2 0.8
v 4.6 0.4 0.8
v 4.8 0.2 0.8
v 4.8 0.4 0.8
v 6.6 0 0.8
v 6.6 0.2 0.8
v 6.8 0 0.8
v 6.8 0.2 0.8
v 3.6 0 0.4
v 3.6 0.2 0.4
v 3.8 0 0.4
v 3.8 0.2 0.4
v 6.8 0 0.4
v 6.8 0.2 0.4
v 7 0 0.4
v 7 0.2 0.4
v 5.2 0 -0.6
v 5.2 0.2 -0.6
v 5.4 0 -0.6
v 5.4 0.2 -0.6
v 5 0 -1.2
v 5 0.2 -1.2
v 5.2 0 -1.2
v 5.2 0.2 -1.2
v 4.2 0.2 0.6
v 4.2 0.4 0.6
v 4.4 0.2 0.6
v 4.4 0.4 0.6
v 4.6 0.2 0.6
v 4.6 0.4 0.6
v 4.8 0.2 0.6
v 4.8 0.4 0.6
v 4.4 0.2 0.4
v 4.4 0.4 0.4
v 4.6 0.2 0.4
v 4.6 0.4 0.4
v 4.8 0 0
v 4.8 0.2 0
v 5.4 0 0
v 5.4 0.2 0
v 4.2 0 -0.2
v 4.2 0.2 -0.2
v 4.8 0 -0.2
v 4.8 0.2 -0.2
v 3.6 0 -0.4
v 3.6 0.2 -0.4
v 4.2 0 -0.4
v 4.2 0.2 -0.4
v 6.8 0 -0.6
v 6.8 0.2 -0.6
v 7 0 -0.6
v 7 0.2 -0.6
v 6.6 0 -1
v 6.6 0.2 -1
v 6.8 0 -1
v 6.8 0.2 -1
v 6.2 0 -1.4
v 6.2 0.2 -1.4
v 6.6 0 -1.4
v 6.6 0.2 -1.4
v 5.8 0 -1.6
v 5.8 0.2 -1.6
v 6.2 0 -1.6
v 6.2 0.2 -1.6
v 5 0 -1.8
v 5 0.2 -1.8
v 5.8 0 -1.8
v 5.8 0.2 -1.8
v 4.8 0 1.6
v 5.8 0 1.6
v 4.4 0 1.4
v 4.8 0 1.4
v 5.8 0 1.4
v 6.2 0 1.4
v 4 0 1.2
v 4.4 0 1.2
v 4.8 0 1.2
v 5 0 1.2
v 5.2 0 1.2
v 5.4 0 1.2
v 5.6 0 1.2
v 5.8 0 1.2
v 6.2 0 1.2
v 6.6 0 1.2
v 4.2 0 1
v 4.4 0 1
v 4.8 0 1
v 5 0 1
v 5.6 0 1
v 5.8 0 1
v 6 0 1
v 6.2 0 1
v 6.4 0 1
v 3.8 0 0.8
v 4 0 0.8
v 4.2 0 0.8
v 5.2 0 0.8
v 5.4 0 0.8
v 5.8 0 0.8
v 6 0 0.8
v 6.2 0 0.8
v 6.4 0 0.8
v 6.6 0 0.8
v 6.8 0 0.8
v 4.6 0 0.6
v 5.2 0 0.6
v 5.6 0 0.6
v 5.8 0 0.6
v 6 0 0.6
v 6.2 0 0.6
v 3.6 0 0.4
v 3.8 0 0.4
v 4 0 0.4
v 4.6 0 0.4
v 5.2 0 0.4
v 5.4 0 0.4
v 5.6 0 0.4
v 5.8 0 0.4
v 6 0 0.4
v 6.2 0 0.4
v 6.4 0 0.4
v 6.6 0 0.4
v 6.8 0 0.4
v 7 0 0.4
v 4 0 0.2
v 4.4 0 0.2
v 4.8 0 0.2
v 5.2 0 0.2
v 5.4 0 0.2
v 6.2 0 0.2
v 6.4 0 0.2
v 4 0 0
v 4.2 0 0
v 4.4 0 0
v 4.8 0 0
v 5.4 0 0
v 5.6 0 0
v 5.8 0 0
v 6.6 0 0
v 3.8 0 -0.2
v 4.2 0 -0.2
v 4.8 0 -0.2
v 5.8 0 -0.2
v 6.6 0 -0.2
v 3.6 0 -0.4
v 4.2 0 -0.4
v 6.2 0 -0.4
v 6.6 0 -0.4
v 5.2 0 -0.6
v 5.4 0 -0.6
v 5.6 0 -0.6
v 5.8 0 -0.6
v 6 0 -0.6
v 6.2 0 -0.6
v 6.6 0 -0.6
v 6.8 0 -0.6
v 7 0 -0.6
v 6.2 0 -0.8
v 6.4 0 -0.8
v 6.2 0 -1
v 6.4 0 -1
v 6.6 0 -1
v 6.8 0 -1
v 5 0 -1.2
v 5.2 0 -1.2
v 5.4 0 -1.2
v 5.8 0 -1.2
v 6 0 -1.2
v 6.2 0 -1.2
v 6.4 0 -1.2
v 5.8 0 -1.4
v 6.2 0 -1.4
v 6.6 0 -1.4
v 5.2 0 -1.6
v 5.8 0 -1.6
v 6.2 0 -1.6
v 5 0 -1.8
v 5.8 0 -1.8
v 4.8 0.2 1.6
v 5.8 0.2 1.6
v 4.4 0.2 1.4
v 4.8 0.2 1.4
v 5.8 0.2 1.4
v 6.2 0.2 1.4
v 4 0.2 1.2
v 4.4 0.2 1.2
v 4.8 0.2 1.2
v 5 0.2 1.2
v 5.2 0.2 1.2
v 5.4 0.2 1.2
v 5.6 0.2 1.2
v 5.8 0.2 1.2
v 6.2 0.2 1.2
v 6.6 0.2 1.2
v 4.2 0.2 1
v 4.4 0.2 1
v 4.6 0.2 1
v 4.8 0.2 1
v 5 0.2 1
v 5.6 0.2 1
v 5.8 0.2 1
v 6 0.2 1
v 6.2 0.2 1
v 6.4 0.2 1
v 3.8 0.2 0.8
v 4 0.2 0.8
v 4.2 0.2 0.8
v 4.4 0.2 0.8
v 4.6 0.2 0.8
v 4.8 0.2 0.8
v 5.2 0.2 0.8
v 5.4 0.2 0.8
v 5.8 0.2 0.8
v 6 0.2 0.8
v 6.2 0.2 0.8
v 6.4 0.2 0.8
v 6.6 0.2 0.8
v 6.8 0.2 0.8
v 4.2 0.2 0.6
v 4.4 0.2 0.6
v 4.6 0.2 0.6
v 4.8 0.2 0.6
v 5.2 0.2 0.6
v 5.6 0.2 0.6
v 5.8 0.2 0.6
v 6 0.2 0.6
v 6.2 0.2 0.6
v 3.6 0.2 0.4
v 3.8 0.2 0.4
v 4 0.2 0.4
v 4.4 0.2 0.4
v 4.6 0.2 0.4
v 5.2 0.2 0.4
v 5.4 0.2 0.4
v 5.6 0.2 0.4
v 5.8 0.2 0.4
v 6 0.2 0.4
v 6.2 0.2 0.4
v 6.4 0.2 0.4
v 6.6 0.2 0.4
v 6.8 0.2 0.4
v 7 0.2 0.4
v 4 0.2 0.2
v 4.4 0.2 0.2
v 4.8 0.2 0.2
v 5.2 0.2 0.2
v 5.4 0.2 0.2
v 6.2 0.2 0.2
v 6.4 0.2 0.2
v 4 0.2 0
v 4.2 0.2 0
v 4.4 0.2 0
v 4.8 0.2 0
v 5.4 0.2 0
v 5.6 0.2 0
v 5.8 0.2 0
v 6.6 0.2 0
v 3.8 0.2 -0.2
v 4.2 0.2 -0.2
v 4.8 0.2 -0.2
v 5.8 0.2 -0.2
v 6.6 0.2 -0.2
v 3.6 0.2 -0.4
v 4.2 0.2 -0.4
v 6.2 0.2 -0.4
v 6.6 0.2 -0.4
v 5.2 0.2 -0.6
v 5.4 0.2 -0.6
v 5.6 0.2 -0.6
v 5.8 0.2 -0.6
v 6 0.2 -0.6
v 6.2 0.2 -0.6
v 6.6 0.2 -0.6
v 6.8 0.2 -0.6
v 7 0.2 -0.6
v 6.2 0.2 -0.8
v 6.4 0.2 -0.8
v 6.2 0.2 -1
v 6.4 0.2 -1
v 6.6 0.2 -1
v 6.8 0.2 -1
v 5 0.2 -1.2
v 5.2 0.2 -1.2
v 5.4 0.2 -1.2
v 5.8 0.2 -1.2
v 6 0.2 -1.2
v 6.2 0.2 -1.2
v 6.4 0.2 -1.2
v 5.8 0.2 -1.4
v 6.2 0.2 -1.4
v 6.6 0.2 -1.4
v 5.2 0.2 -1.6
v 5.8 0.2 -1.6
v 6.2 0.2 -1.6
v 5 0.2 -1.8
v 5.8 0.2 -1.8
v 4.4 0.4 1
v 4.6 0.4 1
v 4.2 0.4 0.8
v 4.4 0.4 0.8
v 4.6 0.4 0.8
v 4.8 0.4 0.8
v 4.2 0.4 0.6
v 4.4 0.4 0.6
v 4.6 0.4 0.6
v 4.8 0.4 0.6
v 4.4 0.4 0.4
v 4.6 0.4 0.4

# faces
f 3/5/1 2/5/1 1/5/1
f 4/5/1 2/5/1 3/5/1
f 7/5/1 6/5/1 5/5/1
f 8/5/1 6/5/1 7/5/1
f 11/5/1 10/5/1 9/5/1
f 12/5/1 10/5/1 11/5/1
f 15/1/1 14/1/1 13/1/1
f 16/1/1 14/1/1 15/1/1
f 19/5/1 18/5/1 17/5/1
f 20/5/1 18/5/1 19/5/1
f 25/1/1 22/1/1 21/1/1
f 26/1/1 22/1/1 25/1/1
f 27/1/1 24/1/1 23/1/1
f 28/1/1 24/1/1 27/1/1
f 31/5/1 30/5/1 29/5/1
f 32/5/1 30/5/1 31/5/1
f 35/5/1 34/5/1 33/5/1
f 36/5/1 34/5/1 35/5/1
f 39/5/1 38/5/1 37/5/1
f 40/5/1 38/5/1 39/5/1
f 43/5/1 42/5/1 41/5/1
f 44/5/1 42/5/1 43/5/1
f 45/5/2 46/5/2 47/5/2
f 47/5/2 46/5/2 48/5/2
f 49/1/2 50/1/2 53/1/2
f 53/1/2 50/1/2 54/1/2
f 51/1/2 52/1/2 55/1/2
f 55/1/2 52/1/2 56/1/2
f 57/5/2 58/5/2 61/5/2
f 61/5/2 58/5/2 62/5/2
f 59/1/2 60/1/2 63/1/2
f 63/1/2 60/1/2 64/1/2
f 65/5/2 66/5/2 69/5/2
f 69/5/2 66/5/2 70/5/2
f 67/5/2 68/5/2 71/5/2
f 71/5/2 68/5/2 72/5/2
f 73/5/2 74/5/2 77/5/2
f 77/5/2 74/5/2 78/5/2
f 75/5/2 76/5/2 79/5/2
f 79/5/2 76/5/2 80/5/2
f 81/5/2 82/5/2 85/5/2
f 85/5/2 82/5/2 86/5/2
f 83/5/2 84/5/2 87/5/2
f 87/5/2 84/5/2 88/5/2
f 89/5/2 90/5/2 93/5/2
f 93/5/2 90/5/2 94/5/2
f 91/5/2 92/5/2 95/5/2
f 95/5/2 92/5/2 96/5/2
f 97/5/2 98/5/2 99/5/2
f 99/5/2 98/5/2 100/5/2
f 103/5/3 102/5/3 101/5/3
f 104/5/3 102/5/3 103/5/3
f 107/5/3 106/5/3 105/5/3
f 108/5/3 106/5/3 107/5/3
f 111/5/3 110/5/3 109/5/3
f 112/5/3 110/5/3 111/5/3
f 115/5/3 114/5/3 113/5/3
f 116/5/3 114/5/3 115/5/3
f 119/5/3 118/5/3 117/5/3
f 120/5/3 118/5/3 119/5/3
f 123/1/3 122/1/3 121/1/3
f 124/1/3 122/1/3 123/1/3
f 127/5/3 126/5/3 125/5/3
f 128/5/3 126/5/3 127/5/3
f 131/1/3 130/1/3 129/1/3
f 132/1/3 130/1/3 131/1/3
f 135/1/3 134/1/3 133/1/3
f 136/1/3 134/1/3 135/1/3
f 139/5/3 138/5/3 137/5/3
f 140/5/3 138/5/3 139/5/3
f 143/5/3 142/5/3 141/5/3
f 144/5/3 142/5/3 143/5/3
f 147/5/3 146/5/3 145/5/3
f 148/5/3 146/5/3 147/5/3
f 151/5/3 150/5/3 149/5/3
f 152/5/3 150/5/3 151/5/3
f 155/5/3 154/5/3 153/5/3
f 156/5/3 154/5/3 155/5/3
f 157/1/4 158/1/4 159/1/4
f 159/1/4 158/1/4 160/1/4
f 161/1/4 162/1/4 163/1/4
f 163/1/4 162/1/4 164/1/4
f 165/1/4 166/1/4 167/1/4
f 167/1/4 166/1/4 168/1/4
f 169/5/4 170/5/4 171/5/4
f 171/5/4 170/5/4 172/5/4
f 173/5/4 174/5/4 175/5/4
f 175/5/4 174/5/4 176/5/4
f 177/5/4 178/5/4 179/5/4
f 179/5/4 178/5/4 180/5/4
f 181/5/4 182/5/4 183/5/4
f 183/5/4 182/5/4 184/5/4
f 185/5/4 186/5/4 187/5/4
f 187/5/4 186/5/4 188/5/4
f 189/5/4 190/5/4 191/5/4
f 191/5/4 190/5/4 192/5/4
f 193/5/4 194/5/4 195/5/4
f 195/5/4 194/5/4 196/5/4
f 197/5/4 198/5/4 199/5/4
f 199/5/4 198/5/4 200/5/4
f 204/5/5 202/5/5 201/5/5
f 205/5/5 202/5/5 204/5/5
f 208/5/5 204/5/5 203/5/5
f 209/3/5 205/3/5 204/3/5
f 209/5/5 204/5/5 208/5/5
f 210/3/5 205/3/5 209/3/5
f 211/3/5 205/3/5 210/3/5
f 212/3/5 205/3/5 211/3/5
f 213/3/5 205/3/5 212/3/5
f 214/5/5 206/5/5 205/5/5
f 214/3/5 205/3/5 213/3/5
f 215/5/5 206/5/5 214/5/5
f 217/5/5 208/5/5 207/5/5
f 218/3/5 209/3/5 208/3/5
f 218/5/5 208/5/5 217/5/5
f 219/6/5 210/6/5 209/6/5
f 219/3/5 209/3/5 218/3/5
f 220/3/5 211/3/5 210/3/5
f 220/6/5 210/6/5 219/6/5
f 221/3/5 213/3/5 212/3/5
f 221/6/5 214/6/5 213/6/5
f 222/3/5 215/3/5 214/3/5
f 222/6/5 214/6/5 221/6/5
f 223/3/5 215/3/5 222/3/5
f 224/5/5 216/5/5 215/5/5
f 224/3/5 215/3/5 223/3/5
f 225/5/5 216/5/5 224/5/5
f 227/5/5 217/5/5 207/5/5
f 228/3/5 218/3/5 217/3/5
f 228/3/5 219/3/5 218/3/5
f 228/5/5 217/5/5 227/5/5
f 228/3/5 220/3/5 219/3/5
f 229/3/5 211/3/5 220/3/5
f 229/3/5 220/3/5 228/3/5
f 229/4/5 212/4/5 211/4/5
f 230/3/5 223/3/5 222/3/5
f 230/4/5 212/4/5 229/4/5
f 230/3/5 221/3/5 212/3/5
f 230/3/5 222/3/5 221/3/5
f 231/3/5 223/3/5 230/3/5
f 232/4/5 224/4/5 223/4/5
f 232/3/5 223/3/5 231/3/5
f 232/4/5 225/4/5 224/4/5
f 233/4/5 225/4/5 232/4/5
f 234/5/5 216/5/5 225/5/5
f 234/4/5 225/4/5 233/4/5
f 235/5/5 216/5/5 234/5/5
f 237/3/5 228/3/5 227/3/5
f 237/3/5 229/3/5 228/3/5
f 237/3/5 231/3/5 230/3/5
f 237/3/5 230/3/5 229/3/5
f 238/3/5 231/3/5 237/3/5
f 239/3/5 231/3/5 238/3/5
f 240/4/5 233/4/5 232/4/5
f 240/3/5 231/3/5 239/3/5
f 240/4/5 232/4/5 231/4/5
f 241/4/5 233/4/5 240/4/5
f 242/3/5 235/3/5 234/3/5
f 242/4/5 233/4/5 241/4/5
f 242/3/5 234/3/5 233/3/5
f 244/5/5 227/5/5 226/5/5
f 245/3/5 237/3/5 227/3/5
f 245/5/5 227/5/5 244/5/5
f 246/4/5 238/4/5 237/4/5
f 246/3/5 237/3/5 245/3/5
f 247/3/5 239/3/5 238/3/5
f 247/4/5 238/4/5 246/4/5
f 248/3/5 239/3/5 247/3/5
f 249/4/5 240/4/5 239/4/5
f 249/3/5 239/3/5 248/3/5
f 250/5/5 241/5/5 240/5/5
f 250/4/5 240/4/5 249/4/5
f 251/3/5 242/3/5 241/3/5
f 251/5/5 241/5/5 250/5/5
f 252/3/5 235/3/5 242/3/5
f 252/3/5 242/3/5 251/3/5
f 253/3/5 235/3/5 252/3/5
f 254/5/5 236/5/5 235/5/5
f 254/3/5 235/3/5 253/3/5
f 255/5/5 236/5/5 254/5/5
f 257/3/5 246/3/5 245/3/5
f 257/3/5 245/3/5 244/3/5
f 257/3/5 247/3/5 246/3/5
f 258/3/5 247/3/5 257/3/5
f 259/3/5 247/3/5 258/3/5
f 260/4/5 248/4/5 247/4/5
f 260/3/5 247/3/5 259/3/5
f 261/5/5 249/5/5 248/5/5
f 261/4/5 248/4/5 260/4/5
f 261/5/5 250/5/5 249/5/5
f 262/6/5 253/6/5 252/6/5
f 262/3/5 251/3/5 250/3/5
f 262/3/5 252/3/5 251/3/5
f 263/3/5 255/3/5 254/3/5
f 263/6/5 253/6/5 262/6/5
f 263/3/5 254/3/5 253/3/5
f 264/6/5 258/6/5 257/6/5
f 264/3/5 257/3/5 244/3/5
f 265/6/5 258/6/5 264/6/5
f 266/3/5 259/3/5 258/3/5
f 266/6/5 258/6/5 265/6/5
f 267/5/5 260/5/5 259/5/5
f 267/3/5 259/3/5 266/3/5
f 267/5/5 261/5/5 260/5/5
f 268/5/5 250/5/5 261/5/5
f 268/5/5 261/5/5 267/5/5
f 269/5/5 250/5/5 268/5/5
f 270/3/5 262/3/5 250/3/5
f 270/5/5 250/5/5 269/5/5
f 270/3/5 263/3/5 262/3/5
f 271/3/5 255/3/5 263/3/5
f 271/3/5 263/3/5 270/3/5
f 272/3/5 264/3/5 244/3/5
f 272/3/5 265/3/5 264/3/5
f 272/5/5 244/5/5 243/5/5
f 273/5/5 267/5/5 266/5/5
f 273/3/5 265/3/5 272/3/5
f 273/5/5 266/5/5 265/5/5
f 274/5/5 267/5/5 273/5/5
f 275/4/5 270/4/5 269/4/5
f 275/4/5 271/4/5 270/4/5
f 276/3/5 255/3/5 271/3/5
f 276/4/5 271/4/5 275/4/5
f 277/5/5 272/5/5 243/5/5
f 277/5/5 273/5/5 272/5/5
f 278/5/5 273/5/5 277/5/5
f 279/3/5 276/3/5 275/3/5
f 280/3/5 255/3/5 276/3/5
f 280/3/5 276/3/5 279/3/5
f 282/5/5 269/5/5 268/5/5
f 283/4/5 275/4/5 269/4/5
f 283/5/5 269/5/5 282/5/5
f 284/3/5 279/3/5 275/3/5
f 284/4/5 275/4/5 283/4/5
f 285/3/5 279/3/5 284/3/5
f 286/6/5 280/6/5 279/6/5
f 286/3/5 279/3/5 285/3/5
f 287/3/5 255/3/5 280/3/5
f 287/6/5 280/6/5 286/6/5
f 288/5/5 256/5/5 255/5/5
f 288/3/5 255/3/5 287/3/5
f 289/5/5 256/5/5 288/5/5
f 290/3/5 286/3/5 285/3/5
f 290/3/5 287/3/5 286/3/5
f 291/3/5 287/3/5 290/3/5
f 292/3/5 290/3/5 285/3/5
f 292/6/5 291/6/5 290/6/5
f 293/3/5 287/3/5 291/3/5
f 293/6/5 291/6/5 292/6/5
f 294/5/5 288/5/5 287/5/5
f 294/3/5 287/3/5 293/3/5
f 295/5/5 288/5/5 294/5/5
f 297/5/5 282/5/5 281/5/5
f 298/3/5 283/3/5 282/3/5
f 298/3/5 284/3/5 283/3/5
f 298/5/5 282/5/5 297/5/5
f 299/4/5 285/4/5 284/4/5
f 299/3/5 284/3/5 298/3/5
f 300/3/5 293/3/5 292/3/5
f 300/4/5 285/4/5 299/4/5
f 300/3/5 292/3/5 285/3/5
f 301/3/5 293/3/5 300/3/5
f 302/5/5 294/5/5 293/5/5
f 302/3/5 293/3/5 301/3/5
f 303/3/5 299/3/5 298/3/5
f 303/3/5 298/3/5 297/3/5
f 303/3/5 301/3/5 300/3/5
f 303/3/5 300/3/5 299/3/5
f 304/5/5 302/5/5 301/5/5
f 304/3/5 301/3/5 303/3/5
f 305/5/5 294/5/5 302/5/5
f 305/5/5 302/5/5 304/5/5
f 306/5/5 297/5/5 296/5/5
f 306/3/5 303/3/5 297/3/5
f 307/5/5 304/5/5 303/5/5
f 307/3/5 303/3/5 306/3/5
f 308/5/5 304/5/5 307/5/5
f 309/5/5 306/5/5 296/5/5
f 309/5/5 307/5/5 306/5/5
f 310/5/5 307/5/5 309/5/5
f 311/5/6 312/5/6 314/5/6
f 314/5/6 312/5/6 315/5/6
f 313/5/6 314/5/6 318/5/6
f 314/3/6 315/3/6 319/3/6
f 318/5/6 314/5/6 319/5/6
f 319/3/6 315/3/6 320/3/6
f 320/3/6 315/3/6 321/3/6
f 321/3/6 315/3/6 322/3/6
f 322/3/6 315/3/6 323/3/6
f 315/5/6 316/5/6 324/5/6
f 323/3/6 315/3/6 324/3/6
f 324/5/6 316/5/6 325/5/6
f 317/5/6 318/5/6 327/5/6
f 318/3/6 319/3/6 328/3/6
f 327/5/6 318/5/6 328/5/6
f 328/3/6 319/3/6 329/3/6
f 319/6/6 320/6/6 330/6/6
f 329/3/6 319/3/6 330/3/6
f 320/3/6 321/3/6 331/3/6
f 330/6/6 320/6/6 331/6/6
f 322/3/6 323/3/6 332/3/6
f 323/6/6 324/6/6 332/6/6
f 324/3/6 325/3/6 333/3/6
f 332/6/6 324/6/6 333/6/6
f 333/3/6 325/3/6 334/3/6
f 325/5/6 326/5/6 335/5/6
f 334/3/6 325/3/6 335/3/6
f 335/5/6 326/5/6 336/5/6
f 317/5/6 327/5/6 338/5/6
f 327/3/6 328/3/6 339/3/6
f 338/5/6 327/5/6 339/5/6
f 339/3/6 328/3/6 340/3/6
f 329/3/6 330/3/6 341/3/6
f 330/3/6 331/3/6 341/3/6
f 341/3/6 331/3/6 342/3/6
f 331/3/6 321/3/6 343/3/6
f 342/3/6 331/3/6 343/3/6
f 321/4/6 322/4/6 343/4/6
f 333/3/6 334/3/6 344/3/6
f 343/4/6 322/4/6 344/4/6
f 322/3/6 332/3/6 344/3/6
f 332/3/6 333/3/6 344/3/6
f 344/3/6 334/3/6 345/3/6
f 335/4/6 336/4/6 346/4/6
f 345/3/6 334/3/6 346/3/6
f 334/4/6 335/4/6 346/4/6
f 346/4/6 336/4/6 347/4/6
f 336/5/6 326/5/6 348/5/6
f 347/4/6 336/4/6 348/4/6
f 348/5/6 326/5/6 349/5/6
f 338/3/6 339/3/6 351/3/6
f 342/3/6 343/3/6 354/3/6
f 344/3/6 345/3/6 354/3/6
f 343/3/6 344/3/6 354/3/6
f 354/3/6 345/3/6 355/3/6
f 355/3/6 345/3/6 356/3/6
f 346/4/6 347/4/6 357/4/6
f 356/3/6 345/3/6 357/3/6
f 345/4/6 346/4/6 357/4/6
f 357/4/6 347/4/6 358/4/6
f 348/3/6 349/3/6 359/3/6
f 358/4/6 347/4/6 359/4/6
f 347/3/6 348/3/6 359/3/6
f 337/5/6 338/5/6 361/5/6
f 351/3/6 352/3/6 362/3/6
f 338/3/6 351/3/6 362/3/6
f 361/5/6 338/5/6 362/5/6
f 362/3/6 352/3/6 363/3/6
f 354/4/6 355/4/6 364/4/6
f 353/4/6 354/4/6 364/4/6
f 355/3/6 356/3/6 365/3/6
f 364/4/6 355/4/6 365/4/6
f 365/3/6 356/3/6 366/3/6
f 356/4/6 357/4/6 367/4/6
f 366/3/6 356/3/6 367/3/6
f 357/5/6 358/5/6 368/5/6
f 367/4/6 357/4/6 368/4/6
f 358/3/6 359/3/6 369/3/6
f 368/5/6 358/5/6 369/5/6
f 359/3/6 349/3/6 370/3/6
f 369/3/6 359/3/6 370/3/6
f 370/3/6 349/3/6 371/3/6
f 349/5/6 350/5/6 372/5/6
f 371/3/6 349/3/6 372/3/6
f 372/5/6 350/5/6 373/5/6
f 363/3/6 364/3/6 375/3/6
f 362/3/6 363/3/6 375/3/6
f 361/3/6 362/3/6 375/3/6
f 364/3/6 365/3/6 375/3/6
f 375/3/6 365/3/6 376/3/6
f 376/3/6 365/3/6 377/3/6
f 365/4/6 366/4/6 378/4/6
f 377/3/6 365/3/6 378/3/6
f 366/5/6 367/5/6 379/5/6
f 378/4/6 366/4/6 379/4/6
f 367/5/6 368/5/6 379/5/6
f 370/6/6 371/6/6 380/6/6
f 368/3/6 369/3/6 380/3/6
f 369/3/6 370/3/6 380/3/6
f 372/3/6 373/3/6 381/3/6
f 380/6/6 371/6/6 381/6/6
f 371/3/6 372/3/6 381/3/6
f 361/3/6 375/3/6 382/3/6
f 375/6/6 376/6/6 382/6/6
f 382/6/6 376/6/6 383/6/6
f 376/3/6 377/3/6 384/3/6
f 383/6/6 376/6/6 384/6/6
f 377/5/6 378/5/6 385/5/6
f 384/3/6 377/3/6 385/3/6
f 378/5/6 379/5/6 385/5/6
f 379/5/6 368/5/6 386/5/6
f 385/5/6 379/5/6 386/5/6
f 386/5/6 368/5/6 387/5/6
f 368/3/6 380/3/6 388/3/6
f 387/5/6 368/5/6 388/5/6
f 380/3/6 381/3/6 388/3/6
f 381/3/6 373/3/6 389/3/6
f 388/3/6 381/3/6 389/3/6
f 360/5/6 361/5/6 390/5/6
f 382/3/6 383/3/6 390/3/6
f 361/3/6 382/3/6 390/3/6
f 384/5/6 385/5/6 391/5/6
f 390/3/6 383/3/6 391/3/6
f 383/5/6 384/5/6 391/5/6
f 391/5/6 385/5/6 392/5/6
f 387/4/6 388/4/6 393/4/6
f 388/4/6 389/4/6 393/4/6
f 389/3/6 373/3/6 394/3/6
f 393/4/6 389/4/6 394/4/6
f 360/5/6 390/5/6 395/5/6
f 390/5/6 391/5/6 395/5/6
f 395/5/6 391/5/6 396/5/6
f 393/3/6 394/3/6 397/3/6
f 394/3/6 373/3/6 398/3/6
f 397/3/6 394/3/6 398/3/6
f 386/5/6 387/5/6 400/5/6
f 387/4/6 393/4/6 401/4/6
f 400/5/6 387/5/6 401/5/6
f 393/3/6 397/3/6 402/3/6
f 401/4/6 393/4/6 402/4/6
f 402/3/6 397/3/6 403/3/6
f 397/6/6 398/6/6 404/6/6
f 403/3/6 397/3/6 404/3/6
f 398/3/6 373/3/6 405/3/6
f 404/6/6 398/6/6 405/6/6
f 373/5/6 374/5/6 406/5/6
f 405/3/6 373/3/6 406/3/6
f 406/5/6 374/5/6 407/5/6
f 404/3/6 405/3/6 408/3/6
f 403/3/6 404/3/6 408/3/6
f 408/3/6 405/3/6 409/3/6
f 403/3/6 408/3/6 410/3/6
f 408/6/6 409/6/6 410/6/6
f 409/3/6 405/3/6 411/3/6
f 410/6/6 409/6/6 411/6/6
f 405/5/6 406/5/6 412/5/6
f 411/3/6 405/3/6 412/3/6
f 412/5/6 406/5/6 413/5/6
f 399/5/6 400/5/6 415/5/6
f 400/3/6 401/3/6 416/3/6
f 401/3/6 402/3/6 416/3/6
f 415/5/6 400/5/6 416/5/6
f 402/4/6 403/4/6 417/4/6
f 416/3/6 402/3/6 417/3/6
f 410/3/6 411/3/6 418/3/6
f 417/4/6 403/4/6 418/4/6
f 403/3/6 410/3/6 418/3/6
f 418/3/6 411/3/6 419/3/6
f 411/5/6 412/5/6 420/5/6
f 419/3/6 411/3/6 420/3/6
f 416/3/6 417/3/6 421/3/6
f 415/3/6 416/3/6 421/3/6
f 418/3/6 419/3/6 421/3/6
f 417/3/6 418/3/6 421/3/6
f 419/5/6 420/5/6 422/5/6
f 421/3/6 419/3/6 422/3/6
f 420/5/6 412/5/6 423/5/6
f 422/5/6 420/5/6 423/5/6
f 414/5/6 415/5/6 424/5/6
f 415/3/6 421/3/6 424/3/6
f 421/5/6 422/5/6 425/5/6
f 424/3/6 421/3/6 425/3/6
f 425/5/6 422/5/6 426/5/6
f 414/5/6 424/5/6 427/5/6
f 424/5/6 425/5/6 427/5/6
f 427/5/6 425/5/6 428/5/6
f 429/1/6 430/1/6 432/1/6
f 432/1/6 430/1/6 433/1/6
f 431/1/6 432/1/6 435/1/6
f 432/2/6 433/2/6 436/2/6
f 435/1/6 432/1/6 436/1/6
f 433/1/6 434/1/6 437/1/6
f 436/2/6 433/2/6 437/2/6
f 437/1/6 434/1/6 438/1/6
f 436/1/6 437/1/6 439/1/6
f 439/1/6 437/1/6 440/1/6
