%YAML 1.1
%TAG !u! tag:unity3d.com,2011:
--- !u!1001 &5475910078003895358
PrefabInstance:
  m_ObjectHideFlags: 0
  serializedVersion: 2
  m_Modification:
    m_TransformParent: {fileID: 0}
    m_Modifications:
    - target: {fileID: 423193119892098979, guid: 476bcb40e2285524bb1ef31192d6e0b0,
        type: 3}
      propertyPath: m_RootOrder
      value: 0
      objectReference: {fileID: 0}
    - target: {fileID: 423193119892098979, guid: 476bcb40e2285524bb1ef31192d6e0b0,
        type: 3}
      propertyPath: m_LocalPosition.x
      value: 0
      objectReference: {fileID: 0}
    - target: {fileID: 423193119892098979, guid: 476bcb40e2285524bb1ef31192d6e0b0,
        type: 3}
      propertyPath: m_LocalPosition.y
      value: 0
      objectReference: {fileID: 0}
    - target: {fileID: 423193119892098979, guid: 476bcb40e2285524bb1ef31192d6e0b0,
        type: 3}
      propertyPath: m_LocalPosition.z
      value: 0
      objectReference: {fileID: 0}
    - target: {fileID: 423193119892098979, guid: 476bcb40e2285524bb1ef31192d6e0b0,
        type: 3}
      propertyPath: m_LocalRotation.w
      value: 1
      objectReference: {fileID: 0}
    - target: {fileID: 423193119892098979, guid: 476bcb40e2285524bb1ef31192d6e0b0,
        type: 3}
      propertyPath: m_LocalRotation.x
      value: 0
      objectReference: {fileID: 0}
    - target: {fileID: 423193119892098979, guid: 476bcb40e2285524bb1ef31192d6e0b0,
        type: 3}
      propertyPath: m_LocalRotation.y
      value: 0
      objectReference: {fileID: 0}
    - target: {fileID: 423193119892098979, guid: 476bcb40e2285524bb1ef31192d6e0b0,
        type: 3}
      propertyPath: m_LocalRotation.z
      value: 0
      objectReference: {fileID: 0}
    - target: {fileID: 423193119892098979, guid: 476bcb40e2285524bb1ef31192d6e0b0,
        type: 3}
      propertyPath: m_LocalEulerAnglesHint.x
      value: 0
      objectReference: {fileID: 0}
    - target: {fileID: 423193119892098979, guid: 476bcb40e2285524bb1ef31192d6e0b0,
        type: 3}
      propertyPath: m_LocalEulerAnglesHint.y
      value: 0
      objectReference: {fileID: 0}
    - target: {fileID: 423193119892098979, guid: 476bcb40e2285524bb1ef31192d6e0b0,
        type: 3}
      propertyPath: m_LocalEulerAnglesHint.z
      value: 0
      objectReference: {fileID: 0}
    - target: {fileID: 1050652951229404441, guid: 476bcb40e2285524bb1ef31192d6e0b0,
        type: 3}
      propertyPath: m_Name
      value: pref_key_00
      objectReference: {fileID: 0}
    m_RemovedComponents: []
  m_SourcePrefab: {fileID: 100100000, guid: 476bcb40e2285524bb1ef31192d6e0b0, type: 3}
