%YAML 1.1
%TAG !u! tag:unity3d.com,2011:
--- !u!114 &11400000
MonoBehaviour:
  m_ObjectHideFlags: 0
  m_CorrespondingSourceObject: {fileID: 0}
  m_PrefabInstance: {fileID: 0}
  m_PrefabAsset: {fileID: 0}
  m_GameObject: {fileID: 0}
  m_Enabled: 1
  m_EditorHideFlags: 0
  m_Script: {fileID: 11500000, guid: e9f36af48d536ce4bb285906ad9ad914, type: 3}
  m_Name: data_1ER_Room102Baignoire
  m_EditorClassIdentifier: 
  sentences:
  - Une lampe dans la baignoire ?
  - Qui serait assez inconscient pour jouer avec une lampe dans une baignoire ?
  voiceName:
  - voice1Etage49
  - voice1Etage50
  typingSpeed:
  - 0.05
  - 0.05
  waitingSpeed:
  - 0.5
  - 0.5
  deblockText: 
  needDeblock: 
  index: 0
