%YAML 1.1
%TAG !u! tag:unity3d.com,2011:
--- !u!114 &11400000
MonoBehaviour:
  m_ObjectHideFlags: 0
  m_CorrespondingSourceObject: {fileID: 0}
  m_PrefabInstance: {fileID: 0}
  m_PrefabAsset: {fileID: 0}
  m_GameObject: {fileID: 0}
  m_Enabled: 1
  m_EditorHideFlags: 0
  m_Script: {fileID: 11500000, guid: e9f36af48d536ce4bb285906ad9ad914, type: 3}
  m_Name: data_2eme_Coffre203
  m_EditorClassIdentifier: 
  sentences:
  - "Vous semblez exp\xE9riment\xE9 pour d\xE9verrouiller des serrures..."
  - "Simplement d\xE9brouillard ou connaisseur dans le crochetage ?"
  voiceName:
  - voice2Etage27
  - voice2Etage28
  typingSpeed:
  - 0.03
  - 0.04
  waitingSpeed:
  - 0.4
  - 0.4
  deblockText: 
  needDeblock: 
  NameADBusted: []
  index: 0
