%YAML 1.1
%TAG !u! tag:unity3d.com,2011:
--- !u!114 &11400000
MonoBehaviour:
  m_ObjectHideFlags: 0
  m_CorrespondingSourceObject: {fileID: 0}
  m_PrefabInstance: {fileID: 0}
  m_PrefabAsset: {fileID: 0}
  m_GameObject: {fileID: 0}
  m_Enabled: 1
  m_EditorHideFlags: 0
  m_Script: {fileID: 11500000, guid: e9f36af48d536ce4bb285906ad9ad914, type: 3}
  m_Name: data_RDC_AfterFirstDoor
  m_EditorClassIdentifier: 
  sentences:
  - "Oh ! Toutes mes excuses pour le d\xE9sordre, nous avons quelques probl\xE8mes\u2026
    d'organisation en ce moment."
  voiceName:
  - voiceRDC13
  typingSpeed:
  - 0.06
  waitingSpeed:
  - 0.7
  deblockText: 
  needDeblock: 
  NameADBusted:
  - DialogZoneCoteComptoir
  index: 0
