%YAML 1.1
%TAG !u! tag:unity3d.com,2011:
--- !u!114 &-7552688821996742963
MonoBehaviour:
  m_ObjectHideFlags: 11
  m_CorrespondingSourceObject: {fileID: 0}
  m_PrefabInstance: {fileID: 0}
  m_PrefabAsset: {fileID: 0}
  m_GameObject: {fileID: 0}
  m_Enabled: 1
  m_EditorHideFlags: 0
  m_Script: {fileID: 11500000, guid: d0353a89b1f911e48b9e16bdc9f2e058, type: 3}
  m_Name: 
  m_EditorClassIdentifier: 
  version: 1
--- !u!21 &2100000
Material:
  serializedVersion: 6
  m_ObjectHideFlags: 0
  m_CorrespondingSourceObject: {fileID: 0}
  m_PrefabInstance: {fileID: 0}
  m_PrefabAsset: {fileID: 0}
  m_Name: MS_Feuille203_1-1
  m_Shader: {fileID: 4800000, guid: 1d1d4e1d0c85c334f98f99a29a0d1a31, type: 3}
  m_ShaderKeywords: _EMISSION _GLOSSYREFLECTIONS_OFF _NEONMATERIAL1_ON _NEONMATERIAL2_ON
  m_LightmapFlags: 0
  m_EnableInstancingVariants: 1
  m_DoubleSidedGI: 0
  m_CustomRenderQueue: -1
  stringTagMap: {}
  disabledShaderPasses: []
  m_SavedProperties:
    serializedVersion: 3
    m_TexEnvs:
    - _Albedo:
        m_Texture: {fileID: 0}
        m_Scale: {x: 1, y: 1}
        m_Offset: {x: 0, y: 0}
    - _Albedo1:
        m_Texture: {fileID: 0}
        m_Scale: {x: 1, y: 1}
        m_Offset: {x: 0, y: 0}
    - _BaseMap:
        m_Texture: {fileID: 0}
        m_Scale: {x: 1, y: 1}
        m_Offset: {x: 0, y: 0}
    - _BumpMap:
        m_Texture: {fileID: 0}
        m_Scale: {x: 1, y: 1}
        m_Offset: {x: 0, y: 0}
    - _DetailAlbedoMap:
        m_Texture: {fileID: 0}
        m_Scale: {x: 1, y: 1}
        m_Offset: {x: 0, y: 0}
    - _DetailMask:
        m_Texture: {fileID: 0}
        m_Scale: {x: 1, y: 1}
        m_Offset: {x: 0, y: 0}
    - _DetailNormalMap:
        m_Texture: {fileID: 0}
        m_Scale: {x: 1, y: 1}
        m_Offset: {x: 0, y: 0}
    - _Diffuse1:
        m_Texture: {fileID: 2800000, guid: bf963d1f25cedbc4b80776316eb8b7fe, type: 3}
        m_Scale: {x: 1, y: 1}
        m_Offset: {x: 0, y: 0}
    - _EmissionMap:
        m_Texture: {fileID: 0}
        m_Scale: {x: 1, y: 1}
        m_Offset: {x: 0, y: 0}
    - _MainTex:
        m_Texture: {fileID: 2800000, guid: 3dece32e567fa7f49ae3a1694b1683f9, type: 3}
        m_Scale: {x: 1, y: 1}
        m_Offset: {x: 0, y: 0}
    - _MetallicGlossMap:
        m_Texture: {fileID: 0}
        m_Scale: {x: 1, y: 1}
        m_Offset: {x: 0, y: 0}
    - _Normal:
        m_Texture: {fileID: 0}
        m_Scale: {x: 1, y: 1}
        m_Offset: {x: 0, y: 0}
    - _OcclusionMap:
        m_Texture: {fileID: 0}
        m_Scale: {x: 1, y: 1}
        m_Offset: {x: 0, y: 0}
    - _Opacity:
        m_Texture: {fileID: 0}
        m_Scale: {x: 1, y: 1}
        m_Offset: {x: 0, y: 0}
    - _ParallaxMap:
        m_Texture: {fileID: 0}
        m_Scale: {x: 1, y: 1}
        m_Offset: {x: 0, y: 0}
    - _SpecGlossMap:
        m_Texture: {fileID: 0}
        m_Scale: {x: 1, y: 1}
        m_Offset: {x: 0, y: 0}
    - _TextureSample0:
        m_Texture: {fileID: 2800000, guid: 3dece32e567fa7f49ae3a1694b1683f9, type: 3}
        m_Scale: {x: 0.26, y: 0.6}
        m_Offset: {x: 0.05, y: 0.56}
    - _TextureSample1:
        m_Texture: {fileID: 2800000, guid: bf963d1f25cedbc4b80776316eb8b7fe, type: 3}
        m_Scale: {x: 1, y: 1}
        m_Offset: {x: 0, y: 0}
    - _TextureSample2:
        m_Texture: {fileID: 0}
        m_Scale: {x: 1, y: 1}
        m_Offset: {x: 0, y: 0}
    - _ToonRamp:
        m_Texture: {fileID: 2800000, guid: 43293c38a102d404e8ad405969a29a1d, type: 3}
        m_Scale: {x: 1, y: 1}
        m_Offset: {x: 0, y: 0}
    - _ToonRamp1:
        m_Texture: {fileID: 2800000, guid: 52e66a9243cdfed44b5e906f5910d35b, type: 3}
        m_Scale: {x: 1, y: 1}
        m_Offset: {x: 0, y: 0}
    - _texcoord:
        m_Texture: {fileID: 0}
        m_Scale: {x: 1, y: 1}
        m_Offset: {x: 0, y: 0}
    m_Floats:
    - _ASEOutlineWidth: 0.0003
    - _AlphaClip: 0
    - _BlacklightPower: 0.7
    - _Blend: 0
    - _BumpScale: 1
    - _Cull: 2
    - _Cutoff: 0
    - _DetailNormalMapScale: 1
    - _Distance: 4
    - _Distance1: 0
    - _DistanceLight: 12
    - _DistanceLight1: 10
    - _DstBlend: 0
    - _EdgeLength: 15
    - _EnvironmentReflections: 1
    - _Float0: 2.4
    - _Float1: 0
    - _Float2: 0.12
    - _Float3: -1
    - _Float4: 0
    - _Gloss: 1
    - _GlossMapScale: 0
    - _Glossiness: 0
    - _GlossyReflections: 0
    - _Intensity: 1
    - _Max: 1.3
    - _Metallic: 0
    - _Min: 1
    - _Mode: 0
    - _NeonMaterial: 0
    - _NeonMaterial1: 1
    - _NeonMaterial2: 1
    - _OPACITYFLASHLIGHT_ON: 0
    - _OcclusionStrength: 1
    - _Parallax: 0.02
    - _PoweEmession: 0
    - _PoweEmession1: 0
    - _PowerColor: 1
    - _PowerColor1: 9.4
    - _QueueOffset: 0
    - _ReceiveShadows: 1
    - _RimOffset1: 0.42
    - _RimPower1: 1.29
    - _Smoothness: 0.5
    - _SmoothnessTextureChannel: 0
    - _SpecTransition: 0
    - _Specsomething: 2
    - _SpecularHighlights: 1
    - _SrcBlend: 1
    - _Surface: 0
    - _UVSec: 0
    - _WorkflowMode: 1
    - _ZWrite: 1
    - __dirty: 0
    - _max: 0
    - _opacityflashlight: 0
    - _rimOffset: 0.59
    - _rimPower: 0.027
    m_Colors:
    - _ASEOutlineColor: {r: 0, g: 0, b: 0, a: 0}
    - _BaseColor: {r: 1, g: 1, b: 1, a: 1}
    - _Color: {r: 1, g: 1, b: 1, a: 1}
    - _Color0: {r: 0.8962264, g: 0.5871188, b: 0.16487186, a: 0}
    - _ColorBlackLight: {r: 0.3396225, g: 0.17782116, b: 0.33315092, a: 0}
    - _ColorBlackLight1: {r: 1, g: 1, b: 1, a: 0}
    - _ColorWhiteLight: {r: 1, g: 0.46625066, b: 0.28773564, a: 0}
    - _CouleurAmbianceGlobal: {r: 0.3843137, g: 0.490196, b: 0.6039216, a: 0}
    - _EmissionColor: {r: 0, g: 0, b: 0, a: 1}
    - _RimColor1: {r: 0, g: 1, b: 0.8758622, a: 0}
    - _SpecColor: {r: 0.03773582, g: 0.03773582, b: 0.03773582, a: 0}
    - _Tint: {r: 0.8584906, g: 0.8584906, b: 0.8584906, a: 0}
    - _Tint1: {r: 0, g: 0, b: 0, a: 0}
    - _rimColor: {r: 0.24136683, g: 0.37097326, b: 0.45282984, a: 0}
