%YAML 1.1
%TAG !u! tag:unity3d.com,2011:
--- !u!114 &11400000
MonoBehaviour:
  m_ObjectHideFlags: 0
  m_CorrespondingSourceObject: {fileID: 0}
  m_PrefabInstance: {fileID: 0}
  m_PrefabAsset: {fileID: 0}
  m_GameObject: {fileID: 0}
  m_Enabled: 1
  m_EditorHideFlags: 0
  m_Script: {fileID: 11500000, guid: e9f36af48d536ce4bb285906ad9ad914, type: 3}
  m_Name: data_Bell_InteractionBell
  m_EditorClassIdentifier: 
  sentences:
  - "Arr\xEAtez \xE7a, je vous prie."
  - "Ne touchez plus \xE0 \xE7a."
  - "Si vous continuez \xE0 appuyer sur cette sonnette..."
  - Je ne plaisante pas.
  - (soupir) Vous l'aurez voulu.
  voiceName:
  - voiceBell4
  - voiceBell5
  - voiceBell6
  - voiceBell7
  - 
  typingSpeed:
  - 0.04
  - 0.04
  - 0.04
  - 0.04
  - 0.07
  waitingSpeed:
  - 0.5
  - 0.5
  - 0.7
  - 1
  - 1.5
  deblockText: 
  needDeblock: 
  NameADBusted: []
  index: 0
