%YAML 1.1
%TAG !u! tag:unity3d.com,2011:
--- !u!114 &11400000
MonoBehaviour:
  m_ObjectHideFlags: 0
  m_CorrespondingSourceObject: {fileID: 0}
  m_PrefabInstance: {fileID: 0}
  m_PrefabAsset: {fileID: 0}
  m_GameObject: {fileID: 0}
  m_Enabled: 1
  m_EditorHideFlags: 0
  m_Script: {fileID: 11500000, guid: d098852f74c2ba2438d396c1decc6f3d, type: 3}
  m_Name: SecondDialog
  m_EditorClassIdentifier: 
  sentences:
  - "Navr\xE9(e), mais l\u2019ascenseur est bloqu\xE9."
  - "J\u2019esp\xE8re que vous ne voyez pas d\u2019inconv\xE9nient \xE0 prendre les
    escaliers."
  index: 1
  typingSpeed: 0.03
  waitingSpeed: 3
  ID: 1
