%YAML 1.1
%TAG !u! tag:unity3d.com,2011:
--- !u!114 &11400000
MonoBehaviour:
  m_ObjectHideFlags: 0
  m_CorrespondingSourceObject: {fileID: 0}
  m_PrefabInstance: {fileID: 0}
  m_PrefabAsset: {fileID: 0}
  m_GameObject: {fileID: 0}
  m_Enabled: 1
  m_EditorHideFlags: 0
  m_Script: {fileID: 11500000, guid: e9f36af48d536ce4bb285906ad9ad914, type: 3}
  m_Name: data_RDC_Bienvenue
  m_EditorClassIdentifier: 
  sentences:
  - "Bienvenue dans notre \xE9tablissement. Malheureusement, nous sommes ferm\xE9s\u2026"
  - "Oh, c'est vous. J'ai \xE9t\xE9 pr\xE9venu de votre arriv\xE9e. Vous pouvez monter
    au 3\xE8me \xE9tage, chambre 302."
  voiceName:
  - voiceRDC2
  - voiceRDC3
  typingSpeed:
  - 0.05
  - 0.09
  waitingSpeed:
  - 0.8
  - 0.5
  deblockText: 
  needDeblock: 
  NameADBusted: []
  index: 1
