%YAML 1.1
%TAG !u! tag:unity3d.com,2011:
--- !u!21 &2100000
Material:
  serializedVersion: 6
  m_ObjectHideFlags: 0
  m_CorrespondingSourceObject: {fileID: 0}
  m_PrefabInstance: {fileID: 0}
  m_PrefabAsset: {fileID: 0}
  m_Name: MS_ShaderOpacity1stDoor
  m_Shader: {fileID: 4800000, guid: 1d1d4e1d0c85c334f98f99a29a0d1a31, type: 3}
  m_ShaderKeywords: _NEONMATERIAL_ON
  m_LightmapFlags: 0
  m_EnableInstancingVariants: 0
  m_DoubleSidedGI: 0
  m_CustomRenderQueue: -1
  stringTagMap: {}
  disabledShaderPasses: []
  m_SavedProperties:
    serializedVersion: 3
    m_TexEnvs:
    - _Normal:
        m_Texture: {fileID: 0}
        m_Scale: {x: 1, y: 1}
        m_Offset: {x: 0, y: 0}
    - _Opacity:
        m_Texture: {fileID: 2800000, guid: ef3aaaf06f59e2148bb58f8e8a70bad4, type: 3}
        m_Scale: {x: 1, y: 1}
        m_Offset: {x: 0, y: 0}
    - _TextureSample0:
        m_Texture: {fileID: 2800000, guid: 87a7f40975f683749b7d762f18493f70, type: 3}
        m_Scale: {x: 1, y: 1}
        m_Offset: {x: 0, y: 0}
    - _TextureSample1:
        m_Texture: {fileID: 2800000, guid: 79fd74396d8391c49954fe5f80f8699b, type: 3}
        m_Scale: {x: 1, y: 1}
        m_Offset: {x: 0, y: 0}
    - _ToonRamp:
        m_Texture: {fileID: 0}
        m_Scale: {x: 1, y: 1}
        m_Offset: {x: 0, y: 0}
    - _texcoord:
        m_Texture: {fileID: 0}
        m_Scale: {x: 1, y: 1}
        m_Offset: {x: 0, y: 0}
    m_Floats:
    - _Cutoff: 0.001
    - _Distance: 4
    - _NeonMaterial: 1
    - _PoweEmession: 0
    - __dirty: 0
    - _rimOffset: 1
    - _rimPower: 0
    m_Colors:
    - _Tint: {r: 1, g: 1, b: 1, a: 0}
    - _rimColor: {r: 0, g: 0, b: 0, a: 0}
