%YAML 1.1
%TAG !u! tag:unity3d.com,2011:
--- !u!114 &11400000
MonoBehaviour:
  m_ObjectHideFlags: 0
  m_CorrespondingSourceObject: {fileID: 0}
  m_PrefabInstance: {fileID: 0}
  m_PrefabAsset: {fileID: 0}
  m_GameObject: {fileID: 0}
  m_Enabled: 1
  m_EditorHideFlags: 0
  m_Script: {fileID: 11500000, guid: e9f36af48d536ce4bb285906ad9ad914, type: 3}
  m_Name: data_Fin_Couloir
  m_EditorClassIdentifier: 
  sentences:
  - "...nostic vit ... gag\xE9."
  - "...uis d\xE9so..."
  - ... choc a ... violent.
  - "...rait pas du ... volant ... et \xE9tat."
  - ...dez ... spire ?
  - "...e crois qu ... \xE9veille."
  - ...sieur Palmer ?
  - ... Mike ?
  voiceName:
  - voice3Etage12
  - voice3Etage13
  - voice3Etage14
  - voice3Etage16
  - voice3Etage15
  - voice3Etage17
  - voice3Etage19
  - voice3Etage20
  typingSpeed:
  - 0.08
  - 0.05
  - 0.065
  - 0.045
  - 0.11
  - 0.04
  - 0.045
  - 0.03
  waitingSpeed:
  - 3.5
  - 3.5
  - 3.5
  - 3.5
  - 3.5
  - 3.5
  - 2
  - 1
  deblockText: 
  needDeblock: 
  NameADBusted: []
  index: 6
