%YAML 1.1
%TAG !u! tag:unity3d.com,2011:
--- !u!114 &11400000
MonoBehaviour:
  m_ObjectHideFlags: 0
  m_CorrespondingSourceObject: {fileID: 0}
  m_PrefabInstance: {fileID: 0}
  m_PrefabAsset: {fileID: 0}
  m_GameObject: {fileID: 0}
  m_Enabled: 1
  m_EditorHideFlags: 0
  m_Script: {fileID: 11500000, guid: e9f36af48d536ce4bb285906ad9ad914, type: 3}
  m_Name: data_1ER_Bureau104
  m_EditorClassIdentifier: 
  sentences:
  - "Cet enfant semble avoir une fibre artistique d\xE9velopp\xE9e pour son \xE2ge."
  voiceName:
  - voice1Etage39
  typingSpeed:
  - 0.05
  waitingSpeed:
  - 0.5
  deblockText: 
  needDeblock: 
  index: 0
