ENSG00000076924.7
ENSG00000204683.6
ENSG00000109132.5
ENSG00000177025.3
ENSG00000102924.7
ENSG00000198752.5
ENSG00000119042.12
ENSG00000113389.11
ENSG00000196605.3
ENSG00000106479.6
ENSG00000103067.7
ENSG00000080573.6
ENSG00000139197.6
ENSG00000005073.5
ENSG00000167191.7
ENSG00000161940.6
ENSG00000104375.11
ENSG00000166448.10
ENSG00000187288.6
ENSG00000090674.11
ENSG00000170561.8
ENSG00000114026.17
ENSG00000136770.6
ENSG00000215131.6
ENSG00000125812.11
ENSG00000112837.12
ENSG00000108381.6
ENSG00000085382.7
ENSG00000136931.5
ENSG00000185187.8
ENSG00000141255.8
ENSG00000141582.10
ENSG00000185885.11
ENSG00000141570.6
ENSG00000172116.17
ENSG00000142459.4
ENSG00000179348.7
ENSG00000173894.6
ENSG00000163701.14
ENSG00000186493.7
ENSG00000077327.11
ENSG00000104313.13
ENSG00000183019.3
ENSG00000032444.11
ENSG00000148655.10
ENSG00000197757.7
ENSG00000171148.9
ENSG00000166152.3
ENSG00000171798.13
ENSG00000177156.6
ENSG00000019144.12
ENSG00000111704.6
ENSG00000076944.10
ENSG00000083307.6
ENSG00000013297.6
ENSG00000102904.10
ENSG00000159023.14
ENSG00000148826.6
ENSG00000258315.1
ENSG00000172789.3
ENSG00000187140.4
ENSG00000165655.14
ENSG00000013293.5
ENSG00000129514.4
ENSG00000143032.7
ENSG00000141519.10
ENSG00000241553.8
ENSG00000148704.8
ENSG00000177511.5
ENSG00000159263.11
ENSG00000126860.7
ENSG00000124067.12
ENSG00000168397.12
ENSG00000197177.11
ENSG00000104880.13
ENSG00000185201.12
ENSG00000156990.10
ENSG00000165953.5
ENSG00000121390.13
ENSG00000004399.8
ENSG00000106031.6
ENSG00000170577.7
ENSG00000155755.14
ENSG00000148444.11
ENSG00000076984.13
ENSG00000164920.5
ENSG00000198915.7
ENSG00000171135.10
ENSG00000177030.12
ENSG00000187013.2
ENSG00000103540.12
ENSG00000168283.9
ENSG00000163702.14
ENSG00000180806.4
ENSG00000198626.11
ENSG00000178726.6
ENSG00000141448.4
ENSG00000164236.7
ENSG00000142102.11
ENSG00000132950.14
ENSG00000179407.3
ENSG00000125810.9
ENSG00000037965.4
ENSG00000104883.3
ENSG00000077522.8
ENSG00000155760.1
ENSG00000153563.11
ENSG00000273266.1
ENSG00000253293.3
ENSG00000174652.13
ENSG00000119547.5
ENSG00000104918.4
ENSG00000057657.10
ENSG00000121068.9
