\begin{tikzpicture}
	\begin{pgfonlayer}{nodelayer}
		\node [style=none] (0) at (0, -2) {};
		\node [style=none] (1) at (-2, 0) {};
		\node [style=none] (2) at (0, 6) {};
		\node [style=none] (3) at (8, 0) {};
		\node [style=none] (4) at (-1.25, 6) {$P$};
		\node [style=none] (5) at (4, 4) {};
		\node [style=none] (6) at (5, 4) {1};
		\node [style=none] (7) at (8.5, -0.75) {$V$};
		\node [style=none] (8) at (6.5, 5.75) {$U=f_1(P,V)$};
		\node [style=none] (9) at (6.5, 4.75) {$H=f_2(P,V)$};
		\node [style=none] (10) at (4, 0) {};
		\node [style=none] (11) at (0, 4) {};
		\node [style=none] (12) at (4, 4) {};
	\end{pgfonlayer}
	\begin{pgfonlayer}{edgelayer}
		\draw [style=arrow] (1.center) to (3.center);
		\draw [style=arrow] (0.center) to (2.center);
		\draw [style=pointille] (12.center) to (10.center);
		\draw [style=pointille] (12.center) to (11.center);
	\end{pgfonlayer}
\end{tikzpicture}
