\begin{tikzpicture}
	\begin{pgfonlayer}{nodelayer}
		\node [style=none] (0) at (0, 0) {};
		\node [style=none] (1) at (0, 9) {};
		\node [style=none] (2) at (10, 0) {};
		\node [style=none] (3) at (-0.5, 9) {$P$};
		\node [style=none] (4) at (10, -0.5) {$V$};
		\node [style=none] (5) at (4, 0) {};
		\node [style=none] (6) at (8, 0) {};
		\node [style=none] (7) at (4, -0.5) {$V_a=V_2=1L$};
		\node [style=none] (8) at (8, -0.5) {$V_1=2L$};
		\node [style=none] (9) at (0, 3) {};
		\node [style=none] (10) at (-1.75, 3) {$P_1=1bar$};
		\node [style=none] (11) at (4, 8.5) {};
		\node [style=none] (13) at (8, 3) {};
		\node [style=none] (14) at (0, 6) {};
		\node [style=none] (15) at (-1, 6) {$P_2$};
		\node [style=none] (16) at (4, 6) {};
		\node [style=none] (17) at (0, 7.5) {};
		\node [style=none] (18) at (-1, 7.5) {$P_a$};
		\node [style=none] (19) at (4, 7.5) {};
		\node [style=none] (20) at (4.5, 3.5) {Isotherme};
		\node [style=none] (21) at (7.25, 5.75) {Adiabatique};
	\end{pgfonlayer}
	\begin{pgfonlayer}{edgelayer}
		\draw [style=arrow] (0.center) to (1.center);
		\draw [style=arrow] (0.center) to (2.center);
		\draw [style=dash-edgeZ] (5.center) to (11.center);
		\draw [style=dash-edgeZ] (9.center) to (13.center);
		\draw [style=dash-edgeZ] (6.center) to (13.center);
		\draw [style=thick-arrowZ, bend left=45, looseness=0.75] (13.center) to (16.center);
		\draw [style=dash-edgeZ] (14.center) to (16.center);
		\draw [style=dash-edgeZ] (17.center) to (19.center);
		\draw [style=thick-arrowZ, bend left=15, looseness=0.75] (13.center) to (19.center);
		\draw [style=thick-arrowZ] (19.center) to (16.center);
	\end{pgfonlayer}
\end{tikzpicture}
