%YAML 1.1
%TAG !u! tag:unity3d.com,2011:
--- !u!1045 &1
EditorBuildSettings:
  m_ObjectHideFlags: 0
  serializedVersion: 2
  m_Scenes:
  - enabled: 1
    path: Assets/Scenes/MenuScene.unity
    guid: 2efe56cb77c9a6f47b5d8749ec24bcdc
  - enabled: 1
    path: Assets/Scenes/GameScene.unity
    guid: fc2ab437e0ca38543b239bb4baf68e50
  - enabled: 1
    path: Assets/Scenes/LoseScene.unity
    guid: e176cab35598af542ab52dec52a0c6ed
  m_configObjects: {}
