%YAML 1.1
%TAG !u! tag:unity3d.com,2011:
--- !u!1045 &1
EditorBuildSettings:
  m_ObjectHideFlags: 0
  serializedVersion: 2
  m_Scenes:
  - enabled: 1
<<<<<<< HEAD
    path: Assets/Scenes/SampleScene.unity
    guid: 2cda990e2423bbf4892e6590ba056729
=======
    path: Assets/Scenes/Menu.unity
    guid: 51b72b9630a998f4487826e8727c1b19
  - enabled: 1
    path: Assets/Scenes/GameScene1.unity
    guid: e14815565f42a8949b31531d3938ecbf
  - enabled: 1
    path: Assets/Scenes/GameScene2.unity
    guid: 32f1f7e9b5fa65645a93256eb77ed8ab
  - enabled: 1
    path: Assets/Scenes/GameScene3.unity
    guid: 2f82a70d36bd0ea47b0b4afed84ea468
  - enabled: 1
    path: Assets/Scenes/ScoreScreen.unity
    guid: 1cee85384b3687645a7c6c03d2a60b1e
>>>>>>> DevH
  m_configObjects: {}
