%YAML 1.1
%TAG !u! tag:unity3d.com,2011:
--- !u!162 &1
EditorUserSettings:
  m_ObjectHideFlags: 0
  serializedVersion: 4
  m_ConfigSettings:
    RecentlyUsedSceneGuid-0:
      value: 5455570756040c095e575b2146275c4410164d7d7f7b76652e284d67e6e1643b
      flags: 0
    RecentlyUsedSceneGuid-1:
      value: 560252570001580c5c080a7741775b44424f487d7b7b70692e7a4a61e1b1636a
      flags: 0
    RecentlyUsedSceneGuid-2:
      value: 5202045203020f5a090a5b76127b5c4412151c2c282971617f284964e3b36c6d
      flags: 0
    RecentlyUsedSceneGuid-3:
      value: 510304535753085e540c5c27117a0a4415151c2f752a7236292a4b60e1b36c3d
      flags: 0
    RecentlyUsedSceneGuid-4:
      value: 50010405570d080a545c552014710944424e1a79747f7163787f1c37e1b56c3e
      flags: 0
    RecentlyUsedSceneGuid-5:
      value: 515250075c0c595e5f5a5e71122159444e4e4a2f7a7d7f602f284d66b4b76661
      flags: 0
    vcSharedLogLevel:
      value: 0d5e400f0650
      flags: 0
  m_VCAutomaticAdd: 1
  m_VCDebugCom: 0
  m_VCDebugCmd: 0
  m_VCDebugOut: 0
  m_SemanticMergeMode: 2
  m_DesiredImportWorkerCount: 3
  m_StandbyImportWorkerCount: 2
  m_IdleImportWorkerShutdownDelay: 60000
  m_VCShowFailedCheckout: 1
  m_VCOverwriteFailedCheckoutAssets: 1
  m_VCProjectOverlayIcons: 1
  m_VCHierarchyOverlayIcons: 1
  m_VCOtherOverlayIcons: 1
  m_VCAllowAsyncUpdate: 1
  m_ArtifactGarbageCollection: 1
