%YAML 1.1
%TAG !u! tag:unity3d.com,2011:
--- !u!74 &7400000
AnimationClip:
  m_ObjectHideFlags: 0
  m_CorrespondingSourceObject: {fileID: 0}
  m_PrefabInstance: {fileID: 0}
  m_PrefabAsset: {fileID: 0}
  m_Name: explosion
  serializedVersion: 6
  m_Legacy: 0
  m_Compressed: 0
  m_UseHighQualityCurve: 1
  m_RotationCurves: []
  m_CompressedRotationCurves: []
  m_EulerCurves: []
  m_PositionCurves: []
  m_ScaleCurves: []
  m_FloatCurves: []
  m_PPtrCurves:
  - curve:
    - time: 0
      value: {fileID: 581581911, guid: 5896be333a033fe4d94cb862be0ced2a, type: 3}
    - time: 0.016666668
      value: {fileID: -660675219, guid: 5896be333a033fe4d94cb862be0ced2a, type: 3}
    - time: 0.033333335
      value: {fileID: -1406917487, guid: 5896be333a033fe4d94cb862be0ced2a, type: 3}
    - time: 0.05
      value: {fileID: 549777036, guid: 5896be333a033fe4d94cb862be0ced2a, type: 3}
    - time: 0.06666667
      value: {fileID: 396068245, guid: 5896be333a033fe4d94cb862be0ced2a, type: 3}
    - time: 0.1
      value: {fileID: -791563951, guid: 5896be333a033fe4d94cb862be0ced2a, type: 3}
    - time: 0.11666667
      value: {fileID: 2017094492, guid: 5896be333a033fe4d94cb862be0ced2a, type: 3}
    - time: 0.13333334
      value: {fileID: -815443136, guid: 5896be333a033fe4d94cb862be0ced2a, type: 3}
    - time: 0.15
      value: {fileID: -1040640003, guid: 5896be333a033fe4d94cb862be0ced2a, type: 3}
    - time: 0.16666667
      value: {fileID: 1171083352, guid: 5896be333a033fe4d94cb862be0ced2a, type: 3}
    - time: 0.18333334
      value: {fileID: -1341975444, guid: 5896be333a033fe4d94cb862be0ced2a, type: 3}
    - time: 0.2
      value: {fileID: -520805035, guid: 5896be333a033fe4d94cb862be0ced2a, type: 3}
    - time: 0.21666667
      value: {fileID: -936493319, guid: 5896be333a033fe4d94cb862be0ced2a, type: 3}
    - time: 0.23333333
      value: {fileID: 589446228, guid: 5896be333a033fe4d94cb862be0ced2a, type: 3}
    - time: 0.26666668
      value: {fileID: -1706534834, guid: 5896be333a033fe4d94cb862be0ced2a, type: 3}
    - time: 0.28333333
      value: {fileID: 958671800, guid: 5896be333a033fe4d94cb862be0ced2a, type: 3}
    - time: 0.3
      value: {fileID: 1057434115, guid: 5896be333a033fe4d94cb862be0ced2a, type: 3}
    - time: 0.31666666
      value: {fileID: 1756264336, guid: 5896be333a033fe4d94cb862be0ced2a, type: 3}
    - time: 0.33333334
      value: {fileID: 75506699, guid: 5896be333a033fe4d94cb862be0ced2a, type: 3}
    - time: 0.35
      value: {fileID: 1633431482, guid: 5896be333a033fe4d94cb862be0ced2a, type: 3}
    - time: 0.36666667
      value: {fileID: 165768, guid: 5896be333a033fe4d94cb862be0ced2a, type: 3}
    - time: 0.38333333
      value: {fileID: 1411917267, guid: 5896be333a033fe4d94cb862be0ced2a, type: 3}
    - time: 0.4
      value: {fileID: 411774069, guid: 5896be333a033fe4d94cb862be0ced2a, type: 3}
    - time: 0.43333334
      value: {fileID: 732666008, guid: 5896be333a033fe4d94cb862be0ced2a, type: 3}
    - time: 0.45
      value: {fileID: -1604910717, guid: 5896be333a033fe4d94cb862be0ced2a, type: 3}
    - time: 0.46666667
      value: {fileID: 612179994, guid: 5896be333a033fe4d94cb862be0ced2a, type: 3}
    - time: 0.48333332
      value: {fileID: -2080845764, guid: 5896be333a033fe4d94cb862be0ced2a, type: 3}
    - time: 0.5
      value: {fileID: 1972787545, guid: 5896be333a033fe4d94cb862be0ced2a, type: 3}
    attribute: m_Sprite
    path: 
    classID: 212
    script: {fileID: 0}
  m_SampleRate: 60
  m_WrapMode: 0
  m_Bounds:
    m_Center: {x: 0, y: 0, z: 0}
    m_Extent: {x: 0, y: 0, z: 0}
  m_ClipBindingConstant:
    genericBindings:
    - serializedVersion: 2
      path: 0
      attribute: 0
      script: {fileID: 0}
      typeID: 212
      customType: 23
      isPPtrCurve: 1
    pptrCurveMapping:
    - {fileID: 581581911, guid: 5896be333a033fe4d94cb862be0ced2a, type: 3}
    - {fileID: -660675219, guid: 5896be333a033fe4d94cb862be0ced2a, type: 3}
    - {fileID: -1406917487, guid: 5896be333a033fe4d94cb862be0ced2a, type: 3}
    - {fileID: 549777036, guid: 5896be333a033fe4d94cb862be0ced2a, type: 3}
    - {fileID: 396068245, guid: 5896be333a033fe4d94cb862be0ced2a, type: 3}
    - {fileID: -791563951, guid: 5896be333a033fe4d94cb862be0ced2a, type: 3}
    - {fileID: 2017094492, guid: 5896be333a033fe4d94cb862be0ced2a, type: 3}
    - {fileID: -815443136, guid: 5896be333a033fe4d94cb862be0ced2a, type: 3}
    - {fileID: -1040640003, guid: 5896be333a033fe4d94cb862be0ced2a, type: 3}
    - {fileID: 1171083352, guid: 5896be333a033fe4d94cb862be0ced2a, type: 3}
    - {fileID: -1341975444, guid: 5896be333a033fe4d94cb862be0ced2a, type: 3}
    - {fileID: -520805035, guid: 5896be333a033fe4d94cb862be0ced2a, type: 3}
    - {fileID: -936493319, guid: 5896be333a033fe4d94cb862be0ced2a, type: 3}
    - {fileID: 589446228, guid: 5896be333a033fe4d94cb862be0ced2a, type: 3}
    - {fileID: -1706534834, guid: 5896be333a033fe4d94cb862be0ced2a, type: 3}
    - {fileID: 958671800, guid: 5896be333a033fe4d94cb862be0ced2a, type: 3}
    - {fileID: 1057434115, guid: 5896be333a033fe4d94cb862be0ced2a, type: 3}
    - {fileID: 1756264336, guid: 5896be333a033fe4d94cb862be0ced2a, type: 3}
    - {fileID: 75506699, guid: 5896be333a033fe4d94cb862be0ced2a, type: 3}
    - {fileID: 1633431482, guid: 5896be333a033fe4d94cb862be0ced2a, type: 3}
    - {fileID: 165768, guid: 5896be333a033fe4d94cb862be0ced2a, type: 3}
    - {fileID: 1411917267, guid: 5896be333a033fe4d94cb862be0ced2a, type: 3}
    - {fileID: 411774069, guid: 5896be333a033fe4d94cb862be0ced2a, type: 3}
    - {fileID: 732666008, guid: 5896be333a033fe4d94cb862be0ced2a, type: 3}
    - {fileID: -1604910717, guid: 5896be333a033fe4d94cb862be0ced2a, type: 3}
    - {fileID: 612179994, guid: 5896be333a033fe4d94cb862be0ced2a, type: 3}
    - {fileID: -2080845764, guid: 5896be333a033fe4d94cb862be0ced2a, type: 3}
    - {fileID: 1972787545, guid: 5896be333a033fe4d94cb862be0ced2a, type: 3}
  m_AnimationClipSettings:
    serializedVersion: 2
    m_AdditiveReferencePoseClip: {fileID: 0}
    m_AdditiveReferencePoseTime: 0
    m_StartTime: 0
    m_StopTime: 0.51666665
    m_OrientationOffsetY: 0
    m_Level: 0
    m_CycleOffset: 0
    m_HasAdditiveReferencePose: 0
    m_LoopTime: 1
    m_LoopBlend: 0
    m_LoopBlendOrientation: 0
    m_LoopBlendPositionY: 0
    m_LoopBlendPositionXZ: 0
    m_KeepOriginalOrientation: 0
    m_KeepOriginalPositionY: 1
    m_KeepOriginalPositionXZ: 0
    m_HeightFromFeet: 0
    m_Mirror: 0
  m_EditorCurves: []
  m_EulerEditorCurves: []
  m_HasGenericRootTransform: 0
  m_HasMotionFloatCurves: 0
  m_Events:
  - time: 0.5
    functionName: destruir
    data: 
    objectReferenceParameter: {fileID: 0}
    floatParameter: 0
    intParameter: 0
    messageOptions: 0
