[
    { "title": "Cartão de crédito", "color": null },
    { "title": "Cartão de débito", "color": null },
    { "title": "Dinheiro", "color": null },
    { "title": "Transferência DOC/TEC", "color": null },
    { "title": "PIX", "color": null },
    { "title": "Boleto", "color": null },
    { "title": "Débito em conta-corrente", "color": null },
    { "title": "Vale-Alimentação", "color": null },
    { "title": "Vale-Refeição", "color": null }
]
