{
    "MonoBehaviour": {
        "m_Enabled": true,
        "m_EditorHideFlags": 0,
        "m_Name": "",
        "m_EditorClassIdentifier": "",
        "_moduleInfos": [
            {
                "_moduleScriptPath": "Packages/GameSystem/Runtime/Core/Module.cs",
                "_moduleConfigAssetPath": ""
            },
            {
                "_moduleScriptPath": "Packages/GameSystem/Runtime/Core/IModule.cs",
                "_moduleConfigAssetPath": ""
            }
        ]
    }
}