{
	"id": "7abd8fb2-4037-4ec1-8225-ea668e34e6e6",
	"name": "OneRoster v1p1 - QA",
	"values": [
		{
			"key": "URL_API",
			"value": "https://qa-apihub.educacional.com/oneroster",
			"type": "default",
			"enabled": true
		},
		{
			"key": "CLIENT_ID",
			"value": "xxxx",
			"type": "default",
			"enabled": true
		},
		{
			"key": "CLIENT_SECRET",
			"value": "xxxx",
			"type": "default",
			"enabled": true
		},
		{
			"key": "TOKEN",
			"value": "xxxx",
			"type": "default",
			"enabled": true
		}
	],
	"_postman_variable_scope": "environment",
	"_postman_exported_at": "2023-07-19T18:00:52.328Z",
	"_postman_exported_using": "Postman/10.11.2"
}