{
	"info": {
		"_postman_id": "90533d0f-4079-4efe-931b-579c57cfe26a",
		"name": "OneRoster v1p1",
		"schema": "https://schema.getpostman.com/json/collection/v2.1.0/collection.json",
		"_exporter_id": "5045514"
	},
	"item": [
		{
			"name": "Token",
			"item": [
				{
					"name": "Generete Token",
					"request": {
						"auth": {
							"type": "oauth2",
							"oauth2": [
								{
									"key": "tokenName",
									"value": "",
									"type": "string"
								},
								{
									"key": "tokenType",
									"value": "",
									"type": "string"
								},
								{
									"key": "accessToken",
									"value": "",
									"type": "string"
								},
								{
									"key": "accessTokenUrl",
									"value": "{{URL_API}}/authorization",
									"type": "string"
								},
								{
									"key": "clientSecret",
									"value": "{{CLIENT_SECRET}}",
									"type": "string"
								},
								{
									"key": "clientId",
									"value": "{{CLIENT_ID}}",
									"type": "string"
								},
								{
									"key": "scope",
									"value": "",
									"type": "string"
								},
								{
									"key": "grant_type",
									"value": "client_credentials",
									"type": "string"
								},
								{
									"key": "headerPrefix",
									"value": "",
									"type": "string"
								},
								{
									"key": "redirect_uri",
									"value": "https://localhost:8080",
									"type": "string"
								},
								{
									"key": "authUrl",
									"value": "https://auth.brightspace.com/oauth2/auth",
									"type": "string"
								},
								{
									"key": "addTokenTo",
									"value": "header",
									"type": "string"
								}
							]
						},
						"method": "GET",
						"header": [],
						"url": {
							"raw": ""
						}
					},
					"response": []
				}
			]
		},
		{
			"name": "Authorizer",
			"item": [
				{
					"name": "Create Authorizer",
					"request": {
						"auth": {
							"type": "bearer",
							"bearer": [
								{
									"key": "token",
									"value": "{{TOKEN}}",
									"type": "string"
								}
							]
						},
						"method": "POST",
						"header": [],
						"body": {
							"mode": "raw",
							"raw": "{\n    \"client_name\": \"client_name\",\n    \"scopes\": [\n        \"oneroster/academicSessions.read\",\n        \"oneroster/classes.read\",\n        \"oneroster/courses.read\",\n        \"oneroster/demographics.read\",\n        \"oneroster/enrollments.read\",\n        \"oneroster/orgs.read\",\n        \"oneroster/users.read\"\n    ],\n    \"app_id\": \"app_id\"\n}",
							"options": {
								"raw": {
									"language": "json"
								}
							}
						},
						"url": {
							"raw": "{{URL_API}}/v1p1/authorizer",
							"host": [
								"{{URL_API}}"
							],
							"path": [
								"v1p1",
								"authorizer"
							]
						}
					},
					"response": []
				},
				{
					"name": "Create Authorizer Copy",
					"request": {
						"auth": {
							"type": "bearer",
							"bearer": [
								{
									"key": "token",
									"value": "{{TOKEN}}",
									"type": "string"
								}
							]
						},
						"method": "DELETE",
						"header": [],
						"body": {
							"mode": "raw",
							"raw": "{\n    \"client_id\": \"client_name\"\n}",
							"options": {
								"raw": {
									"language": "json"
								}
							}
						},
						"url": {
							"raw": "{{URL_API}}/v1p1/authorizer",
							"host": [
								"{{URL_API}}"
							],
							"path": [
								"v1p1",
								"authorizer"
							]
						}
					},
					"response": []
				}
			]
		},
		{
			"name": "Orgs",
			"item": [
				{
					"name": "Get Orgs",
					"request": {
						"auth": {
							"type": "bearer",
							"bearer": [
								{
									"key": "token",
									"value": "{{TOKEN}}",
									"type": "string"
								}
							]
						},
						"method": "GET",
						"header": [],
						"url": {
							"raw": "{{URL_API}}/v1p1/orgs",
							"host": [
								"{{URL_API}}"
							],
							"path": [
								"v1p1",
								"orgs"
							],
							"query": [
								{
									"key": "filter",
									"value": "sourcedId='53400214-918c-45b8-81c5-1cbe3b4f39ca'",
									"disabled": true
								},
								{
									"key": "fields",
									"value": "sourcedId,name",
									"disabled": true
								},
								{
									"key": "sort",
									"value": "sourcedId",
									"disabled": true
								},
								{
									"key": "orderBy",
									"value": "asc",
									"disabled": true
								},
								{
									"key": "limit",
									"value": "100",
									"disabled": true
								},
								{
									"key": "offset",
									"value": "1",
									"disabled": true
								}
							]
						}
					},
					"response": []
				},
				{
					"name": "Get Org By Id",
					"request": {
						"auth": {
							"type": "bearer",
							"bearer": [
								{
									"key": "token",
									"value": "{{TOKEN}}",
									"type": "string"
								}
							]
						},
						"method": "GET",
						"header": [],
						"url": {
							"raw": "{{URL_API}}/v1p1/orgs/:sourcedId",
							"host": [
								"{{URL_API}}"
							],
							"path": [
								"v1p1",
								"orgs",
								":sourcedId"
							],
							"query": [
								{
									"key": "fields",
									"value": "sourcedId,title,status",
									"disabled": true
								}
							],
							"variable": [
								{
									"key": "sourcedId",
									"value": "53400214-918c-45b8-81c5-1cbe3b4f39ca"
								}
							]
						}
					},
					"response": []
				}
			]
		},
		{
			"name": "Users",
			"item": [
				{
					"name": "Get Users",
					"request": {
						"auth": {
							"type": "bearer",
							"bearer": [
								{
									"key": "token",
									"value": "{{TOKEN}}",
									"type": "string"
								}
							]
						},
						"method": "GET",
						"header": [],
						"url": {
							"raw": "{{URL_API}}/v1p1/users",
							"host": [
								"{{URL_API}}"
							],
							"path": [
								"v1p1",
								"users"
							],
							"query": [
								{
									"key": "filter",
									"value": "sourcedId='A630F89D-8392-11EC-8C3F-0A26DC3FB892' AND orgs.sourcedId='143f94f6-dde1-4961-9de7-5aeab8875fb8'",
									"disabled": true
								},
								{
									"key": "fields",
									"value": "sourcedId,username",
									"disabled": true
								},
								{
									"key": "sort",
									"value": "username",
									"disabled": true
								},
								{
									"key": "orderBy",
									"value": "desc",
									"disabled": true
								},
								{
									"key": "limit",
									"value": "100",
									"disabled": true
								},
								{
									"key": "offset",
									"value": "1",
									"disabled": true
								}
							]
						}
					},
					"response": []
				},
				{
					"name": "Get User By Id",
					"request": {
						"auth": {
							"type": "bearer",
							"bearer": [
								{
									"key": "token",
									"value": "{{TOKEN}}",
									"type": "string"
								}
							]
						},
						"method": "GET",
						"header": [],
						"url": {
							"raw": "{{URL_API}}/v1p1/users/:sourcedId",
							"host": [
								"{{URL_API}}"
							],
							"path": [
								"v1p1",
								"users",
								":sourcedId"
							],
							"query": [
								{
									"key": "fields",
									"value": "sourcedId,title,status",
									"disabled": true
								}
							],
							"variable": [
								{
									"key": "sourcedId",
									"value": "A1992BC2-89B7-11EC-9E60-064673C470A6"
								}
							]
						}
					},
					"response": []
				}
			]
		},
		{
			"name": "Academic Sessions",
			"item": [
				{
					"name": "Get Academic Sessions",
					"request": {
						"auth": {
							"type": "bearer",
							"bearer": [
								{
									"key": "token",
									"value": "{{TOKEN}}",
									"type": "string"
								}
							]
						},
						"method": "GET",
						"header": [],
						"url": {
							"raw": "{{URL_API}}/v1p1/academicSessions?filter=org.sourcedId='c9024396-a190-427d-a1f3-a4dc72adc5fb' AND status='active'",
							"host": [
								"{{URL_API}}"
							],
							"path": [
								"v1p1",
								"academicSessions"
							],
							"query": [
								{
									"key": "filter",
									"value": "org.sourcedId='c9024396-a190-427d-a1f3-a4dc72adc5fb' AND status='active'"
								},
								{
									"key": "fields",
									"value": "sourcedId",
									"disabled": true
								},
								{
									"key": "sort",
									"value": "sourcedId",
									"disabled": true
								},
								{
									"key": "orderBy",
									"value": "asc",
									"disabled": true
								},
								{
									"key": "limit",
									"value": "100",
									"disabled": true
								},
								{
									"key": "offset",
									"value": "1",
									"disabled": true
								}
							]
						}
					},
					"response": []
				},
				{
					"name": "Get Academic Session By Id",
					"request": {
						"auth": {
							"type": "bearer",
							"bearer": [
								{
									"key": "token",
									"value": "{{TOKEN}}",
									"type": "string"
								}
							]
						},
						"method": "GET",
						"header": [],
						"url": {
							"raw": "{{URL_API}}/v1p1/academicSessions/:sourcedId",
							"host": [
								"{{URL_API}}"
							],
							"path": [
								"v1p1",
								"academicSessions",
								":sourcedId"
							],
							"query": [
								{
									"key": "fields",
									"value": "sourcedId,title,status",
									"disabled": true
								}
							],
							"variable": [
								{
									"key": "sourcedId",
									"value": "FD48AE8D-60CF-11EB-9017-0A190BAE2C86"
								}
							]
						}
					},
					"response": []
				}
			]
		},
		{
			"name": "Courses",
			"item": [
				{
					"name": "Get Courses",
					"request": {
						"auth": {
							"type": "bearer",
							"bearer": [
								{
									"key": "token",
									"value": "{{TOKEN}}",
									"type": "string"
								}
							]
						},
						"method": "GET",
						"header": [],
						"url": {
							"raw": "{{URL_API}}/v1p1/courses?filter=org.sourcedId='c9024396-a190-427d-a1f3-a4dc72adc5fb' AND status='active' AND schoolYear.sourcedId='DF1CCB28-98E9-11ED-9BC7-064673C470A6'",
							"host": [
								"{{URL_API}}"
							],
							"path": [
								"v1p1",
								"courses"
							],
							"query": [
								{
									"key": "filter",
									"value": "org.sourcedId='c9024396-a190-427d-a1f3-a4dc72adc5fb' AND status='active' AND schoolYear.sourcedId='DF1CCB28-98E9-11ED-9BC7-064673C470A6'"
								},
								{
									"key": "fields",
									"value": "sourcedId",
									"disabled": true
								},
								{
									"key": "sort",
									"value": "sourcedId",
									"disabled": true
								},
								{
									"key": "orderBy",
									"value": "asc",
									"disabled": true
								},
								{
									"key": "limit",
									"value": "100",
									"disabled": true
								},
								{
									"key": "offset",
									"value": "1",
									"disabled": true
								}
							]
						}
					},
					"response": []
				},
				{
					"name": "Get Course By Id",
					"request": {
						"auth": {
							"type": "bearer",
							"bearer": [
								{
									"key": "token",
									"value": "{{TOKEN}}",
									"type": "string"
								}
							]
						},
						"method": "GET",
						"header": [],
						"url": {
							"raw": "{{URL_API}}/v1p1/courses/:sourcedId",
							"host": [
								"{{URL_API}}"
							],
							"path": [
								"v1p1",
								"courses",
								":sourcedId"
							],
							"query": [
								{
									"key": "fields",
									"value": "sourcedId,title,status",
									"disabled": true
								}
							],
							"variable": [
								{
									"key": "sourcedId",
									"value": "30442621-447B-11EB-BDBD-0A190BAE2C86"
								}
							]
						}
					},
					"response": []
				}
			]
		},
		{
			"name": "Classes",
			"item": [
				{
					"name": "Get Classes",
					"request": {
						"auth": {
							"type": "bearer",
							"bearer": [
								{
									"key": "token",
									"value": "{{TOKEN}}",
									"type": "string"
								}
							]
						},
						"method": "GET",
						"header": [],
						"url": {
							"raw": "{{URL_API}}/v1p1/classes?filter=course.sourcedId='DF7D929F-98E9-11ED-9BC7-064673C470A6' AND school.sourcedId='c9024396-a190-427d-a1f3-a4dc72adc5fb'",
							"host": [
								"{{URL_API}}"
							],
							"path": [
								"v1p1",
								"classes"
							],
							"query": [
								{
									"key": "filter",
									"value": "course.sourcedId='DF7D929F-98E9-11ED-9BC7-064673C470A6' AND school.sourcedId='c9024396-a190-427d-a1f3-a4dc72adc5fb'"
								},
								{
									"key": "fields",
									"value": "sourcedId,title",
									"disabled": true
								},
								{
									"key": "sort",
									"value": "sourcedId",
									"disabled": true
								},
								{
									"key": "orderBy",
									"value": "asc",
									"disabled": true
								},
								{
									"key": "limit",
									"value": "100",
									"disabled": true
								},
								{
									"key": "offset",
									"value": "1",
									"disabled": true
								}
							]
						}
					},
					"response": []
				},
				{
					"name": "Get Class By Id",
					"request": {
						"auth": {
							"type": "bearer",
							"bearer": [
								{
									"key": "token",
									"value": "{{TOKEN}}",
									"type": "string"
								}
							]
						},
						"method": "GET",
						"header": [],
						"url": {
							"raw": "{{URL_API}}/v1p1/classes/:sourcedId",
							"host": [
								"{{URL_API}}"
							],
							"path": [
								"v1p1",
								"classes",
								":sourcedId"
							],
							"query": [
								{
									"key": "fields",
									"value": "sourcedId,title,status",
									"disabled": true
								}
							],
							"variable": [
								{
									"key": "sourcedId",
									"value": "94748"
								}
							]
						}
					},
					"response": []
				}
			]
		},
		{
			"name": "Enrollments",
			"item": [
				{
					"name": "Get Enrollments",
					"request": {
						"auth": {
							"type": "bearer",
							"bearer": [
								{
									"key": "token",
									"value": "{{TOKEN}}",
									"type": "string"
								}
							]
						},
						"method": "GET",
						"header": [],
						"url": {
							"raw": "{{URL_API}}/v1p1/enrollments?filter=class.sourcedId~'1020461,1020462' AND school.sourcedId='c9024396-a190-427d-a1f3-a4dc72adc5fb'",
							"host": [
								"{{URL_API}}"
							],
							"path": [
								"v1p1",
								"enrollments"
							],
							"query": [
								{
									"key": "filter",
									"value": "class.sourcedId~'1020461,1020462' AND school.sourcedId='c9024396-a190-427d-a1f3-a4dc72adc5fb'"
								},
								{
									"key": "fields",
									"value": "sourcedId",
									"disabled": true
								},
								{
									"key": "sort",
									"value": "sourcedId",
									"disabled": true
								},
								{
									"key": "orderBy",
									"value": "asc",
									"disabled": true
								},
								{
									"key": "limit",
									"value": "100",
									"disabled": true
								},
								{
									"key": "offset",
									"value": "1",
									"disabled": true
								}
							]
						}
					},
					"response": []
				},
				{
					"name": "Get Enrollments By Id",
					"request": {
						"auth": {
							"type": "bearer",
							"bearer": [
								{
									"key": "token",
									"value": "{{TOKEN}}",
									"type": "string"
								}
							]
						},
						"method": "GET",
						"header": [],
						"url": {
							"raw": "{{URL_API}}/v1p1/enrollments/:sourcedId",
							"host": [
								"{{URL_API}}"
							],
							"path": [
								"v1p1",
								"enrollments",
								":sourcedId"
							],
							"query": [
								{
									"key": "fields",
									"value": "sourcedId,title,status",
									"disabled": true
								}
							],
							"variable": [
								{
									"key": "sourcedId",
									"value": "C11F2030-29EE-11EB-BDBD-0A190BAE2C86"
								}
							]
						}
					},
					"response": []
				}
			]
		},
		{
			"name": "Demographics",
			"item": [
				{
					"name": "Get Demographics",
					"request": {
						"auth": {
							"type": "bearer",
							"bearer": [
								{
									"key": "token",
									"value": "{{TOKEN}}",
									"type": "string"
								}
							]
						},
						"method": "GET",
						"header": [],
						"url": {
							"raw": "{{URL_API}}/v1p1/demographics",
							"host": [
								"{{URL_API}}"
							],
							"path": [
								"v1p1",
								"demographics"
							],
							"query": [
								{
									"key": "filter",
									"value": "sourcedId='A630F89D-8392-11EC-8C3F-0A26DC3FB892'",
									"disabled": true
								},
								{
									"key": "fields",
									"value": "sourcedId",
									"disabled": true
								},
								{
									"key": "sort",
									"value": "sourcedId",
									"disabled": true
								},
								{
									"key": "orderBy",
									"value": "asc",
									"disabled": true
								},
								{
									"key": "limit",
									"value": "100",
									"disabled": true
								},
								{
									"key": "offset",
									"value": "1",
									"disabled": true
								}
							]
						}
					},
					"response": []
				}
			]
		}
	]
}