{
	"id": "b5b86ac4-987b-40ee-9ba5-49336b3beb50",
	"name": "Data API documentation - QA",
	"values": [
		{
			"key": "URL",
			"value": "https://qa-apihub.educacional.com/manager",
			"type": "default",
			"enabled": true
		},
		{
			"key": "X-API-KEY",
			"value": "xxxxxxxxxxxxxx",
			"type": "default",
			"enabled": true
		}
	],
	"_postman_variable_scope": "environment",
	"_postman_exported_at": "2023-03-14T12:12:50.177Z",
	"_postman_exported_using": "Postman/10.11.2"
}