<svg width="995" height="188" viewBox="0 0 995 188" fill="none" xmlns="http://www.w3.org/2000/svg">
<g clip-path="url(#clip0_413_99)">
<path d="M2.25703 77H1.25703V78H2.25703V77ZM2.25703 66.4L1.60869 65.6386L1.25703 65.9381V66.4H2.25703ZM15.057 55.5L14.4149 54.7333L14.4087 54.7386L15.057 55.5ZM28.757 44.1L28.1209 43.3285L28.1209 43.3285L28.757 44.1ZM38.757 20.5L37.9301 21.0623L37.9355 21.0702L37.941 21.078L38.757 20.5ZM34.357 16.8L33.9098 17.6944L33.9301 17.7046L33.9509 17.7138L34.357 16.8ZM22.957 16.8L22.4808 15.9207L22.4728 15.925L22.465 15.9294L22.957 16.8ZM19.257 20.2L18.4249 19.6453L18.4186 19.655L19.257 20.2ZM16.757 28.2V29.2H17.757V28.2H16.757ZM1.95703 28.2H0.957032V29.2H1.95703V28.2ZM3.55703 19.5L4.49927 19.835L4.50153 19.8285L3.55703 19.5ZM8.45703 11L9.22048 11.646L9.22841 11.6364L8.45703 11ZM16.957 4.5L17.3903 5.40125L17.3903 5.40125L16.957 4.5ZM42.657 4.9L42.2218 5.80043L42.2341 5.80618L42.657 4.9ZM52.257 13L51.4297 13.5619L51.4371 13.5724L52.257 13ZM52.557 37.9L51.7022 37.381L51.6995 37.3855L52.557 37.9ZM43.257 48.7L43.912 49.4557L43.9191 49.4495L43.257 48.7ZM29.457 60L28.841 59.2123L28.8288 59.2218L28.8168 59.2318L29.457 60ZM25.257 63.5L24.6168 62.7318L22.495 64.5H25.257V63.5ZM56.957 63.5H57.957V62.5H56.957V63.5ZM56.957 77V78H57.957V77H56.957ZM3.25703 77V66.4H1.25703V77H3.25703ZM2.90537 67.1614L15.7054 56.2614L14.4087 54.7386L1.60869 65.6386L2.90537 67.1614ZM15.6991 56.2666C21.0312 51.801 25.5958 48.0027 29.3932 44.8715L28.1209 43.3285C24.3183 46.4639 19.7495 50.2657 14.415 54.7334L15.6991 56.2666ZM29.3932 44.8715C33.2312 41.7069 36.1982 38.7139 38.2641 35.8905L36.65 34.7095C34.7159 37.3528 31.8829 40.2264 28.1209 43.3285L29.3932 44.8715ZM38.2641 35.8905C40.3787 33.0005 41.457 29.8631 41.457 26.5H39.457C39.457 29.4035 38.5354 32.1328 36.65 34.7095L38.2641 35.8905ZM41.457 26.5C41.457 23.94 40.8507 21.7257 39.5731 19.922L37.941 21.078C38.93 22.4743 39.457 24.26 39.457 26.5H41.457ZM39.584 19.9377C38.3484 18.1207 36.7376 16.7637 34.7632 15.8862L33.9509 17.7138C35.5765 18.4363 36.899 19.546 37.9301 21.0623L39.584 19.9377ZM34.8042 15.9056C32.9324 14.9696 30.946 14.5 28.857 14.5V16.5C30.6347 16.5 32.315 16.897 33.9098 17.6944L34.8042 15.9056ZM28.857 14.5C26.4031 14.5 24.2626 14.9556 22.4808 15.9207L23.4333 17.6793C24.8515 16.9111 26.6443 16.5 28.857 16.5V14.5ZM22.465 15.9294C20.8017 16.8695 19.4494 18.1087 18.425 19.6453L20.0891 20.7547C20.9313 19.4913 22.0457 18.4638 23.4491 17.6706L22.465 15.9294ZM18.4186 19.655C17.4981 21.0712 16.8208 22.5658 16.3923 24.1369L18.3218 24.6631C18.6933 23.3009 19.2826 21.9955 20.0955 20.745L18.4186 19.655ZM16.3923 24.1369C15.9779 25.6562 15.757 27.0156 15.757 28.2H17.757C17.757 27.251 17.9361 26.0772 18.3218 24.6631L16.3923 24.1369ZM16.757 27.2H1.95703V29.2H16.757V27.2ZM2.95703 28.2C2.95703 25.5286 3.46564 22.742 4.49925 19.835L2.61482 19.165C1.51509 22.258 0.957032 25.2714 0.957032 28.2H2.95703ZM4.50153 19.8285C5.52588 16.8835 7.09584 14.1568 9.22042 11.6459L7.69365 10.3541C5.41823 13.0432 3.72152 15.9832 2.61253 19.1715L4.50153 19.8285ZM9.22841 11.6364C11.3263 9.09346 14.0394 7.01227 17.3903 5.40125L16.5237 3.59875C12.9413 5.32105 9.98775 7.5732 7.68566 10.3636L9.22841 11.6364ZM17.3903 5.40125C20.6925 3.81365 24.6708 2.99999 29.357 2.99999V0.999994C24.4433 0.999994 20.1549 1.85301 16.5237 3.59875L17.3903 5.40125ZM29.357 2.99999C34.0876 2.99999 38.3701 3.93866 42.2219 5.80035L43.0922 3.99965C38.944 1.99466 34.3598 0.999994 29.357 0.999994V2.99999ZM42.2341 5.80618C46.0765 7.59929 49.1346 10.1828 51.4298 13.5619L53.0843 12.4381C50.5795 8.75053 47.2375 5.93404 43.0799 3.99382L42.2341 5.80618ZM51.4371 13.5724C53.7734 16.919 54.957 20.8804 54.957 25.5H56.957C56.957 20.5196 55.674 16.1477 53.077 12.4276L51.4371 13.5724ZM54.957 25.5C54.957 29.8576 53.8702 33.8102 51.7022 37.381L53.4118 38.419C55.7772 34.5231 56.957 30.2091 56.957 25.5H54.957ZM51.6995 37.3855C49.5635 40.9456 46.5364 44.469 42.595 47.9505L43.9191 49.4495C47.9777 45.8644 51.1506 42.1877 53.4145 38.4145L51.6995 37.3855ZM42.6021 47.9443C38.6174 51.3977 34.0308 55.1536 28.841 59.2123L30.0731 60.7877C35.2832 56.7131 39.8966 52.9356 43.912 49.4557L42.6021 47.9443ZM28.8168 59.2318L24.6168 62.7318L25.8972 64.2682L30.0972 60.7682L28.8168 59.2318ZM25.257 64.5H56.957V62.5H25.257V64.5ZM55.957 63.5V77H57.957V63.5H55.957ZM56.957 76H2.25703V78H56.957V76ZM84.1633 75.6L84.5758 74.689L84.5758 74.689L84.1633 75.6ZM75.4633 69.5L74.717 70.1656L74.7219 70.1712L74.727 70.1766L75.4633 69.5ZM70.5633 61.8L69.6242 62.1436L69.6293 62.1576L69.6348 62.1714L70.5633 61.8ZM69.0633 54.3V53.3H68.0633V54.3H69.0633ZM83.3633 54.3L84.3481 54.1262L84.2023 53.3H83.3633V54.3ZM83.6633 56L82.6785 56.1738L82.6834 56.2016L82.6899 56.229L83.6633 56ZM85.3633 59.9L84.5024 60.4087L85.3633 59.9ZM89.3633 63.8L88.8305 64.6462L88.8305 64.6462L89.3633 63.8ZM104.263 63.6L104.798 64.4448L104.808 64.4385L104.818 64.432L104.263 63.6ZM108.763 58.6L107.869 58.1528L107.869 58.1528L108.763 58.6ZM108.763 45.9L107.863 46.3356L107.869 46.3472L108.763 45.9ZM104.263 40.9L103.696 41.7232L103.712 41.7343L103.728 41.7448L104.263 40.9ZM91.3633 40L91.7771 40.9104L91.7939 40.9027L91.8105 40.8944L91.3633 40ZM87.8633 42.4L88.5704 43.1071L88.5835 43.094L88.5961 43.0804L87.8633 42.4ZM85.9633 44.8L85.0854 44.3211L85.0768 44.3368L85.0689 44.3528L85.9633 44.8ZM85.4633 45.8V46.8H86.0813L86.3577 46.2472L85.4633 45.8ZM70.2633 45.8L69.2746 45.6499L69.0999 46.8H70.2633V45.8ZM76.7633 3V2H75.9037L75.7746 2.84985L76.7633 3ZM120.363 3H121.363V2H120.363V3ZM120.363 16.4V17.4H121.363V16.4H120.363ZM87.2633 16.4V15.4H86.4054L86.2749 16.2479L87.2633 16.4ZM84.6633 33.3L83.6749 33.1479L83.4977 34.3H84.6633V33.3ZM85.0633 33.3V34.3H85.4775L85.7704 34.0071L85.0633 33.3ZM87.0633 31.3L86.3793 30.5705L86.3676 30.5815L86.3562 30.5929L87.0633 31.3ZM91.8633 28.5L92.2397 29.4265L92.2519 29.4215L92.2641 29.4162L91.8633 28.5ZM113.963 30.7L114.504 29.8588L114.504 29.8588L113.963 30.7ZM122.363 40L121.466 40.4409L121.47 40.4504L121.475 40.4599L122.363 40ZM123.463 61.4L122.532 61.0356L122.529 61.0444L122.525 61.0534L123.463 61.4ZM118.263 69.8L118.99 70.4873L118.999 70.4775L118.263 69.8ZM109.463 75.8L109.847 76.7236L109.854 76.7205L109.861 76.7173L109.463 75.8ZM96.9633 77C92.066 77 87.9478 76.216 84.5758 74.689L83.7508 76.511C87.4454 78.184 91.8605 79 96.9633 79V77ZM84.5758 74.689C81.1459 73.1359 78.362 71.1765 76.1996 68.8234L74.727 70.1766C77.0979 72.7568 80.114 74.8641 83.7508 76.511L84.5758 74.689ZM76.2096 68.8344C74.0755 66.4416 72.5093 63.9724 71.4918 61.4286L69.6348 62.1714C70.7506 64.9609 72.4511 67.6251 74.717 70.1656L76.2096 68.8344ZM71.5024 61.4564C70.5318 58.8034 70.0633 56.4215 70.0633 54.3H68.0633C68.0633 56.7119 68.5948 59.3299 69.6242 62.1436L71.5024 61.4564ZM69.0633 55.3H83.3633V53.3H69.0633V55.3ZM83.3633 54.3C82.3785 54.4738 82.3785 54.4738 82.3785 54.4738C82.3785 54.4738 82.3785 54.4738 82.3785 54.4738C82.3785 54.4738 82.3785 54.4738 82.3785 54.4738C82.3785 54.4739 82.3785 54.4739 82.3785 54.4739C82.3785 54.4739 82.3785 54.4739 82.3785 54.4739C82.3785 54.474 82.3785 54.474 82.3785 54.474C82.3785 54.474 82.3785 54.4741 82.3786 54.4741C82.3786 54.4741 82.3786 54.4742 82.3786 54.4742C82.3786 54.4742 82.3786 54.4743 82.3786 54.4743C82.3786 54.4743 82.3786 54.4744 82.3786 54.4744C82.3786 54.4745 82.3786 54.4746 82.3787 54.4747C82.3787 54.4748 82.3788 54.4752 82.3788 54.4754C82.379 54.4768 82.3789 54.4759 82.3792 54.4775C82.3793 54.4784 82.3792 54.4779 82.3794 54.4789C82.3795 54.4794 82.3794 54.4791 82.3795 54.4796C82.3796 54.4803 82.3796 54.4798 82.3797 54.4804C82.3801 54.4826 82.3805 54.4854 82.3811 54.4887C82.3813 54.4895 82.3829 54.4984 82.3832 54.5003C82.3833 54.5011 82.3834 54.5013 82.3835 54.502C82.3835 54.5023 82.3836 54.5026 82.3836 54.5029C82.3837 54.5032 82.3837 54.5035 82.3838 54.5038C82.3838 54.5041 82.3839 54.5044 82.3839 54.5047C82.384 54.505 82.3841 54.5053 82.3841 54.5056C82.3844 54.507 82.3842 54.5059 82.3844 54.5074C82.3844 54.5075 82.3847 54.5092 82.3848 54.5093C82.3848 54.5096 82.3849 54.5099 82.3849 54.5103C82.385 54.5106 82.3851 54.5109 82.3851 54.5112C82.3855 54.5134 82.3851 54.5111 82.3855 54.5132C82.3856 54.514 82.3857 54.5145 82.3858 54.5153C82.386 54.5165 82.3864 54.5183 82.3866 54.5195C82.3874 54.524 82.3866 54.5194 82.3874 54.524C82.3874 54.5244 82.3875 54.5248 82.3876 54.5252C82.3876 54.5255 82.3877 54.5259 82.3878 54.5263C82.388 54.5278 82.3879 54.5272 82.3882 54.5287C82.3887 54.5319 82.3885 54.5303 82.389 54.5335C82.3923 54.5519 82.3932 54.5573 82.3972 54.58C82.408 54.6408 82.4068 54.6344 82.4207 54.7128C82.423 54.7261 82.4328 54.7815 82.4359 54.7992C82.4414 54.8302 82.4388 54.8152 82.4444 54.8473C82.4509 54.8842 82.4468 54.8608 82.4535 54.8988C82.4642 54.9595 82.4619 54.9465 82.4734 55.0117C82.4883 55.0958 82.4801 55.0493 82.4957 55.1378C82.5113 55.2263 82.5285 55.3239 82.5472 55.43C82.5639 55.5242 82.5591 55.4975 82.5765 55.596C82.5807 55.6195 82.6033 55.7475 82.6082 55.7753C82.616 55.8196 82.6336 55.9192 82.6422 55.9679C82.6472 55.9966 82.6459 55.9892 82.651 56.0181C82.6555 56.0435 82.651 56.0182 82.6555 56.0436C82.6562 56.0472 82.6571 56.0527 82.6578 56.0564C82.6582 56.0585 82.6585 56.0606 82.6589 56.0628C82.6593 56.0649 82.6597 56.067 82.66 56.0692C82.6622 56.0814 82.667 56.1085 82.6692 56.1211C82.6758 56.1588 82.6718 56.1358 82.6785 56.1738L84.6481 55.8262C84.6357 55.7559 84.6418 55.7908 84.6296 55.7216C84.6287 55.7167 84.6124 55.6241 84.6117 55.6204C84.6115 55.6191 84.6076 55.5967 84.6074 55.5956C84.6038 55.5756 84.6065 55.5908 84.603 55.571C84.6016 55.5628 84.6023 55.5669 84.6009 55.5587C84.6008 55.5582 84.5988 55.5471 84.5987 55.5466C84.5957 55.5293 84.5975 55.5396 84.5945 55.5224C84.5832 55.4588 84.5888 55.4903 84.5778 55.4278C84.5774 55.4258 84.5771 55.4239 84.5767 55.422C84.5764 55.42 84.576 55.4181 84.5757 55.4162C84.5754 55.4143 84.575 55.4123 84.5747 55.4104C84.5743 55.4085 84.574 55.4066 84.5737 55.4046C84.5733 55.4027 84.573 55.4008 84.5727 55.3989C84.5723 55.397 84.572 55.3951 84.5716 55.3931C84.5713 55.3912 84.571 55.3893 84.5706 55.3874C84.5703 55.3855 84.57 55.3836 84.5696 55.3817C84.5685 55.3752 84.5688 55.3768 84.5676 55.3703C84.5674 55.3692 84.5658 55.3601 84.5656 55.359C84.5639 55.3493 84.5633 55.3461 84.5616 55.3365C84.544 55.2367 84.5635 55.3471 84.5461 55.2485C84.5361 55.1915 84.541 55.2197 84.5312 55.1638C84.5298 55.1559 84.518 55.0893 84.5168 55.0825C84.5108 55.0486 84.5088 55.0372 84.503 55.0044C84.5008 54.9917 84.5019 54.9981 84.4997 54.9854C84.4995 54.9846 84.4965 54.9675 84.4964 54.9667C84.4936 54.9507 84.4926 54.9454 84.4899 54.9297C84.4888 54.9237 84.4893 54.9267 84.4883 54.9206C84.4882 54.9202 84.4867 54.912 84.4867 54.9116C84.4848 54.9013 84.4853 54.9038 84.4835 54.8936C84.4832 54.8921 84.483 54.8906 84.4827 54.8892C84.4824 54.8877 84.4822 54.8862 84.4819 54.8847C84.4806 54.8771 84.4817 54.8834 84.4804 54.8759C84.4783 54.8641 84.4793 54.87 84.4773 54.8583C84.4772 54.8581 84.4712 54.8239 84.4712 54.8239C84.4703 54.819 84.469 54.8118 84.4682 54.807C84.4679 54.8053 84.4655 54.7919 84.4653 54.7903C84.4627 54.776 84.4619 54.7714 84.4595 54.7575C84.4593 54.7567 84.4568 54.7422 84.4566 54.7414C84.4548 54.7308 84.4557 54.7361 84.4538 54.7255C84.4491 54.6985 84.4476 54.69 84.443 54.6641C84.4428 54.6629 84.4425 54.6616 84.4423 54.6604C84.4421 54.6591 84.4419 54.6579 84.4417 54.6567C84.4408 54.6517 84.4412 54.6542 84.4404 54.6493C84.4386 54.6395 84.4395 54.6444 84.4378 54.6346C84.4344 54.6154 84.4361 54.625 84.4327 54.606C84.4262 54.5689 84.4294 54.5872 84.4231 54.5512C84.3886 54.3557 84.3888 54.3571 84.3668 54.2325C84.3588 54.1869 84.3577 54.1806 84.3528 54.1528C84.35 54.1372 84.3512 54.144 84.3492 54.1329C84.3491 54.1321 84.3488 54.1305 84.3487 54.1299C84.3486 54.129 84.3487 54.1297 84.3485 54.1288C84.3485 54.1287 84.3485 54.1286 84.3485 54.1286C84.3485 54.1285 84.3485 54.1284 84.3484 54.1283C84.3484 54.1282 84.3484 54.1282 84.3484 54.1281C84.3484 54.128 84.3484 54.1279 84.3484 54.1279C84.3483 54.1274 84.3482 54.1269 84.3481 54.1266C84.3481 54.1265 84.3481 54.1264 84.3481 54.1263C84.3481 54.1262 84.3481 54.1263 84.3481 54.1262C84.3481 54.1262 84.3481 54.1262 84.3481 54.1262C84.3481 54.1262 84.3481 54.1262 83.3633 54.3ZM82.6899 56.229C82.9877 57.4948 83.6058 58.8915 84.5024 60.4087L86.2242 59.3913C85.3874 57.9752 84.8722 56.7718 84.6367 55.771L82.6899 56.229ZM84.5024 60.4087C85.4676 62.0423 86.9286 63.4488 88.8305 64.6462L89.8961 62.9538C88.198 61.8846 86.9923 60.6911 86.2242 59.3913L84.5024 60.4087ZM88.8305 64.6462C90.8457 65.9151 93.487 66.5 96.6633 66.5V64.5C93.7063 64.5 91.4808 63.9516 89.8961 62.9538L88.8305 64.6462ZM96.6633 66.5C99.8643 66.5 102.597 65.8388 104.798 64.4448L103.728 62.7552C101.929 63.8946 99.5956 64.5 96.6633 64.5V66.5ZM104.818 64.432C106.952 63.0097 108.574 61.2145 109.658 59.0472L107.869 58.1528C106.952 59.9855 105.575 61.5237 103.709 62.7679L104.818 64.432ZM109.658 59.0472C110.726 56.9107 111.263 54.6579 111.263 52.3H109.263C109.263 54.3421 108.801 56.2893 107.869 58.1528L109.658 59.0472ZM111.263 52.3C111.263 49.8803 110.728 47.5936 109.658 45.4528L107.869 46.3472C108.798 48.2064 109.263 50.1864 109.263 52.3H111.263ZM109.663 45.4644C108.58 43.2246 106.951 41.4183 104.798 40.0552L103.728 41.7448C105.576 42.915 106.947 44.4421 107.863 46.3356L109.663 45.4644ZM104.831 40.0768C102.693 38.6025 100.049 37.9 96.9633 37.9V39.9C99.7446 39.9 101.967 40.5308 103.696 41.7232L104.831 40.0768ZM96.9633 37.9C94.5974 37.9 92.5643 38.2815 90.9161 39.1056L91.8105 40.8944C93.0956 40.2519 94.7958 39.9 96.9633 39.9V37.9ZM90.9495 39.0896C89.393 39.7971 88.1076 40.6672 87.1305 41.7195L88.5961 43.0804C89.3522 42.2661 90.4002 41.5362 91.7771 40.9104L90.9495 39.0896ZM87.1562 41.6929C86.2504 42.5987 85.547 43.4748 85.0854 44.3211L86.8412 45.2789C87.1795 44.6586 87.7428 43.9347 88.5704 43.1071L87.1562 41.6929ZM85.0689 44.3528C84.9751 44.5403 84.923 44.6445 84.8501 44.7903C84.8346 44.8212 84.8597 44.771 84.8443 44.8019C84.8438 44.8029 84.8433 44.8039 84.8428 44.8048C84.8423 44.8058 84.8419 44.8068 84.8414 44.8077C84.8409 44.8087 84.8404 44.8096 84.8399 44.8106C84.8395 44.8116 84.839 44.8125 84.8385 44.8135C84.8309 44.8287 84.8347 44.8211 84.8272 44.8362C84.8267 44.8371 84.8262 44.8381 84.8258 44.839C84.8253 44.8399 84.8248 44.8409 84.8244 44.8418C84.8239 44.8427 84.8234 44.8436 84.823 44.8446C84.8225 44.8455 84.822 44.8464 84.8216 44.8474C84.8211 44.8483 84.8206 44.8492 84.8202 44.8501C84.8197 44.8511 84.8193 44.852 84.8188 44.8529C84.8183 44.8538 84.8179 44.8547 84.8174 44.8557C84.817 44.8566 84.8165 44.8575 84.816 44.8584C84.8156 44.8593 84.8151 44.8602 84.8147 44.8611C84.8142 44.8621 84.8138 44.863 84.8133 44.8639C84.8129 44.8648 84.8124 44.8657 84.8119 44.8666C84.8115 44.8675 84.811 44.8684 84.8106 44.8693C84.8101 44.8702 84.8097 44.8711 84.8092 44.872C84.8088 44.8729 84.8083 44.8738 84.8079 44.8747C84.8074 44.8756 84.807 44.8765 84.8065 44.8774C84.8061 44.8783 84.8056 44.8792 84.8052 44.8801C84.7981 44.8944 84.8016 44.8873 84.7946 44.9014C84.7941 44.9022 84.7937 44.9031 84.7933 44.904C84.7928 44.9049 84.7924 44.9057 84.7919 44.9066C84.7915 44.9075 84.7911 44.9083 84.7906 44.9092C84.7902 44.9101 84.7898 44.9109 84.7893 44.9118C84.7876 44.9153 84.7885 44.9135 84.7868 44.917C84.7863 44.9178 84.7859 44.9187 84.7855 44.9196C84.785 44.9204 84.7846 44.9213 84.7842 44.9221C84.7838 44.923 84.7833 44.9238 84.7829 44.9247C84.7825 44.9255 84.7821 44.9264 84.7816 44.9272C84.7812 44.9281 84.7808 44.9289 84.7804 44.9298C84.7799 44.9306 84.7795 44.9315 84.7791 44.9323C84.7787 44.9332 84.7782 44.934 84.7778 44.9348C84.7774 44.9357 84.777 44.9365 84.7766 44.9374C84.7761 44.9382 84.7757 44.939 84.7753 44.9399C84.7749 44.9407 84.7745 44.9416 84.7741 44.9424C84.7736 44.9432 84.7732 44.9441 84.7728 44.9449C84.7724 44.9457 84.772 44.9465 84.7716 44.9474C84.7711 44.9482 84.7707 44.949 84.7703 44.9499C84.7699 44.9507 84.7695 44.9515 84.7691 44.9523C84.7625 44.9654 84.7732 44.9442 84.7666 44.9573C84.7662 44.9581 84.7658 44.9589 84.7654 44.9597C84.765 44.9605 84.7646 44.9613 84.7642 44.9622C84.7609 44.9687 84.7625 44.9654 84.7593 44.9719C84.7465 44.9976 84.7674 44.9558 84.7545 44.9814C84.7541 44.9822 84.7537 44.983 84.7533 44.9838C84.7529 44.9846 84.7525 44.9854 84.7522 44.9862C84.7506 44.9893 84.7514 44.9878 84.7498 44.9909C84.7494 44.9917 84.749 44.9925 84.7486 44.9933C84.7482 44.994 84.7478 44.9948 84.7475 44.9956C84.7471 44.9964 84.7467 44.9971 84.7463 44.9979C84.7459 44.9987 84.7455 44.9995 84.7451 45.0002C84.7447 45.001 84.7444 45.0018 84.744 45.0026C84.7436 45.0033 84.7432 45.0041 84.7428 45.0049C84.7397 45.011 84.7436 45.0033 84.7405 45.0095C84.7401 45.0102 84.7398 45.011 84.7394 45.0117C84.739 45.0125 84.7386 45.0133 84.7382 45.014C84.7367 45.0171 84.7375 45.0155 84.736 45.0186C84.7119 45.0667 84.7511 44.9884 84.7271 45.0364C84.7046 45.0813 84.7321 45.0263 84.71 45.0706C84.6991 45.0924 84.7044 45.0816 84.6939 45.1028C84.6913 45.108 84.6887 45.1131 84.6862 45.1182C84.6761 45.1384 84.6887 45.113 84.6787 45.1331C84.6763 45.1379 84.6793 45.1319 84.6769 45.1367C84.6757 45.1391 84.6763 45.1379 84.6751 45.1403C84.6679 45.1547 84.6805 45.1295 84.6733 45.1439C84.673 45.1445 84.6727 45.1451 84.6724 45.1457C84.6721 45.1463 84.6718 45.1469 84.6715 45.1475C84.6692 45.1522 84.6668 45.1568 84.6646 45.1614C84.66 45.1705 84.6556 45.1793 84.6514 45.1877C84.6493 45.192 84.6472 45.1961 84.6451 45.2002C84.637 45.2165 84.6472 45.196 84.6392 45.2122C84.6245 45.2415 84.6423 45.206 84.6279 45.2346C84.6209 45.2486 84.6243 45.2418 84.6177 45.2551C84.6112 45.2682 84.6053 45.2799 84.6001 45.2903C84.5827 45.325 84.5888 45.3129 84.5767 45.3372C84.5741 45.3424 84.5721 45.3463 84.5708 45.3489C84.5697 45.3511 84.5701 45.3503 84.5693 45.3518C84.5693 45.3519 84.5693 45.3519 84.5693 45.3519C84.5693 45.352 84.5692 45.352 84.5692 45.352C84.5692 45.3521 84.5692 45.3521 84.5692 45.3521C84.5692 45.3522 84.5691 45.3522 84.5691 45.3522C84.5688 45.3529 84.5693 45.3518 84.569 45.3524C84.569 45.3525 84.569 45.3525 84.569 45.3525C84.569 45.3526 84.569 45.3526 84.5689 45.3526C84.5689 45.3526 84.5689 45.3526 84.5689 45.3526C84.5689 45.3527 84.5689 45.3527 84.5689 45.3527C84.5689 45.3527 84.5689 45.3527 84.5689 45.3527C84.5689 45.3528 84.5689 45.3527 84.5689 45.3528C84.5689 45.3528 84.5689 45.3528 84.5689 45.3528C84.5689 45.3528 84.5689 45.3528 85.4633 45.8C86.3577 46.2472 86.3577 46.2472 86.3577 46.2472C86.3577 46.2472 86.3577 46.2472 86.3577 46.2472C86.3577 46.2472 86.3577 46.2472 86.3577 46.2472C86.3577 46.2472 86.3577 46.2472 86.3577 46.2472C86.3578 46.2471 86.3578 46.247 86.3578 46.247C86.3582 46.2463 86.3576 46.2474 86.358 46.2467C86.3583 46.2461 86.3578 46.247 86.3581 46.2465C86.3581 46.2464 86.3582 46.2463 86.3582 46.2462C86.3589 46.2449 86.3581 46.2465 86.3588 46.245C86.36 46.2426 86.3584 46.2459 86.3597 46.2433C86.3597 46.2433 86.3618 46.2391 86.3621 46.2384C86.3631 46.2363 86.3618 46.239 86.3629 46.2369C86.3629 46.2368 86.363 46.2366 86.3631 46.2365C86.3631 46.2364 86.3632 46.2362 86.3633 46.2361C86.3644 46.2338 86.3626 46.2375 86.3637 46.2352C86.3637 46.2352 86.3646 46.2335 86.3646 46.2335C86.3647 46.2333 86.3647 46.2332 86.3648 46.233C86.3649 46.2329 86.365 46.2327 86.365 46.2325C86.3651 46.2324 86.3652 46.2322 86.3653 46.2321C86.3654 46.2319 86.3654 46.2317 86.3655 46.2316C86.3707 46.2212 86.3623 46.238 86.3676 46.2274C86.3698 46.2229 86.3659 46.2308 86.3682 46.2263C86.3683 46.2259 86.3685 46.2256 86.3687 46.2252C86.3688 46.225 86.3689 46.2248 86.369 46.2246C86.3691 46.2244 86.3692 46.2242 86.3693 46.224C86.3701 46.2224 86.3691 46.2244 86.3699 46.2228C86.3715 46.2195 86.3695 46.2236 86.3712 46.2203C86.3713 46.2201 86.3714 46.2199 86.3715 46.2197C86.3716 46.2194 86.3717 46.2192 86.3718 46.219C86.372 46.2186 86.3723 46.2181 86.3725 46.2177C86.3726 46.2174 86.3727 46.2172 86.3728 46.217C86.3729 46.2168 86.373 46.2165 86.3732 46.2163C86.376 46.2107 86.371 46.2205 86.3739 46.2149C86.3776 46.2074 86.3715 46.2196 86.3753 46.2121C86.3837 46.1953 86.3699 46.2229 86.3783 46.206C86.3805 46.2017 86.3778 46.207 86.38 46.2027C86.3845 46.1936 86.3771 46.2085 86.3816 46.1994C86.3816 46.1994 86.3825 46.1976 86.3825 46.1976C86.3826 46.1973 86.3828 46.1971 86.3829 46.1968C86.3831 46.1965 86.3832 46.1962 86.3834 46.1959C86.3835 46.1956 86.3837 46.1953 86.3838 46.195C86.384 46.1947 86.3841 46.1944 86.3843 46.1941C86.3855 46.1917 86.384 46.1947 86.3852 46.1923C86.3877 46.1873 86.3836 46.1954 86.3861 46.1904C86.3863 46.1901 86.3864 46.1898 86.3866 46.1895C86.3867 46.1892 86.3869 46.1889 86.387 46.1886C86.3872 46.1882 86.3874 46.1879 86.3875 46.1876C86.3877 46.1873 86.3878 46.187 86.388 46.1866C86.3882 46.1863 86.3883 46.186 86.3885 46.1857C86.3886 46.1854 86.3888 46.185 86.389 46.1847C86.4098 46.143 86.441 46.0805 86.4827 45.9972C86.4931 45.9764 86.4801 46.0023 86.4906 45.9813C86.491 45.9807 86.4913 45.98 86.4917 45.9793C86.492 45.9787 86.4923 45.978 86.4927 45.9773C86.493 45.9766 86.4933 45.9759 86.4937 45.9753C86.494 45.9746 86.4944 45.9739 86.4947 45.9732C86.5002 45.9623 86.4913 45.98 86.4968 45.9691C86.4971 45.9684 86.4974 45.9677 86.4978 45.9671C86.4981 45.9664 86.4985 45.9657 86.4988 45.965C86.5016 45.9595 86.5044 45.9538 86.5072 45.9481C86.5414 45.8798 86.4817 45.9993 86.5159 45.9308C86.5403 45.882 86.5092 45.9441 86.534 45.8947C86.534 45.8947 86.5433 45.876 86.5434 45.8759C86.5693 45.824 86.527 45.9087 86.553 45.8566C86.566 45.8305 86.5797 45.8032 86.594 45.7746C86.5945 45.7737 86.5949 45.7728 86.5954 45.7719C86.5958 45.771 86.5963 45.7701 86.5967 45.7692C86.604 45.7547 86.5922 45.7782 86.5994 45.7638C86.6067 45.7493 86.5976 45.7674 86.6049 45.7528C86.6123 45.7381 86.6003 45.762 86.6077 45.7473C86.6086 45.7455 86.6095 45.7436 86.6104 45.7418C86.6109 45.7409 86.6114 45.7399 86.6118 45.739C86.6123 45.7381 86.6127 45.7371 86.6132 45.7362C86.6137 45.7353 86.6141 45.7343 86.6146 45.7334C86.6151 45.7325 86.6155 45.7315 86.616 45.7306C86.616 45.7306 86.6386 45.6854 86.639 45.6847C86.6548 45.653 86.6349 45.6929 86.6508 45.661C86.6668 45.6291 86.6408 45.6809 86.6568 45.649C86.669 45.6247 86.6477 45.6672 86.6598 45.6429C86.6603 45.6419 86.6609 45.6409 86.6614 45.6399C86.6619 45.6389 86.6624 45.6379 86.6629 45.6369C86.6792 45.6043 86.6589 45.6449 86.6752 45.6122C86.6794 45.6039 86.6742 45.6143 86.6783 45.606C86.6789 45.6049 86.6794 45.6039 86.6799 45.6028C86.6804 45.6018 86.6809 45.6007 86.6815 45.5997C86.6836 45.5955 86.6857 45.5913 86.6878 45.5871C86.7047 45.5532 86.7223 45.518 86.7405 45.4816C86.777 45.4087 86.816 45.3305 86.8577 45.2472L85.0689 44.3528ZM85.4633 44.8H70.2633V46.8H85.4633V44.8ZM71.2519 45.9501L77.7519 3.15015L75.7746 2.84985L69.2746 45.6499L71.2519 45.9501ZM76.7633 4H120.363V2H76.7633V4ZM119.363 3V16.4H121.363V3H119.363ZM120.363 15.4H87.2633V17.4H120.363V15.4ZM86.2749 16.2479L83.6749 33.1479L85.6517 33.4521L88.2517 16.5521L86.2749 16.2479ZM84.6633 34.3H85.0633V32.3H84.6633V34.3ZM85.7704 34.0071C86.1037 33.6738 86.7704 33.0071 87.7704 32.0071L86.3562 30.5929C85.3562 31.5929 84.6895 32.2596 84.3562 32.5929L85.7704 34.0071ZM87.7472 32.0295C88.6879 31.1476 90.1622 30.2704 92.2397 29.4265L91.4869 27.5735C89.2977 28.4629 87.572 29.4524 86.3793 30.5705L87.7472 32.0295ZM92.2641 29.4162C94.2229 28.5592 96.9034 28.1 100.363 28.1V26.1C96.7565 26.1 93.7703 26.5742 91.4625 27.5838L92.2641 29.4162ZM100.363 28.1C105.544 28.1 109.88 29.2642 113.423 31.5412L114.504 29.8588C110.579 27.3358 105.849 26.1 100.363 26.1V28.1ZM113.423 31.5412C117.01 33.8477 119.683 36.8124 121.466 40.4409L123.261 39.5591C121.31 35.5876 118.383 32.3523 114.504 29.8588L113.423 31.5412ZM121.475 40.4599C123.335 44.0512 124.263 47.8602 124.263 51.9H126.263C126.263 47.5398 125.258 43.4154 123.251 39.5401L121.475 40.4599ZM124.263 51.9C124.263 55.0409 123.687 58.0841 122.532 61.0356L124.395 61.7644C125.64 58.5826 126.263 55.2924 126.263 51.9H124.263ZM122.525 61.0534C121.44 63.9911 119.777 66.68 117.528 69.1225L118.999 70.4775C121.416 67.8533 123.22 64.9422 124.401 61.7466L122.525 61.0534ZM117.537 69.1128C115.308 71.469 112.491 73.3959 109.065 74.8827L109.861 76.7173C113.502 75.1375 116.552 73.0643 118.99 70.4872L117.537 69.1128ZM109.08 74.8764C105.695 76.2816 101.664 77 96.9633 77V79C101.863 79 106.165 78.2518 109.847 76.7236L109.08 74.8764ZM142.627 51.8H141.627V52.8H142.627V51.8ZM142.627 39.8V38.8H141.627V39.8H142.627ZM157.627 39.8V40.8H158.627V39.8H157.627ZM157.627 24.8V23.8H156.627V24.8H157.627ZM169.627 24.8H170.627V23.8H169.627V24.8ZM169.627 39.8H168.627V40.8H169.627V39.8ZM184.627 39.8H185.627V38.8H184.627V39.8ZM184.627 51.8V52.8H185.627V51.8H184.627ZM169.627 51.8V50.8H168.627V51.8H169.627ZM169.627 66.8V67.8H170.627V66.8H169.627ZM157.627 66.8H156.627V67.8H157.627V66.8ZM157.627 51.8H158.627V50.8H157.627V51.8ZM143.627 51.8V39.8H141.627V51.8H143.627ZM142.627 40.8H157.627V38.8H142.627V40.8ZM158.627 39.8V24.8H156.627V39.8H158.627ZM157.627 25.8H169.627V23.8H157.627V25.8ZM168.627 24.8V39.8H170.627V24.8H168.627ZM169.627 40.8H184.627V38.8H169.627V40.8ZM183.627 39.8V51.8H185.627V39.8H183.627ZM184.627 50.8H169.627V52.8H184.627V50.8ZM168.627 51.8V66.8H170.627V51.8H168.627ZM169.627 65.8H157.627V67.8H169.627V65.8ZM158.627 66.8V51.8H156.627V66.8H158.627ZM157.627 50.8H142.627V52.8H157.627V50.8Z" fill="#E38E73"/>
<path d="M24.2876 114.181V107.291L32.6076 100.206C36.0742 97.3031 39.0426 94.8331 41.5126 92.7964C43.9826 90.7597 45.8676 88.8531 47.1676 87.0764C48.4676 85.2997 49.1176 83.3931 49.1176 81.3564C49.1176 79.7964 48.7492 78.4964 48.0126 77.4564C47.2759 76.3731 46.3226 75.5714 45.1526 75.0514C44.0259 74.4881 42.8342 74.2064 41.5776 74.2064C40.0609 74.2064 38.7826 74.4881 37.7426 75.0514C36.7459 75.6147 35.9442 76.3514 35.3376 77.2614C34.7742 78.1281 34.3626 79.0381 34.1026 79.9914C33.8426 80.9447 33.7126 81.7681 33.7126 82.4614H24.0926C24.0926 80.6414 24.4392 78.7564 25.1326 76.8064C25.8259 74.8131 26.8876 72.9714 28.3176 71.2814C29.7476 69.5481 31.5892 68.1397 33.8426 67.0564C36.0959 65.9731 38.7826 65.4314 41.9026 65.4314C45.0659 65.4314 47.9476 66.0597 50.5476 67.3164C53.1476 68.5297 55.2276 70.2847 56.7876 72.5814C58.3909 74.8781 59.1926 77.5864 59.1926 80.7064C59.1926 83.6531 58.4559 86.3397 56.9826 88.7664C55.5526 91.1497 53.5376 93.4897 50.9376 95.7864C48.3376 98.0397 45.3476 100.488 41.9676 103.131L39.2376 105.406H59.8426V114.181H24.2876ZM85.8466 114.831C82.5966 114.831 79.8233 114.311 77.5266 113.271C75.23 112.231 73.345 110.91 71.8716 109.306C70.4416 107.703 69.38 106.035 68.6866 104.301C68.0366 102.525 67.7116 100.9 67.7116 99.4264H77.0066C77.0066 99.4264 77.0716 99.7947 77.2016 100.531C77.375 101.268 77.7433 102.113 78.3066 103.066C78.87 104.02 79.7366 104.865 80.9066 105.601C82.0766 106.338 83.6583 106.706 85.6516 106.706C87.645 106.706 89.2916 106.295 90.5916 105.471C91.8916 104.605 92.8666 103.521 93.5166 102.221C94.1666 100.921 94.4916 99.5564 94.4916 98.1264C94.4916 96.6531 94.1666 95.2664 93.5166 93.9664C92.8666 92.6231 91.8916 91.5397 90.5916 90.7164C89.335 89.8497 87.7533 89.4164 85.8466 89.4164C84.3733 89.4164 83.16 89.6547 82.2066 90.1314C81.2533 90.5647 80.495 91.0847 79.9316 91.6914C79.3683 92.2547 78.9566 92.7747 78.6966 93.2514C78.48 93.6847 78.3716 93.9014 78.3716 93.9014H68.4916L72.7166 66.0814H101.057V74.7914H79.5416L77.8516 85.7764H78.1116C78.3283 85.5597 78.7616 85.1264 79.4116 84.4764C80.105 83.8264 81.145 83.2197 82.5316 82.6564C83.9183 82.0497 85.76 81.7464 88.0566 81.7464C91.5233 81.7464 94.47 82.5264 96.8966 84.0864C99.3233 85.6464 101.143 87.6614 102.357 90.1314C103.613 92.5581 104.242 95.1364 104.242 97.8664C104.242 99.9897 103.852 102.048 103.072 104.041C102.335 106.035 101.208 107.855 99.6916 109.501C98.175 111.105 96.2683 112.405 93.9716 113.401C91.675 114.355 88.9666 114.831 85.8466 114.831ZM115.528 97.8014V90.0014H125.278V80.2514H133.078V90.0014H142.828V97.8014H133.078V107.551H125.278V97.8014H115.528Z" fill="white"/>
<path d="M39.8703 183V176.675L33.3703 164.5H37.5953L41.7953 172.725L45.9953 164.5H50.2203L43.7203 176.675V183H39.8703ZM52.4647 183V164.5H65.2147V167.85H56.3147V172H64.0647V175.225H56.3147V179.65H65.3397V183H52.4647ZM67.5547 183L73.8547 164.5H78.9797L85.2797 183H81.2297L80.0547 179.375H72.8047L71.6047 183H67.5547ZM73.8797 176.025H78.9797L76.4297 168.3L73.8797 176.025ZM87.7186 183V164.5H95.2186C96.5853 164.5 97.7519 164.742 98.7186 165.225C99.7019 165.708 100.452 166.375 100.969 167.225C101.502 168.075 101.769 169.058 101.769 170.175C101.769 171.392 101.46 172.458 100.844 173.375C100.227 174.275 99.3519 174.933 98.2186 175.35L102.244 183H97.9686L94.2936 175.875H91.5686V183H87.7186ZM95.1686 167.825H91.5686V172.725H95.1686C96.0186 172.725 96.6853 172.492 97.1686 172.025C97.6519 171.558 97.8936 170.983 97.8936 170.3C97.8936 169.6 97.6519 169.017 97.1686 168.55C96.6853 168.067 96.0186 167.825 95.1686 167.825ZM112.026 183.25C110.826 183.25 109.801 183.108 108.951 182.825C108.117 182.525 107.417 182.15 106.851 181.7C106.301 181.233 105.859 180.75 105.526 180.25C105.192 179.733 104.942 179.25 104.776 178.8C104.626 178.333 104.526 177.958 104.476 177.675C104.442 177.375 104.426 177.225 104.426 177.225H108.326C108.326 177.225 108.359 177.367 108.426 177.65C108.509 177.933 108.676 178.267 108.926 178.65C109.176 179.017 109.559 179.342 110.076 179.625C110.592 179.892 111.292 180.025 112.176 180.025C113.259 180.025 114.059 179.8 114.576 179.35C115.092 178.883 115.351 178.333 115.351 177.7C115.351 177.133 115.151 176.683 114.751 176.35C114.367 176.017 113.767 175.767 112.951 175.6L110.476 175.125C109.476 174.942 108.542 174.65 107.676 174.25C106.826 173.85 106.134 173.3 105.601 172.6C105.067 171.883 104.801 170.967 104.801 169.85C104.801 168.717 105.084 167.733 105.651 166.9C106.217 166.05 107.009 165.4 108.026 164.95C109.059 164.483 110.267 164.25 111.651 164.25C112.951 164.25 114.026 164.442 114.876 164.825C115.742 165.192 116.426 165.65 116.926 166.2C117.442 166.733 117.817 167.275 118.051 167.825C118.301 168.375 118.459 168.833 118.526 169.2C118.609 169.567 118.651 169.75 118.651 169.75H114.851C114.851 169.75 114.817 169.633 114.751 169.4C114.701 169.167 114.567 168.9 114.351 168.6C114.134 168.3 113.801 168.033 113.351 167.8C112.917 167.567 112.317 167.45 111.551 167.45C110.501 167.45 109.742 167.683 109.276 168.15C108.809 168.6 108.576 169.092 108.576 169.625C108.576 170.175 108.809 170.6 109.276 170.9C109.742 171.2 110.351 171.425 111.101 171.575L113.726 172.1C114.726 172.283 115.642 172.592 116.476 173.025C117.309 173.458 117.967 174.042 118.451 174.775C118.951 175.492 119.201 176.383 119.201 177.45C119.201 178.55 118.926 179.542 118.376 180.425C117.826 181.292 117.017 181.983 115.951 182.5C114.884 183 113.576 183.25 112.026 183.25Z" fill="white"/>
<path d="M337.366 75.6L337.778 74.689L337.778 74.689L337.366 75.6ZM328.666 69.5L327.919 70.1656L327.924 70.1712L327.929 70.1766L328.666 69.5ZM323.766 61.8L322.827 62.1436L322.832 62.1576L322.837 62.1714L323.766 61.8ZM322.266 54.3V53.3H321.266V54.3H322.266ZM336.566 54.3L337.55 54.1262L337.405 53.3H336.566V54.3ZM336.866 56L335.881 56.1738L335.886 56.2016L335.892 56.229L336.866 56ZM338.566 59.9L337.705 60.4087L338.566 59.9ZM342.566 63.8L342.033 64.6462L342.033 64.6462L342.566 63.8ZM357.466 63.6L358.001 64.4448L358.011 64.4385L358.02 64.432L357.466 63.6ZM361.966 58.6L361.071 58.1528L361.071 58.1528L361.966 58.6ZM361.966 45.9L361.065 46.3356L361.071 46.3472L361.966 45.9ZM357.466 40.9L356.898 41.7232L356.914 41.7343L356.931 41.7448L357.466 40.9ZM344.566 40L344.979 40.9104L344.996 40.9027L345.013 40.8944L344.566 40ZM341.066 42.4L341.773 43.1071L341.786 43.094L341.798 43.0804L341.066 42.4ZM339.166 44.8L338.288 44.3211L338.279 44.3368L338.271 44.3528L339.166 44.8ZM338.666 45.8V46.8H339.284L339.56 46.2472L338.666 45.8ZM323.466 45.8L322.477 45.6499L322.302 46.8H323.466V45.8ZM329.966 3V2H329.106L328.977 2.84985L329.966 3ZM373.566 3H374.566V2H373.566V3ZM373.566 16.4V17.4H374.566V16.4H373.566ZM340.466 16.4V15.4H339.608L339.477 16.2479L340.466 16.4ZM337.866 33.3L336.877 33.1479L336.7 34.3H337.866V33.3ZM338.266 33.3V34.3H338.68L338.973 34.0071L338.266 33.3ZM340.266 31.3L339.582 30.5705L339.57 30.5815L339.559 30.5929L340.266 31.3ZM345.066 28.5L345.442 29.4265L345.454 29.4215L345.466 29.4162L345.066 28.5ZM367.166 30.7L367.706 29.8588L367.706 29.8588L367.166 30.7ZM375.566 40L374.668 40.4409L374.673 40.4504L374.678 40.4599L375.566 40ZM376.666 61.4L375.734 61.0356L375.731 61.0444L375.728 61.0534L376.666 61.4ZM371.466 69.8L372.192 70.4873L372.201 70.4775L371.466 69.8ZM362.666 75.8L363.049 76.7236L363.056 76.7205L363.064 76.7173L362.666 75.8ZM350.166 77C345.268 77 341.15 76.216 337.778 74.689L336.953 76.511C340.648 78.184 345.063 79 350.166 79V77ZM337.778 74.689C334.348 73.1359 331.564 71.1765 329.402 68.8234L327.929 70.1766C330.3 72.7568 333.316 74.8641 336.953 76.511L337.778 74.689ZM329.412 68.8344C327.278 66.4416 325.712 63.9724 324.694 61.4286L322.837 62.1714C323.953 64.9609 325.654 67.6251 327.919 70.1656L329.412 68.8344ZM324.705 61.4564C323.734 58.8034 323.266 56.4215 323.266 54.3H321.266C321.266 56.7119 321.797 59.3299 322.827 62.1436L324.705 61.4564ZM322.266 55.3H336.566V53.3H322.266V55.3ZM336.566 54.3C335.581 54.4738 335.581 54.4738 335.581 54.4738C335.581 54.4738 335.581 54.4738 335.581 54.4738C335.581 54.4738 335.581 54.4738 335.581 54.4738C335.581 54.4739 335.581 54.4739 335.581 54.4739C335.581 54.4739 335.581 54.4739 335.581 54.4739C335.581 54.474 335.581 54.474 335.581 54.474C335.581 54.474 335.581 54.4741 335.581 54.4741C335.581 54.4741 335.581 54.4742 335.581 54.4742C335.581 54.4742 335.581 54.4743 335.581 54.4743C335.581 54.4743 335.581 54.4744 335.581 54.4744C335.581 54.4745 335.581 54.4746 335.581 54.4747C335.581 54.4748 335.581 54.4752 335.581 54.4754C335.581 54.4768 335.581 54.4759 335.582 54.4775C335.582 54.4784 335.582 54.4779 335.582 54.4789C335.582 54.4794 335.582 54.4791 335.582 54.4796C335.582 54.4803 335.582 54.4798 335.582 54.4804C335.582 54.4826 335.583 54.4854 335.584 54.4887C335.584 54.4895 335.585 54.4984 335.586 54.5003C335.586 54.5011 335.586 54.5013 335.586 54.502C335.586 54.5023 335.586 54.5026 335.586 54.5029C335.586 54.5032 335.586 54.5035 335.586 54.5038C335.586 54.5041 335.586 54.5044 335.586 54.5047C335.586 54.505 335.586 54.5053 335.586 54.5056C335.587 54.507 335.587 54.5059 335.587 54.5074C335.587 54.5075 335.587 54.5092 335.587 54.5093C335.587 54.5096 335.587 54.5099 335.587 54.5103C335.587 54.5106 335.587 54.5109 335.588 54.5112C335.588 54.5134 335.587 54.5111 335.588 54.5132C335.588 54.514 335.588 54.5145 335.588 54.5153C335.588 54.5165 335.589 54.5183 335.589 54.5195C335.59 54.524 335.589 54.5194 335.59 54.524C335.59 54.5244 335.59 54.5248 335.59 54.5252C335.59 54.5255 335.59 54.5259 335.59 54.5263C335.59 54.5278 335.59 54.5272 335.591 54.5287C335.591 54.5319 335.591 54.5303 335.591 54.5335C335.595 54.5519 335.596 54.5573 335.6 54.58C335.61 54.6408 335.609 54.6344 335.623 54.7128C335.625 54.7261 335.635 54.7815 335.638 54.7992C335.644 54.8302 335.641 54.8152 335.647 54.8473C335.653 54.8842 335.649 54.8608 335.656 54.8988C335.667 54.9595 335.664 54.9465 335.676 55.0117C335.691 55.0958 335.682 55.0493 335.698 55.1378C335.714 55.2263 335.731 55.3239 335.75 55.43C335.766 55.5242 335.762 55.4975 335.779 55.596C335.783 55.6195 335.806 55.7475 335.811 55.7753C335.818 55.8196 335.836 55.9192 335.845 55.9679C335.85 55.9966 335.848 55.9892 335.853 56.0181C335.858 56.0435 335.853 56.0182 335.858 56.0436C335.859 56.0472 335.86 56.0527 335.86 56.0564C335.861 56.0585 335.861 56.0606 335.861 56.0628C335.862 56.0649 335.862 56.067 335.862 56.0692C335.865 56.0814 335.869 56.1085 335.872 56.1211C335.878 56.1588 335.874 56.1358 335.881 56.1738L337.85 55.8262C337.838 55.7559 337.844 55.7908 337.832 55.7216C337.831 55.7167 337.815 55.6241 337.814 55.6204C337.814 55.6191 337.81 55.5967 337.81 55.5956C337.806 55.5756 337.809 55.5908 337.805 55.571C337.804 55.5628 337.805 55.5669 337.803 55.5587C337.803 55.5582 337.801 55.5471 337.801 55.5466C337.798 55.5293 337.8 55.5396 337.797 55.5224C337.786 55.4588 337.791 55.4903 337.78 55.4278C337.78 55.4258 337.779 55.4239 337.779 55.422C337.779 55.42 337.778 55.4181 337.778 55.4162C337.778 55.4143 337.777 55.4123 337.777 55.4104C337.777 55.4085 337.776 55.4066 337.776 55.4046C337.776 55.4027 337.775 55.4008 337.775 55.3989C337.775 55.397 337.774 55.3951 337.774 55.3931C337.774 55.3912 337.773 55.3893 337.773 55.3874C337.773 55.3855 337.772 55.3836 337.772 55.3817C337.771 55.3752 337.771 55.3768 337.77 55.3703C337.77 55.3692 337.768 55.3601 337.768 55.359C337.766 55.3493 337.766 55.3461 337.764 55.3365C337.746 55.2367 337.766 55.3471 337.749 55.2485C337.738 55.1915 337.743 55.2197 337.734 55.1638C337.732 55.1559 337.72 55.0893 337.719 55.0825C337.713 55.0486 337.711 55.0372 337.705 55.0044C337.703 54.9917 337.704 54.9981 337.702 54.9854C337.702 54.9846 337.699 54.9675 337.699 54.9667C337.696 54.9507 337.695 54.9454 337.692 54.9297C337.691 54.9237 337.692 54.9267 337.691 54.9206C337.691 54.9202 337.689 54.912 337.689 54.9116C337.687 54.9013 337.688 54.9038 337.686 54.8936C337.686 54.8921 337.685 54.8906 337.685 54.8892C337.685 54.8877 337.685 54.8862 337.684 54.8847C337.683 54.8771 337.684 54.8834 337.683 54.8759C337.681 54.8641 337.682 54.87 337.68 54.8583C337.68 54.8581 337.674 54.8239 337.674 54.8239C337.673 54.819 337.671 54.8118 337.671 54.807C337.67 54.8053 337.668 54.7919 337.668 54.7903C337.665 54.776 337.664 54.7714 337.662 54.7575C337.662 54.7567 337.659 54.7422 337.659 54.7414C337.657 54.7308 337.658 54.7361 337.656 54.7255C337.651 54.6985 337.65 54.69 337.645 54.6641C337.645 54.6629 337.645 54.6616 337.645 54.6604C337.645 54.6591 337.644 54.6579 337.644 54.6567C337.643 54.6517 337.644 54.6542 337.643 54.6493C337.641 54.6395 337.642 54.6444 337.64 54.6346C337.637 54.6154 337.638 54.625 337.635 54.606C337.629 54.5689 337.632 54.5872 337.625 54.5512C337.591 54.3557 337.591 54.3571 337.569 54.2325C337.561 54.1869 337.56 54.1806 337.555 54.1528C337.552 54.1372 337.554 54.144 337.552 54.1329C337.551 54.1321 337.551 54.1305 337.551 54.1299C337.551 54.129 337.551 54.1297 337.551 54.1288C337.551 54.1287 337.551 54.1286 337.551 54.1286C337.551 54.1285 337.551 54.1284 337.551 54.1283C337.551 54.1282 337.551 54.1282 337.551 54.1281C337.551 54.128 337.551 54.1279 337.551 54.1279C337.551 54.1274 337.551 54.1269 337.551 54.1266C337.551 54.1265 337.55 54.1264 337.55 54.1263C337.55 54.1262 337.55 54.1263 337.55 54.1262C337.55 54.1262 337.55 54.1262 337.55 54.1262C337.55 54.1262 337.55 54.1262 336.566 54.3ZM335.892 56.229C336.19 57.4948 336.808 58.8915 337.705 60.4087L339.427 59.3913C338.59 57.9752 338.075 56.7718 337.839 55.771L335.892 56.229ZM337.705 60.4087C338.67 62.0423 340.131 63.4488 342.033 64.6462L343.098 62.9538C341.4 61.8846 340.195 60.6911 339.427 59.3913L337.705 60.4087ZM342.033 64.6462C344.048 65.9151 346.689 66.5 349.866 66.5V64.5C346.909 64.5 344.683 63.9516 343.098 62.9538L342.033 64.6462ZM349.866 66.5C353.067 66.5 355.8 65.8388 358.001 64.4448L356.931 62.7552C355.132 63.8946 352.798 64.5 349.866 64.5V66.5ZM358.02 64.432C360.154 63.0097 361.776 61.2145 362.86 59.0472L361.071 58.1528C360.155 59.9855 358.777 61.5237 356.911 62.7679L358.02 64.432ZM362.86 59.0472C363.928 56.9107 364.466 54.6579 364.466 52.3H362.466C362.466 54.3421 362.003 56.2893 361.071 58.1528L362.86 59.0472ZM364.466 52.3C364.466 49.8803 363.931 47.5936 362.86 45.4528L361.071 46.3472C362.001 48.2064 362.466 50.1864 362.466 52.3H364.466ZM362.866 45.4644C361.782 43.2246 360.153 41.4183 358.001 40.0552L356.931 41.7448C358.778 42.915 360.149 44.4421 361.066 46.3356L362.866 45.4644ZM358.033 40.0768C355.896 38.6025 353.251 37.9 350.166 37.9V39.9C352.947 39.9 355.169 40.5308 356.898 41.7232L358.033 40.0768ZM350.166 37.9C347.8 37.9 345.767 38.2815 344.118 39.1056L345.013 40.8944C346.298 40.2519 347.998 39.9 350.166 39.9V37.9ZM344.152 39.0896C342.595 39.7971 341.31 40.6672 340.333 41.7195L341.798 43.0804C342.555 42.2661 343.603 41.5362 344.979 40.9104L344.152 39.0896ZM340.359 41.6929C339.453 42.5987 338.749 43.4748 338.288 44.3211L340.044 45.2789C340.382 44.6586 340.945 43.9347 341.773 43.1071L340.359 41.6929ZM338.271 44.3528C338.177 44.5403 338.125 44.6445 338.052 44.7903C338.037 44.8212 338.062 44.771 338.047 44.8019C338.046 44.8029 338.046 44.8039 338.045 44.8048C338.045 44.8058 338.044 44.8068 338.044 44.8077C338.043 44.8087 338.043 44.8096 338.042 44.8106C338.042 44.8116 338.041 44.8125 338.041 44.8135C338.033 44.8287 338.037 44.8211 338.03 44.8362C338.029 44.8371 338.029 44.8381 338.028 44.839C338.028 44.8399 338.027 44.8409 338.027 44.8418C338.026 44.8427 338.026 44.8436 338.025 44.8446C338.025 44.8455 338.024 44.8464 338.024 44.8474C338.024 44.8483 338.023 44.8492 338.023 44.8501C338.022 44.8511 338.022 44.852 338.021 44.8529C338.021 44.8538 338.02 44.8547 338.02 44.8557C338.019 44.8566 338.019 44.8575 338.018 44.8584C338.018 44.8593 338.018 44.8602 338.017 44.8611C338.017 44.8621 338.016 44.863 338.016 44.8639C338.015 44.8648 338.015 44.8657 338.014 44.8666C338.014 44.8675 338.013 44.8684 338.013 44.8693C338.013 44.8702 338.012 44.8711 338.012 44.872C338.011 44.8729 338.011 44.8738 338.01 44.8747C338.01 44.8756 338.009 44.8765 338.009 44.8774C338.008 44.8783 338.008 44.8792 338.008 44.8801C338 44.8944 338.004 44.8873 337.997 44.9014C337.997 44.9022 337.996 44.9031 337.996 44.904C337.995 44.9049 337.995 44.9057 337.994 44.9066C337.994 44.9075 337.993 44.9083 337.993 44.9092C337.993 44.9101 337.992 44.9109 337.992 44.9118C337.99 44.9153 337.991 44.9135 337.989 44.917C337.989 44.9178 337.988 44.9187 337.988 44.9196C337.987 44.9204 337.987 44.9213 337.987 44.9221C337.986 44.923 337.986 44.9238 337.985 44.9247C337.985 44.9255 337.984 44.9264 337.984 44.9272C337.984 44.9281 337.983 44.9289 337.983 44.9298C337.982 44.9306 337.982 44.9315 337.981 44.9323C337.981 44.9332 337.981 44.934 337.98 44.9348C337.98 44.9357 337.979 44.9365 337.979 44.9374C337.979 44.9382 337.978 44.939 337.978 44.9399C337.977 44.9407 337.977 44.9416 337.976 44.9424C337.976 44.9432 337.976 44.9441 337.975 44.9449C337.975 44.9457 337.974 44.9465 337.974 44.9474C337.974 44.9482 337.973 44.949 337.973 44.9499C337.972 44.9507 337.972 44.9515 337.971 44.9523C337.965 44.9654 337.976 44.9442 337.969 44.9573C337.969 44.9581 337.968 44.9589 337.968 44.9597C337.967 44.9605 337.967 44.9613 337.967 44.9622C337.963 44.9687 337.965 44.9654 337.962 44.9719C337.949 44.9976 337.97 44.9558 337.957 44.9814C337.957 44.9822 337.956 44.983 337.956 44.9838C337.955 44.9846 337.955 44.9854 337.955 44.9862C337.953 44.9893 337.954 44.9878 337.952 44.9909C337.952 44.9917 337.951 44.9925 337.951 44.9933C337.951 44.994 337.95 44.9948 337.95 44.9956C337.949 44.9964 337.949 44.9971 337.949 44.9979C337.948 44.9987 337.948 44.9995 337.948 45.0002C337.947 45.001 337.947 45.0018 337.946 45.0026C337.946 45.0033 337.946 45.0041 337.945 45.0049C337.942 45.011 337.946 45.0033 337.943 45.0095C337.943 45.0102 337.942 45.011 337.942 45.0117C337.941 45.0125 337.941 45.0133 337.941 45.014C337.939 45.0171 337.94 45.0155 337.938 45.0186C337.914 45.0667 337.953 44.9884 337.929 45.0364C337.907 45.0813 337.934 45.0263 337.912 45.0706C337.901 45.0924 337.907 45.0816 337.896 45.1028C337.894 45.108 337.891 45.1131 337.889 45.1182C337.878 45.1384 337.891 45.113 337.881 45.1331C337.879 45.1379 337.882 45.1319 337.879 45.1367C337.878 45.1391 337.879 45.1379 337.877 45.1403C337.87 45.1547 337.883 45.1295 337.876 45.1439C337.875 45.1445 337.875 45.1451 337.875 45.1457C337.874 45.1463 337.874 45.1469 337.874 45.1475C337.872 45.1522 337.869 45.1568 337.867 45.1614C337.862 45.1705 337.858 45.1793 337.854 45.1877C337.852 45.192 337.85 45.1961 337.848 45.2002C337.839 45.2165 337.85 45.196 337.842 45.2122C337.827 45.2415 337.845 45.206 337.83 45.2346C337.823 45.2486 337.827 45.2418 337.82 45.2551C337.814 45.2682 337.808 45.2799 337.802 45.2903C337.785 45.325 337.791 45.3129 337.779 45.3372C337.776 45.3424 337.775 45.3463 337.773 45.3489C337.772 45.3511 337.772 45.3503 337.772 45.3518C337.772 45.3519 337.772 45.3519 337.772 45.3519C337.772 45.352 337.772 45.352 337.772 45.352C337.772 45.3521 337.772 45.3521 337.772 45.3521C337.772 45.3522 337.772 45.3522 337.772 45.3522C337.771 45.3529 337.772 45.3518 337.771 45.3524C337.771 45.3525 337.771 45.3525 337.771 45.3525C337.771 45.3526 337.771 45.3526 337.771 45.3526C337.771 45.3526 337.771 45.3526 337.771 45.3526C337.771 45.3527 337.771 45.3527 337.771 45.3527C337.771 45.3527 337.771 45.3527 337.771 45.3527C337.771 45.3528 337.771 45.3527 337.771 45.3528C337.771 45.3528 337.771 45.3528 337.771 45.3528C337.771 45.3528 337.771 45.3528 338.666 45.8C339.56 46.2472 339.56 46.2472 339.56 46.2472C339.56 46.2472 339.56 46.2472 339.56 46.2472C339.56 46.2472 339.56 46.2472 339.56 46.2472C339.56 46.2472 339.56 46.2472 339.56 46.2472C339.56 46.2471 339.56 46.247 339.56 46.247C339.561 46.2463 339.56 46.2474 339.56 46.2467C339.561 46.2461 339.56 46.247 339.56 46.2465C339.561 46.2464 339.561 46.2463 339.561 46.2462C339.561 46.2449 339.56 46.2465 339.561 46.245C339.562 46.2426 339.561 46.2459 339.562 46.2433C339.562 46.2433 339.564 46.2391 339.564 46.2384C339.566 46.2363 339.564 46.239 339.565 46.2369C339.565 46.2368 339.565 46.2366 339.565 46.2365C339.566 46.2364 339.566 46.2362 339.566 46.2361C339.567 46.2338 339.565 46.2375 339.566 46.2352C339.566 46.2352 339.567 46.2335 339.567 46.2335C339.567 46.2333 339.567 46.2332 339.567 46.233C339.567 46.2329 339.567 46.2327 339.567 46.2325C339.568 46.2324 339.568 46.2322 339.568 46.2321C339.568 46.2319 339.568 46.2317 339.568 46.2316C339.573 46.2212 339.565 46.238 339.57 46.2274C339.572 46.2229 339.568 46.2308 339.571 46.2263C339.571 46.2259 339.571 46.2256 339.571 46.2252C339.571 46.225 339.571 46.2248 339.571 46.2246C339.572 46.2244 339.572 46.2242 339.572 46.224C339.573 46.2224 339.571 46.2244 339.572 46.2228C339.574 46.2195 339.572 46.2236 339.574 46.2203C339.574 46.2201 339.574 46.2199 339.574 46.2197C339.574 46.2194 339.574 46.2192 339.574 46.219C339.574 46.2186 339.575 46.2181 339.575 46.2177C339.575 46.2174 339.575 46.2172 339.575 46.217C339.575 46.2168 339.575 46.2165 339.576 46.2163C339.578 46.2107 339.573 46.2205 339.576 46.2149C339.58 46.2074 339.574 46.2196 339.578 46.2121C339.586 46.1953 339.572 46.2229 339.581 46.206C339.583 46.2017 339.58 46.207 339.582 46.2027C339.587 46.1936 339.579 46.2085 339.584 46.1994C339.584 46.1994 339.585 46.1976 339.585 46.1976C339.585 46.1973 339.585 46.1971 339.585 46.1968C339.585 46.1965 339.586 46.1962 339.586 46.1959C339.586 46.1956 339.586 46.1953 339.586 46.195C339.586 46.1947 339.587 46.1944 339.587 46.1941C339.588 46.1917 339.586 46.1947 339.588 46.1923C339.59 46.1873 339.586 46.1954 339.588 46.1904C339.589 46.1901 339.589 46.1898 339.589 46.1895C339.589 46.1892 339.589 46.1889 339.589 46.1886C339.59 46.1882 339.59 46.1879 339.59 46.1876C339.59 46.1873 339.59 46.187 339.59 46.1866C339.591 46.1863 339.591 46.186 339.591 46.1857C339.591 46.1854 339.591 46.185 339.591 46.1847C339.612 46.143 339.643 46.0805 339.685 45.9972C339.696 45.9764 339.683 46.0023 339.693 45.9813C339.693 45.9807 339.694 45.98 339.694 45.9793C339.694 45.9787 339.695 45.978 339.695 45.9773C339.695 45.9766 339.696 45.9759 339.696 45.9753C339.696 45.9746 339.697 45.9739 339.697 45.9732C339.703 45.9623 339.694 45.98 339.699 45.9691C339.699 45.9684 339.7 45.9677 339.7 45.9671C339.701 45.9664 339.701 45.9657 339.701 45.965C339.704 45.9595 339.707 45.9538 339.71 45.9481C339.744 45.8798 339.684 45.9993 339.718 45.9308C339.743 45.882 339.712 45.9441 339.736 45.8947C339.736 45.8947 339.746 45.876 339.746 45.8759C339.772 45.824 339.729 45.9087 339.755 45.8566C339.768 45.8305 339.782 45.8032 339.796 45.7746C339.797 45.7737 339.797 45.7728 339.798 45.7719C339.798 45.771 339.799 45.7701 339.799 45.7692C339.806 45.7547 339.795 45.7782 339.802 45.7638C339.809 45.7493 339.8 45.7674 339.807 45.7528C339.815 45.7381 339.803 45.762 339.81 45.7473C339.811 45.7455 339.812 45.7436 339.813 45.7418C339.813 45.7409 339.814 45.7399 339.814 45.739C339.815 45.7381 339.815 45.7371 339.816 45.7362C339.816 45.7353 339.817 45.7343 339.817 45.7334C339.817 45.7325 339.818 45.7315 339.818 45.7306C339.818 45.7306 339.841 45.6854 339.841 45.6847C339.857 45.653 339.837 45.6929 339.853 45.661C339.869 45.6291 339.843 45.6809 339.859 45.649C339.871 45.6247 339.85 45.6672 339.862 45.6429C339.863 45.6419 339.863 45.6409 339.864 45.6399C339.864 45.6389 339.865 45.6379 339.865 45.6369C339.882 45.6043 339.861 45.6449 339.878 45.6122C339.882 45.6039 339.877 45.6143 339.881 45.606C339.881 45.6049 339.882 45.6039 339.882 45.6028C339.883 45.6018 339.883 45.6007 339.884 45.5997C339.886 45.5955 339.888 45.5913 339.89 45.5871C339.907 45.5532 339.925 45.518 339.943 45.4816C339.979 45.4087 340.018 45.3305 340.06 45.2472L338.271 44.3528ZM338.666 44.8H323.466V46.8H338.666V44.8ZM324.454 45.9501L330.954 3.15015L328.977 2.84985L322.477 45.6499L324.454 45.9501ZM329.966 4H373.566V2H329.966V4ZM372.566 3V16.4H374.566V3H372.566ZM373.566 15.4H340.466V17.4H373.566V15.4ZM339.477 16.2479L336.877 33.1479L338.854 33.4521L341.454 16.5521L339.477 16.2479ZM337.866 34.3H338.266V32.3H337.866V34.3ZM338.973 34.0071C339.306 33.6738 339.973 33.0071 340.973 32.0071L339.559 30.5929C338.559 31.5929 337.892 32.2596 337.559 32.5929L338.973 34.0071ZM340.95 32.0295C341.89 31.1476 343.365 30.2704 345.442 29.4265L344.689 27.5735C342.5 28.4629 340.774 29.4524 339.582 30.5705L340.95 32.0295ZM345.466 29.4162C347.425 28.5592 350.106 28.1 353.566 28.1V26.1C349.959 26.1 346.973 26.5742 344.665 27.5838L345.466 29.4162ZM353.566 28.1C358.746 28.1 363.083 29.2642 366.625 31.5412L367.706 29.8588C363.782 27.3358 359.052 26.1 353.566 26.1V28.1ZM366.625 31.5412C370.213 33.8477 372.886 36.8124 374.668 40.4409L376.463 39.5591C374.512 35.5876 371.585 32.3523 367.706 29.8588L366.625 31.5412ZM374.678 40.4599C376.537 44.0512 377.466 47.8602 377.466 51.9H379.466C379.466 47.5398 378.461 43.4154 376.454 39.5401L374.678 40.4599ZM377.466 51.9C377.466 55.0409 376.889 58.0841 375.734 61.0356L377.597 61.7644C378.842 58.5826 379.466 55.2924 379.466 51.9H377.466ZM375.728 61.0534C374.642 63.9911 372.98 66.68 370.73 69.1225L372.201 70.4775C374.618 67.8533 376.423 64.9422 377.604 61.7466L375.728 61.0534ZM370.739 69.1128C368.51 71.469 365.694 73.3959 362.268 74.8827L363.064 76.7173C366.704 75.1375 369.754 73.0643 372.192 70.4872L370.739 69.1128ZM362.282 74.8764C358.897 76.2816 354.866 77 350.166 77V79C355.065 79 359.368 78.2518 363.049 76.7236L362.282 74.8764ZM406.03 75L405.564 75.8849L405.57 75.8882L406.03 75ZM396.33 66.8L395.532 67.4024L395.537 67.4097L396.33 66.8ZM390.23 54.6L389.269 54.8784L389.273 54.8912L390.23 54.6ZM390.23 25.3L389.273 25.0088L389.269 25.0216L390.23 25.3ZM396.33 13.2L397.122 13.8097L397.128 13.8024L396.33 13.2ZM406.03 5L406.483 5.8913L406.489 5.88821L406.03 5ZM432.33 5L431.864 5.88492L431.873 5.88977L431.883 5.89442L432.33 5ZM442.13 13.2L441.332 13.8024L441.337 13.8097L442.13 13.2ZM448.13 25.3L447.169 25.5784L447.173 25.5912L448.13 25.3ZM448.13 54.6L447.173 54.3088L447.169 54.3216L448.13 54.6ZM442.13 66.8L442.922 67.4097L442.928 67.4024L442.13 66.8ZM432.33 75L431.87 74.1118L431.864 74.1151L432.33 75ZM430.03 58.2L429.212 57.6238L429.206 57.6329L430.03 58.2ZM430.03 21.8L429.206 22.3671L429.212 22.3762L430.03 21.8ZM408.33 21.8L407.512 21.2238L407.506 21.2329L408.33 21.8ZM408.33 58.2L407.506 58.7671L407.512 58.7762L408.33 58.2ZM419.23 77C414.435 77 410.196 76.0291 406.489 74.1118L405.57 75.8882C409.597 77.9709 414.158 79 419.23 79V77ZM406.495 74.1151C402.825 72.1835 399.703 69.5449 397.122 66.1903L395.537 67.4097C398.29 70.9884 401.634 73.8165 405.564 75.8849L406.495 74.1151ZM397.128 66.1976C394.538 62.7657 392.555 58.8063 391.186 54.3088L389.273 54.8912C390.704 59.5937 392.788 63.7677 395.532 67.4024L397.128 66.1976ZM391.19 54.3216C389.885 49.8183 389.23 45.0459 389.23 40H387.23C387.23 45.2208 387.908 50.1817 389.269 54.8784L391.19 54.3216ZM389.23 40C389.23 34.8862 389.885 30.0805 391.19 25.5784L389.269 25.0216C387.908 29.7195 387.23 34.7138 387.23 40H389.23ZM391.186 25.5912C392.555 21.0949 394.536 17.1719 397.122 13.8097L395.537 12.5903C392.79 16.1614 390.705 20.3051 389.273 25.0088L391.186 25.5912ZM397.128 13.8024C399.707 10.3855 402.824 7.75308 406.483 5.89128L405.576 4.10872C401.636 6.11358 398.286 8.94782 395.532 12.5976L397.128 13.8024ZM406.489 5.88821C410.196 3.97094 414.435 2.99999 419.23 2.99999V0.999994C414.158 0.999994 409.597 2.02905 405.57 4.11178L406.489 5.88821ZM419.23 2.99999C424.025 2.99999 428.228 3.97107 431.864 5.88492L432.795 4.11508C428.832 2.02893 424.301 0.999994 419.23 0.999994V2.99999ZM431.883 5.89442C435.608 7.75709 438.755 10.3891 441.332 13.8024L442.928 12.5976C440.171 8.94421 436.785 6.10957 432.777 4.10557L431.883 5.89442ZM441.337 13.8097C443.921 17.1684 445.867 21.0869 447.169 25.5784L449.09 25.0216C447.725 20.3131 445.672 16.165 442.922 12.5903L441.337 13.8097ZM447.173 25.5912C448.542 30.0894 449.23 34.8907 449.23 40H451.23C451.23 34.7093 450.517 29.7106 449.086 25.0088L447.173 25.5912ZM449.23 40C449.23 45.0413 448.542 49.8094 447.173 54.3088L449.086 54.8912C450.517 50.1906 451.23 45.2253 451.23 40H449.23ZM447.169 54.3216C445.867 58.8142 443.919 62.7692 441.332 66.1976L442.928 67.4024C445.674 63.7642 447.726 59.5858 449.09 54.8784L447.169 54.3216ZM441.337 66.1903C438.759 69.5414 435.606 72.1794 431.87 74.1118L432.789 75.8882C436.787 73.8206 440.167 70.9919 442.922 67.4097L441.337 66.1903ZM431.864 74.1151C428.228 76.0289 424.025 77 419.23 77V79C424.301 79 428.832 77.9711 432.795 75.8849L431.864 74.1151ZM419.23 65.3C424.003 65.3 427.893 63.0662 430.853 58.7671L429.206 57.6329C426.566 61.4671 423.256 63.3 419.23 63.3V65.3ZM430.847 58.7762C433.886 54.4653 435.33 48.1558 435.33 40H433.33C433.33 47.9776 431.907 53.8013 429.212 57.6238L430.847 58.7762ZM435.33 40C435.33 31.8442 433.886 25.5346 430.847 21.2238L429.212 22.3762C431.907 26.1987 433.33 32.0224 433.33 40H435.33ZM430.853 21.2329C427.893 16.9338 424.003 14.7 419.23 14.7V16.7C423.256 16.7 426.566 18.5329 429.206 22.3671L430.853 21.2329ZM419.23 14.7C414.458 14.7 410.538 16.9317 407.512 21.2238L409.147 22.3762C411.855 18.535 415.201 16.7 419.23 16.7V14.7ZM407.506 21.2329C404.539 25.5419 403.13 31.8475 403.13 40H405.13C405.13 32.0191 406.52 26.1914 409.153 22.3671L407.506 21.2329ZM403.13 40C403.13 48.1525 404.539 54.4581 407.506 58.7671L409.153 57.6329C406.52 53.8086 405.13 47.9809 405.13 40H403.13ZM407.512 58.7762C410.538 63.0683 414.458 65.3 419.23 65.3V63.3C415.201 63.3 411.855 61.465 409.147 57.6238L407.512 58.7762ZM476.049 75L475.584 75.8849L475.59 75.8882L476.049 75ZM466.349 66.8L465.551 67.4024L465.557 67.4097L466.349 66.8ZM460.249 54.6L459.289 54.8784L459.293 54.8912L460.249 54.6ZM460.249 25.3L459.293 25.0088L459.289 25.0216L460.249 25.3ZM466.349 13.2L467.142 13.8097L467.147 13.8024L466.349 13.2ZM476.049 5L476.503 5.8913L476.509 5.88821L476.049 5ZM502.349 5L501.884 5.88492L501.893 5.88977L501.902 5.89442L502.349 5ZM512.149 13.2L511.351 13.8024L511.357 13.8097L512.149 13.2ZM518.149 25.3L517.189 25.5784L517.193 25.5912L518.149 25.3ZM518.149 54.6L517.193 54.3088L517.189 54.3216L518.149 54.6ZM512.149 66.8L512.942 67.4097L512.947 67.4024L512.149 66.8ZM502.349 75L501.89 74.1118L501.884 74.1151L502.349 75ZM500.049 58.2L499.232 57.6238L499.226 57.6329L500.049 58.2ZM500.049 21.8L499.226 22.3671L499.232 22.3762L500.049 21.8ZM478.349 21.8L477.532 21.2238L477.526 21.2329L478.349 21.8ZM478.349 58.2L477.526 58.7671L477.532 58.7762L478.349 58.2ZM489.249 77C484.454 77 480.215 76.0291 476.509 74.1118L475.59 75.8882C479.616 77.9709 484.178 79 489.249 79V77ZM476.515 74.1151C472.845 72.1835 469.722 69.5449 467.142 66.1903L465.557 67.4097C468.309 70.9884 471.654 73.8165 475.584 75.8849L476.515 74.1151ZM467.147 66.1976C464.557 62.7657 462.575 58.8063 461.206 54.3088L459.293 54.8912C460.724 59.5937 462.808 63.7677 465.551 67.4024L467.147 66.1976ZM461.21 54.3216C459.904 49.8183 459.249 45.0459 459.249 40H457.249C457.249 45.2208 457.927 50.1817 459.289 54.8784L461.21 54.3216ZM459.249 40C459.249 34.8862 459.905 30.0805 461.21 25.5784L459.289 25.0216C457.927 29.7195 457.249 34.7138 457.249 40H459.249ZM461.206 25.5912C462.574 21.0949 464.556 17.1719 467.142 13.8097L465.557 12.5903C462.81 16.1614 460.724 20.3051 459.293 25.0088L461.206 25.5912ZM467.147 13.8024C469.726 10.3855 472.843 7.75308 476.503 5.89128L475.596 4.10872C471.655 6.11358 468.306 8.94782 465.551 12.5976L467.147 13.8024ZM476.509 5.88821C480.215 3.97094 484.454 2.99999 489.249 2.99999V0.999994C484.178 0.999994 479.616 2.02905 475.59 4.11178L476.509 5.88821ZM489.249 2.99999C494.045 2.99999 498.247 3.97107 501.884 5.88492L502.815 4.11508C498.851 2.02893 494.321 0.999994 489.249 0.999994V2.99999ZM501.902 5.89442C505.627 7.75709 508.775 10.3891 511.351 13.8024L512.947 12.5976C510.19 8.94421 506.804 6.10957 502.796 4.10557L501.902 5.89442ZM511.357 13.8097C513.94 17.1684 515.887 21.0869 517.189 25.5784L519.11 25.0216C517.745 20.3131 515.692 16.165 512.942 12.5903L511.357 13.8097ZM517.193 25.5912C518.562 30.0894 519.249 34.8907 519.249 40H521.249C521.249 34.7093 520.537 29.7106 519.106 25.0088L517.193 25.5912ZM519.249 40C519.249 45.0413 518.562 49.8094 517.193 54.3088L519.106 54.8912C520.537 50.1906 521.249 45.2253 521.249 40H519.249ZM517.189 54.3216C515.887 58.8142 513.939 62.7692 511.351 66.1976L512.947 67.4024C515.693 63.7642 517.745 59.5858 519.11 54.8784L517.189 54.3216ZM511.357 66.1903C508.779 69.5414 505.626 72.1794 501.89 74.1118L502.809 75.8882C506.806 73.8206 510.186 70.9919 512.942 67.4097L511.357 66.1903ZM501.884 74.1151C498.247 76.0289 494.045 77 489.249 77V79C494.321 79 498.851 77.9711 502.815 75.8849L501.884 74.1151ZM489.249 65.3C494.023 65.3 497.913 63.0662 500.873 58.7671L499.226 57.6329C496.586 61.4671 493.276 63.3 489.249 63.3V65.3ZM500.867 58.7762C503.905 54.4653 505.349 48.1558 505.349 40H503.349C503.349 47.9776 501.927 53.8013 499.232 57.6238L500.867 58.7762ZM505.349 40C505.349 31.8442 503.905 25.5346 500.867 21.2238L499.232 22.3762C501.927 26.1987 503.349 32.0224 503.349 40H505.349ZM500.873 21.2329C497.913 16.9338 494.023 14.7 489.249 14.7V16.7C493.276 16.7 496.586 18.5329 499.226 22.3671L500.873 21.2329ZM489.249 14.7C484.478 14.7 480.558 16.9317 477.532 21.2238L479.167 22.3762C481.874 18.535 485.221 16.7 489.249 16.7V14.7ZM477.526 21.2329C474.559 25.5419 473.149 31.8475 473.149 40H475.149C475.149 32.0191 476.54 26.1914 479.173 22.3671L477.526 21.2329ZM473.149 40C473.149 48.1525 474.559 54.4581 477.526 58.7671L479.173 57.6329C476.54 53.8086 475.149 47.9809 475.149 40H473.149ZM477.532 58.7762C480.558 63.0683 484.478 65.3 489.249 65.3V63.3C485.221 63.3 481.874 61.465 479.167 57.6238L477.532 58.7762ZM535.869 51.8H534.869V52.8H535.869V51.8ZM535.869 39.8V38.8H534.869V39.8H535.869ZM550.869 39.8V40.8H551.869V39.8H550.869ZM550.869 24.8V23.8H549.869V24.8H550.869ZM562.869 24.8H563.869V23.8H562.869V24.8ZM562.869 39.8H561.869V40.8H562.869V39.8ZM577.869 39.8H578.869V38.8H577.869V39.8ZM577.869 51.8V52.8H578.869V51.8H577.869ZM562.869 51.8V50.8H561.869V51.8H562.869ZM562.869 66.8V67.8H563.869V66.8H562.869ZM550.869 66.8H549.869V67.8H550.869V66.8ZM550.869 51.8H551.869V50.8H550.869V51.8ZM536.869 51.8V39.8H534.869V51.8H536.869ZM535.869 40.8H550.869V38.8H535.869V40.8ZM551.869 39.8V24.8H549.869V39.8H551.869ZM550.869 25.8H562.869V23.8H550.869V25.8ZM561.869 24.8V39.8H563.869V24.8H561.869ZM562.869 40.8H577.869V38.8H562.869V40.8ZM576.869 39.8V51.8H578.869V39.8H576.869ZM577.869 50.8H562.869V52.8H577.869V50.8ZM561.869 51.8V66.8H563.869V51.8H561.869ZM562.869 65.8H550.869V67.8H562.869V65.8ZM551.869 66.8V51.8H549.869V66.8H551.869ZM550.869 50.8H535.869V52.8H550.869V50.8Z" fill="#E38E73"/>
<path d="M351.608 117.831C348.358 117.831 345.585 117.311 343.288 116.271C340.991 115.231 339.106 113.91 337.633 112.306C336.203 110.703 335.141 109.035 334.448 107.301C333.798 105.525 333.473 103.9 333.473 102.426H342.768C342.768 102.426 342.833 102.795 342.963 103.531C343.136 104.268 343.505 105.113 344.068 106.066C344.631 107.02 345.498 107.865 346.668 108.601C347.838 109.338 349.42 109.706 351.413 109.706C353.406 109.706 355.053 109.295 356.353 108.471C357.653 107.605 358.628 106.521 359.278 105.221C359.928 103.921 360.253 102.556 360.253 101.126C360.253 99.6531 359.928 98.2664 359.278 96.9664C358.628 95.6231 357.653 94.5397 356.353 93.7164C355.096 92.8497 353.515 92.4164 351.608 92.4164C350.135 92.4164 348.921 92.6547 347.968 93.1314C347.015 93.5647 346.256 94.0847 345.693 94.6914C345.13 95.2547 344.718 95.7747 344.458 96.2514C344.241 96.6847 344.133 96.9014 344.133 96.9014H334.253L338.478 69.0814H366.818V77.7914H345.303L343.613 88.7764H343.873C344.09 88.5597 344.523 88.1264 345.173 87.4764C345.866 86.8264 346.906 86.2197 348.293 85.6564C349.68 85.0497 351.521 84.7464 353.818 84.7464C357.285 84.7464 360.231 85.5264 362.658 87.0864C365.085 88.6464 366.905 90.6614 368.118 93.1314C369.375 95.5581 370.003 98.1364 370.003 100.866C370.003 102.99 369.613 105.048 368.833 107.041C368.096 109.035 366.97 110.855 365.453 112.501C363.936 114.105 362.03 115.405 359.733 116.401C357.436 117.355 354.728 117.831 351.608 117.831ZM396.5 117.831C393.293 117.831 390.433 117.181 387.92 115.881C385.45 114.581 383.348 112.805 381.615 110.551C379.881 108.255 378.56 105.611 377.65 102.621C376.783 99.6314 376.35 96.4681 376.35 93.1314C376.35 89.7514 376.783 86.5664 377.65 83.5764C378.56 80.5864 379.881 77.9647 381.615 75.7114C383.348 73.4147 385.45 71.6381 387.92 70.3814C390.433 69.0814 393.293 68.4314 396.5 68.4314C399.706 68.4314 402.545 69.0814 405.015 70.3814C407.528 71.6381 409.651 73.4147 411.385 75.7114C413.118 77.9647 414.418 80.5864 415.285 83.5764C416.195 86.5664 416.65 89.7514 416.65 93.1314C416.65 96.4681 416.195 99.6314 415.285 102.621C414.418 105.611 413.118 108.255 411.385 110.551C409.651 112.805 407.528 114.581 405.015 115.881C402.545 117.181 399.706 117.831 396.5 117.831ZM396.5 108.926C399.36 108.926 401.7 107.605 403.52 104.961C405.383 102.318 406.315 98.3747 406.315 93.1314C406.315 87.8881 405.383 83.9447 403.52 81.3014C401.7 78.6581 399.36 77.3364 396.5 77.3364C393.64 77.3364 391.278 78.6581 389.415 81.3014C387.595 83.9447 386.685 87.8881 386.685 93.1314C386.685 98.3747 387.595 102.318 389.415 104.961C391.278 107.605 393.64 108.926 396.5 108.926ZM442.012 117.831C438.806 117.831 435.946 117.181 433.432 115.881C430.962 114.581 428.861 112.805 427.127 110.551C425.394 108.255 424.072 105.611 423.162 102.621C422.296 99.6314 421.862 96.4681 421.862 93.1314C421.862 89.7514 422.296 86.5664 423.162 83.5764C424.072 80.5864 425.394 77.9647 427.127 75.7114C428.861 73.4147 430.962 71.6381 433.432 70.3814C435.946 69.0814 438.806 68.4314 442.012 68.4314C445.219 68.4314 448.057 69.0814 450.527 70.3814C453.041 71.6381 455.164 73.4147 456.897 75.7114C458.631 77.9647 459.931 80.5864 460.797 83.5764C461.707 86.5664 462.162 89.7514 462.162 93.1314C462.162 96.4681 461.707 99.6314 460.797 102.621C459.931 105.611 458.631 108.255 456.897 110.551C455.164 112.805 453.041 114.581 450.527 115.881C448.057 117.181 445.219 117.831 442.012 117.831ZM442.012 108.926C444.872 108.926 447.212 107.605 449.032 104.961C450.896 102.318 451.827 98.3747 451.827 93.1314C451.827 87.8881 450.896 83.9447 449.032 81.3014C447.212 78.6581 444.872 77.3364 442.012 77.3364C439.152 77.3364 436.791 78.6581 434.927 81.3014C433.107 83.9447 432.197 87.8881 432.197 93.1314C432.197 98.3747 433.107 102.318 434.927 104.961C436.791 107.605 439.152 108.926 442.012 108.926ZM472.315 100.801V93.0014H482.065V83.2514H489.865V93.0014H499.615V100.801H489.865V110.551H482.065V100.801H472.315Z" fill="white"/>
<path d="M354.844 183V164.5H362.469C363.986 164.5 365.244 164.8 366.244 165.4C367.261 166 368.019 166.775 368.519 167.725C369.036 168.658 369.294 169.633 369.294 170.65C369.294 171.7 369.036 172.7 368.519 173.65C368.019 174.583 367.261 175.35 366.244 175.95C365.244 176.55 363.986 176.85 362.469 176.85H358.694V183H354.844ZM362.469 167.875H358.694V173.5H362.469C363.119 173.5 363.661 173.367 364.094 173.1C364.527 172.817 364.852 172.467 365.069 172.05C365.302 171.617 365.419 171.158 365.419 170.675C365.419 170.208 365.302 169.758 365.069 169.325C364.852 168.892 364.527 168.542 364.094 168.275C363.661 168.008 363.119 167.875 362.469 167.875ZM368.957 183L375.257 164.5H380.382L386.682 183H382.632L381.457 179.375H374.207L373.007 183H368.957ZM375.282 176.025H380.382L377.832 168.3L375.282 176.025ZM389.121 183V164.5H396.621C397.988 164.5 399.155 164.742 400.121 165.225C401.105 165.708 401.855 166.375 402.371 167.225C402.905 168.075 403.171 169.058 403.171 170.175C403.171 171.392 402.863 172.458 402.246 173.375C401.63 174.275 400.755 174.933 399.621 175.35L403.646 183H399.371L395.696 175.875H392.971V183H389.121ZM396.571 167.825H392.971V172.725H396.571C397.421 172.725 398.088 172.492 398.571 172.025C399.055 171.558 399.296 170.983 399.296 170.3C399.296 169.6 399.055 169.017 398.571 168.55C398.088 168.067 397.421 167.825 396.571 167.825ZM410.966 183V167.85H405.291V164.5H420.491V167.85H414.816V183H410.966ZM423.155 183V164.5H426.68L434.655 176.3V164.5H438.48V183H434.905L426.98 171.525V183H423.155ZM441.88 183V164.5H454.63V167.85H445.73V172H453.48V175.225H445.73V179.65H454.755V183H441.88ZM457.92 183V164.5H465.42C466.787 164.5 467.953 164.742 468.92 165.225C469.903 165.708 470.653 166.375 471.17 167.225C471.703 168.075 471.97 169.058 471.97 170.175C471.97 171.392 471.662 172.458 471.045 173.375C470.428 174.275 469.553 174.933 468.42 175.35L472.445 183H468.17L464.495 175.875H461.77V183H457.92ZM465.37 167.825H461.77V172.725H465.37C466.22 172.725 466.887 172.492 467.37 172.025C467.853 171.558 468.095 170.983 468.095 170.3C468.095 169.6 467.853 169.017 467.37 168.55C466.887 168.067 466.22 167.825 465.37 167.825ZM482.227 183.25C481.027 183.25 480.002 183.108 479.152 182.825C478.319 182.525 477.619 182.15 477.052 181.7C476.502 181.233 476.061 180.75 475.727 180.25C475.394 179.733 475.144 179.25 474.977 178.8C474.827 178.333 474.727 177.958 474.677 177.675C474.644 177.375 474.627 177.225 474.627 177.225H478.527C478.527 177.225 478.561 177.367 478.627 177.65C478.711 177.933 478.877 178.267 479.127 178.65C479.377 179.017 479.761 179.342 480.277 179.625C480.794 179.892 481.494 180.025 482.377 180.025C483.461 180.025 484.261 179.8 484.777 179.35C485.294 178.883 485.552 178.333 485.552 177.7C485.552 177.133 485.352 176.683 484.952 176.35C484.569 176.017 483.969 175.767 483.152 175.6L480.677 175.125C479.677 174.942 478.744 174.65 477.877 174.25C477.027 173.85 476.336 173.3 475.802 172.6C475.269 171.883 475.002 170.967 475.002 169.85C475.002 168.717 475.286 167.733 475.852 166.9C476.419 166.05 477.211 165.4 478.227 164.95C479.261 164.483 480.469 164.25 481.852 164.25C483.152 164.25 484.227 164.442 485.077 164.825C485.944 165.192 486.627 165.65 487.127 166.2C487.644 166.733 488.019 167.275 488.252 167.825C488.502 168.375 488.661 168.833 488.727 169.2C488.811 169.567 488.852 169.75 488.852 169.75H485.052C485.052 169.75 485.019 169.633 484.952 169.4C484.902 169.167 484.769 168.9 484.552 168.6C484.336 168.3 484.002 168.033 483.552 167.8C483.119 167.567 482.519 167.45 481.752 167.45C480.702 167.45 479.944 167.683 479.477 168.15C479.011 168.6 478.777 169.092 478.777 169.625C478.777 170.175 479.011 170.6 479.477 170.9C479.944 171.2 480.552 171.425 481.302 171.575L483.927 172.1C484.927 172.283 485.844 172.592 486.677 173.025C487.511 173.458 488.169 174.042 488.652 174.775C489.152 175.492 489.402 176.383 489.402 177.45C489.402 178.55 489.127 179.542 488.577 180.425C488.027 181.292 487.219 181.983 486.152 182.5C485.086 183 483.777 183.25 482.227 183.25Z" fill="white"/>
<path d="M666.03 77H665.03V78H666.03V77ZM666.03 66.4L665.382 65.6386L665.03 65.9381V66.4H666.03ZM678.83 55.5L678.188 54.7333L678.182 54.7386L678.83 55.5ZM692.53 44.1L691.894 43.3285L691.894 43.3285L692.53 44.1ZM702.53 20.5L701.704 21.0623L701.709 21.0702L701.714 21.078L702.53 20.5ZM698.13 16.8L697.683 17.6944L697.704 17.7046L697.724 17.7138L698.13 16.8ZM686.73 16.8L686.254 15.9207L686.246 15.925L686.238 15.9294L686.73 16.8ZM683.03 20.2L682.198 19.6453L682.192 19.655L683.03 20.2ZM680.53 28.2V29.2H681.53V28.2H680.53ZM665.73 28.2H664.73V29.2H665.73V28.2ZM667.33 19.5L668.273 19.835L668.275 19.8285L667.33 19.5ZM672.23 11L672.994 11.646L673.002 11.6364L672.23 11ZM680.73 4.5L681.164 5.40125L681.164 5.40125L680.73 4.5ZM706.43 4.9L705.995 5.80043L706.008 5.80618L706.43 4.9ZM716.03 13L715.203 13.5619L715.211 13.5724L716.03 13ZM716.33 37.9L715.476 37.381L715.473 37.3855L716.33 37.9ZM707.03 48.7L707.685 49.4557L707.693 49.4495L707.03 48.7ZM693.23 60L692.614 59.2123L692.602 59.2218L692.59 59.2318L693.23 60ZM689.03 63.5L688.39 62.7318L686.268 64.5H689.03V63.5ZM720.73 63.5H721.73V62.5H720.73V63.5ZM720.73 77V78H721.73V77H720.73ZM667.03 77V66.4H665.03V77H667.03ZM666.679 67.1614L679.479 56.2614L678.182 54.7386L665.382 65.6386L666.679 67.1614ZM679.473 56.2666C684.805 51.801 689.369 48.0027 693.167 44.8715L691.894 43.3285C688.092 46.4639 683.523 50.2657 678.188 54.7334L679.473 56.2666ZM693.167 44.8715C697.005 41.7069 699.972 38.7139 702.038 35.8905L700.423 34.7095C698.489 37.3528 695.656 40.2264 691.894 43.3285L693.167 44.8715ZM702.038 35.8905C704.152 33.0005 705.23 29.8631 705.23 26.5H703.23C703.23 29.4035 702.309 32.1328 700.423 34.7095L702.038 35.8905ZM705.23 26.5C705.23 23.94 704.624 21.7257 703.346 19.922L701.714 21.078C702.703 22.4743 703.23 24.26 703.23 26.5H705.23ZM703.357 19.9377C702.122 18.1207 700.511 16.7637 698.537 15.8862L697.724 17.7138C699.35 18.4363 700.672 19.546 701.704 21.0623L703.357 19.9377ZM698.578 15.9056C696.706 14.9696 694.719 14.5 692.63 14.5V16.5C694.408 16.5 696.088 16.897 697.683 17.6944L698.578 15.9056ZM692.63 14.5C690.177 14.5 688.036 14.9556 686.254 15.9207L687.207 17.6793C688.625 16.9111 690.418 16.5 692.63 16.5V14.5ZM686.238 15.9294C684.575 16.8695 683.223 18.1087 682.198 19.6453L683.863 20.7547C684.705 19.4913 685.819 18.4638 687.223 17.6706L686.238 15.9294ZM682.192 19.655C681.272 21.0712 680.594 22.5658 680.166 24.1369L682.095 24.6631C682.467 23.3009 683.056 21.9955 683.869 20.745L682.192 19.655ZM680.166 24.1369C679.751 25.6562 679.53 27.0156 679.53 28.2H681.53C681.53 27.251 681.71 26.0772 682.095 24.6631L680.166 24.1369ZM680.53 27.2H665.73V29.2H680.53V27.2ZM666.73 28.2C666.73 25.5286 667.239 22.742 668.273 19.835L666.388 19.165C665.289 22.258 664.73 25.2714 664.73 28.2H666.73ZM668.275 19.8285C669.299 16.8835 670.869 14.1568 672.994 11.6459L671.467 10.3541C669.192 13.0432 667.495 15.9832 666.386 19.1715L668.275 19.8285ZM673.002 11.6364C675.1 9.09346 677.813 7.01227 681.164 5.40125L680.297 3.59875C676.715 5.32105 673.761 7.5732 671.459 10.3636L673.002 11.6364ZM681.164 5.40125C684.466 3.81365 688.444 2.99999 693.13 2.99999V0.999994C688.217 0.999994 683.928 1.85301 680.297 3.59875L681.164 5.40125ZM693.13 2.99999C697.861 2.99999 702.144 3.93866 705.995 5.80035L706.866 3.99965C702.717 1.99466 698.133 0.999994 693.13 0.999994V2.99999ZM706.008 5.80618C709.85 7.59929 712.908 10.1828 715.203 13.5619L716.858 12.4381C714.353 8.75053 711.011 5.93404 706.853 3.99382L706.008 5.80618ZM715.211 13.5724C717.547 16.919 718.73 20.8804 718.73 25.5H720.73C720.73 20.5196 719.447 16.1477 716.85 12.4276L715.211 13.5724ZM718.73 25.5C718.73 29.8576 717.644 33.8102 715.476 37.381L717.185 38.419C719.551 34.5231 720.73 30.2091 720.73 25.5H718.73ZM715.473 37.3855C713.337 40.9456 710.31 44.469 706.368 47.9505L707.693 49.4495C711.751 45.8644 714.924 42.1877 717.188 38.4145L715.473 37.3855ZM706.376 47.9443C702.391 51.3977 697.804 55.1536 692.614 59.2123L693.847 60.7877C699.057 56.7131 703.67 52.9356 707.685 49.4557L706.376 47.9443ZM692.59 59.2318L688.39 62.7318L689.671 64.2682L693.871 60.7682L692.59 59.2318ZM689.03 64.5H720.73V62.5H689.03V64.5ZM719.73 63.5V77H721.73V63.5H719.73ZM720.73 76H666.03V78H720.73V76ZM748.437 75L747.971 75.8849L747.977 75.8882L748.437 75ZM738.737 66.8L737.938 67.4024L737.944 67.4097L738.737 66.8ZM732.637 54.6L731.676 54.8784L731.68 54.8912L732.637 54.6ZM732.637 25.3L731.68 25.0088L731.676 25.0216L732.637 25.3ZM738.737 13.2L739.529 13.8097L739.535 13.8024L738.737 13.2ZM748.437 5L748.89 5.8913L748.896 5.88821L748.437 5ZM774.737 5L774.271 5.88492L774.28 5.88977L774.29 5.89442L774.737 5ZM784.537 13.2L783.739 13.8024L783.744 13.8097L784.537 13.2ZM790.537 25.3L789.576 25.5784L789.58 25.5912L790.537 25.3ZM790.537 54.6L789.58 54.3088L789.576 54.3216L790.537 54.6ZM784.537 66.8L785.329 67.4097L785.335 67.4024L784.537 66.8ZM774.737 75L774.277 74.1118L774.271 74.1151L774.737 75ZM772.437 58.2L771.619 57.6238L771.613 57.6329L772.437 58.2ZM772.437 21.8L771.613 22.3671L771.619 22.3762L772.437 21.8ZM750.737 21.8L749.919 21.2238L749.913 21.2329L750.737 21.8ZM750.737 58.2L749.913 58.7671L749.919 58.7762L750.737 58.2ZM761.637 77C756.842 77 752.603 76.0291 748.896 74.1118L747.977 75.8882C752.004 77.9709 756.565 79 761.637 79V77ZM748.902 74.1151C745.232 72.1835 742.11 69.5449 739.529 66.1903L737.944 67.4097C740.697 70.9884 744.041 73.8165 747.971 75.8849L748.902 74.1151ZM739.535 66.1976C736.945 62.7657 734.962 58.8063 733.593 54.3088L731.68 54.8912C733.111 59.5937 735.195 63.7677 737.939 67.4024L739.535 66.1976ZM733.597 54.3216C732.292 49.8183 731.637 45.0459 731.637 40H729.637C729.637 45.2208 730.315 50.1817 731.676 54.8784L733.597 54.3216ZM731.637 40C731.637 34.8862 732.292 30.0805 733.597 25.5784L731.676 25.0216C730.315 29.7195 729.637 34.7138 729.637 40H731.637ZM733.593 25.5912C734.962 21.0949 736.943 17.1719 739.529 13.8097L737.944 12.5903C735.197 16.1614 733.112 20.3051 731.68 25.0088L733.593 25.5912ZM739.535 13.8024C742.114 10.3855 745.231 7.75308 748.89 5.89128L747.983 4.10872C744.043 6.11358 740.693 8.94782 737.939 12.5976L739.535 13.8024ZM748.896 5.88821C752.603 3.97094 756.842 2.99999 761.637 2.99999V0.999994C756.565 0.999994 752.004 2.02905 747.977 4.11178L748.896 5.88821ZM761.637 2.99999C766.432 2.99999 770.635 3.97107 774.271 5.88492L775.202 4.11508C771.239 2.02893 766.708 0.999994 761.637 0.999994V2.99999ZM774.29 5.89442C778.015 7.75709 781.162 10.3891 783.739 13.8024L785.335 12.5976C782.578 8.94421 779.192 6.10957 775.184 4.10557L774.29 5.89442ZM783.744 13.8097C786.328 17.1684 788.274 21.0869 789.576 25.5784L791.497 25.0216C790.132 20.3131 788.079 16.165 785.329 12.5903L783.744 13.8097ZM789.58 25.5912C790.949 30.0894 791.637 34.8907 791.637 40H793.637C793.637 34.7093 792.924 29.7106 791.493 25.0088L789.58 25.5912ZM791.637 40C791.637 45.0413 790.949 49.8094 789.58 54.3088L791.493 54.8912C792.924 50.1906 793.637 45.2253 793.637 40H791.637ZM789.576 54.3216C788.274 58.8142 786.326 62.7692 783.739 66.1976L785.335 67.4024C788.081 63.7642 790.133 59.5858 791.497 54.8784L789.576 54.3216ZM783.744 66.1903C781.166 69.5414 778.013 72.1794 774.277 74.1118L775.196 75.8882C779.194 73.8206 782.574 70.9919 785.329 67.4097L783.744 66.1903ZM774.271 74.1151C770.635 76.0289 766.432 77 761.637 77V79C766.708 79 771.239 77.9711 775.202 75.8849L774.271 74.1151ZM761.637 65.3C766.41 65.3 770.3 63.0662 773.26 58.7671L771.613 57.6329C768.973 61.4671 765.663 63.3 761.637 63.3V65.3ZM773.254 58.7762C776.293 54.4653 777.737 48.1558 777.737 40H775.737C775.737 47.9776 774.314 53.8013 771.619 57.6238L773.254 58.7762ZM777.737 40C777.737 31.8442 776.293 25.5346 773.254 21.2238L771.619 22.3762C774.314 26.1987 775.737 32.0224 775.737 40H777.737ZM773.26 21.2329C770.3 16.9338 766.41 14.7 761.637 14.7V16.7C765.663 16.7 768.973 18.5329 771.613 22.3671L773.26 21.2329ZM761.637 14.7C756.865 14.7 752.945 16.9317 749.919 21.2238L751.554 22.3762C754.262 18.535 757.608 16.7 761.637 16.7V14.7ZM749.913 21.2329C746.946 25.5419 745.537 31.8475 745.537 40H747.537C747.537 32.0191 748.927 26.1914 751.56 22.3671L749.913 21.2329ZM745.537 40C745.537 48.1525 746.946 54.4581 749.913 58.7671L751.56 57.6329C748.927 53.8086 747.537 47.9809 747.537 40H745.537ZM749.919 58.7762C752.945 63.0683 756.865 65.3 761.637 65.3V63.3C757.608 63.3 754.262 61.465 751.554 57.6238L749.919 58.7762ZM818.456 75L817.99 75.8849L817.997 75.8882L818.456 75ZM808.756 66.8L807.958 67.4024L807.964 67.4097L808.756 66.8ZM802.656 54.6L801.696 54.8784L801.7 54.8912L802.656 54.6ZM802.656 25.3L801.699 25.0088L801.696 25.0216L802.656 25.3ZM808.756 13.2L809.549 13.8097L809.554 13.8024L808.756 13.2ZM818.456 5L818.91 5.8913L818.916 5.88821L818.456 5ZM844.756 5L844.291 5.88492L844.3 5.88977L844.309 5.89442L844.756 5ZM854.556 13.2L853.758 13.8024L853.764 13.8097L854.556 13.2ZM860.556 25.3L859.596 25.5784L859.6 25.5912L860.556 25.3ZM860.556 54.6L859.599 54.3088L859.596 54.3216L860.556 54.6ZM854.556 66.8L855.349 67.4097L855.354 67.4024L854.556 66.8ZM844.756 75L844.297 74.1118L844.291 74.1151L844.756 75ZM842.456 58.2L841.639 57.6238L841.633 57.6329L842.456 58.2ZM842.456 21.8L841.633 22.3671L841.639 22.3762L842.456 21.8ZM820.756 21.8L819.939 21.2238L819.933 21.2329L820.756 21.8ZM820.756 58.2L819.933 58.7671L819.939 58.7762L820.756 58.2ZM831.656 77C826.861 77 822.622 76.0291 818.916 74.1118L817.997 75.8882C822.023 77.9709 826.585 79 831.656 79V77ZM818.922 74.1151C815.252 72.1835 812.129 69.5449 809.549 66.1903L807.964 67.4097C810.716 70.9884 814.061 73.8165 817.991 75.8849L818.922 74.1151ZM809.554 66.1976C806.964 62.7657 804.982 58.8063 803.613 54.3088L801.7 54.8912C803.131 59.5937 805.215 63.7677 807.958 67.4024L809.554 66.1976ZM803.617 54.3216C802.311 49.8183 801.656 45.0459 801.656 40H799.656C799.656 45.2208 800.334 50.1817 801.696 54.8784L803.617 54.3216ZM801.656 40C801.656 34.8862 802.312 30.0805 803.617 25.5784L801.696 25.0216C800.334 29.7195 799.656 34.7138 799.656 40H801.656ZM803.613 25.5912C804.981 21.0949 806.963 17.1719 809.549 13.8097L807.964 12.5903C805.217 16.1614 803.131 20.3051 801.7 25.0088L803.613 25.5912ZM809.554 13.8024C812.133 10.3855 815.25 7.75308 818.91 5.89128L818.003 4.10872C814.062 6.11358 810.713 8.94782 807.958 12.5976L809.554 13.8024ZM818.916 5.88821C822.622 3.97094 826.861 2.99999 831.656 2.99999V0.999994C826.585 0.999994 822.023 2.02905 817.997 4.11178L818.916 5.88821ZM831.656 2.99999C836.452 2.99999 840.654 3.97107 844.291 5.88492L845.222 4.11508C841.258 2.02893 836.728 0.999994 831.656 0.999994V2.99999ZM844.309 5.89442C848.034 7.75709 851.182 10.3891 853.758 13.8024L855.354 12.5976C852.597 8.94421 849.211 6.10957 845.203 4.10557L844.309 5.89442ZM853.764 13.8097C856.347 17.1684 858.294 21.0869 859.596 25.5784L861.517 25.0216C860.152 20.3131 858.099 16.165 855.349 12.5903L853.764 13.8097ZM859.6 25.5912C860.969 30.0894 861.656 34.8907 861.656 40H863.656C863.656 34.7093 862.944 29.7106 861.513 25.0088L859.6 25.5912ZM861.656 40C861.656 45.0413 860.969 49.8094 859.6 54.3088L861.513 54.8912C862.944 50.1906 863.656 45.2253 863.656 40H861.656ZM859.596 54.3216C858.294 58.8142 856.346 62.7692 853.758 66.1976L855.354 67.4024C858.1 63.7642 860.152 59.5858 861.517 54.8784L859.596 54.3216ZM853.764 66.1903C851.186 69.5414 848.033 72.1794 844.297 74.1118L845.216 75.8882C849.213 73.8206 852.593 70.9919 855.349 67.4097L853.764 66.1903ZM844.291 74.1151C840.654 76.0289 836.452 77 831.656 77V79C836.728 79 841.258 77.9711 845.222 75.8849L844.291 74.1151ZM831.656 65.3C836.43 65.3 840.32 63.0662 843.28 58.7671L841.633 57.6329C838.993 61.4671 835.683 63.3 831.656 63.3V65.3ZM843.274 58.7762C846.312 54.4653 847.756 48.1558 847.756 40H845.756C845.756 47.9776 844.333 53.8013 841.639 57.6238L843.274 58.7762ZM847.756 40C847.756 31.8442 846.312 25.5346 843.274 21.2238L841.639 22.3762C844.333 26.1987 845.756 32.0224 845.756 40H847.756ZM843.28 21.2329C840.32 16.9338 836.43 14.7 831.656 14.7V16.7C835.683 16.7 838.993 18.5329 841.633 22.3671L843.28 21.2329ZM831.656 14.7C826.885 14.7 822.965 16.9317 819.939 21.2238L821.574 22.3762C824.281 18.535 827.628 16.7 831.656 16.7V14.7ZM819.933 21.2329C816.966 25.5419 815.556 31.8475 815.556 40H817.556C817.556 32.0191 818.947 26.1914 821.58 22.3671L819.933 21.2329ZM815.556 40C815.556 48.1525 816.966 54.4581 819.933 58.7671L821.58 57.6329C818.947 53.8086 817.556 47.9809 817.556 40H815.556ZM819.939 58.7762C822.965 63.0683 826.885 65.3 831.656 65.3V63.3C827.628 63.3 824.281 61.465 821.574 57.6238L819.939 58.7762ZM888.476 75L888.01 75.8849L888.016 75.8882L888.476 75ZM878.776 66.8L877.978 67.4024L877.983 67.4097L878.776 66.8ZM872.676 54.6L871.715 54.8784L871.719 54.8912L872.676 54.6ZM872.676 25.3L871.719 25.0088L871.715 25.0216L872.676 25.3ZM878.776 13.2L879.568 13.8097L879.574 13.8024L878.776 13.2ZM888.476 5L888.929 5.8913L888.935 5.88821L888.476 5ZM914.776 5L914.31 5.88492L914.319 5.88977L914.329 5.89442L914.776 5ZM924.576 13.2L923.778 13.8024L923.783 13.8097L924.576 13.2ZM930.576 25.3L929.615 25.5784L929.619 25.5912L930.576 25.3ZM930.576 54.6L929.619 54.3088L929.615 54.3216L930.576 54.6ZM924.576 66.8L925.368 67.4097L925.374 67.4024L924.576 66.8ZM914.776 75L914.316 74.1118L914.31 74.1151L914.776 75ZM912.476 58.2L911.658 57.6238L911.652 57.6329L912.476 58.2ZM912.476 21.8L911.652 22.3671L911.658 22.3762L912.476 21.8ZM890.776 21.8L889.958 21.2238L889.952 21.2329L890.776 21.8ZM890.776 58.2L889.952 58.7671L889.958 58.7762L890.776 58.2ZM901.676 77C896.881 77 892.642 76.0291 888.935 74.1118L888.016 75.8882C892.043 77.9709 896.604 79 901.676 79V77ZM888.942 74.1151C885.271 72.1835 882.149 69.5449 879.568 66.1903L877.983 67.4097C880.736 70.9884 884.08 73.8165 888.01 75.8849L888.942 74.1151ZM879.574 66.1976C876.984 62.7657 875.001 58.8063 873.632 54.3088L871.719 54.8912C873.15 59.5937 875.234 63.7677 877.978 67.4024L879.574 66.1976ZM873.636 54.3216C872.331 49.8183 871.676 45.0459 871.676 40H869.676C869.676 45.2208 870.354 50.1817 871.715 54.8784L873.636 54.3216ZM871.676 40C871.676 34.8862 872.331 30.0805 873.636 25.5784L871.715 25.0216C870.354 29.7195 869.676 34.7138 869.676 40H871.676ZM873.632 25.5912C875.001 21.0949 876.982 17.1719 879.568 13.8097L877.983 12.5903C875.236 16.1614 873.151 20.3051 871.719 25.0088L873.632 25.5912ZM879.574 13.8024C882.153 10.3855 885.27 7.75308 888.929 5.89128L888.022 4.10872C884.082 6.11358 880.732 8.94782 877.978 12.5976L879.574 13.8024ZM888.935 5.88821C892.642 3.97094 896.881 2.99999 901.676 2.99999V0.999994C896.604 0.999994 892.043 2.02905 888.016 4.11178L888.935 5.88821ZM901.676 2.99999C906.471 2.99999 910.674 3.97107 914.31 5.88492L915.242 4.11508C911.278 2.02893 906.747 0.999994 901.676 0.999994V2.99999ZM914.329 5.89442C918.054 7.75709 921.202 10.3891 923.778 13.8024L925.374 12.5976C922.617 8.94421 919.231 6.10957 915.223 4.10557L914.329 5.89442ZM923.783 13.8097C926.367 17.1684 928.313 21.0869 929.615 25.5784L931.536 25.0216C930.171 20.3131 928.118 16.165 925.368 12.5903L923.783 13.8097ZM929.619 25.5912C930.988 30.0894 931.676 34.8907 931.676 40H933.676C933.676 34.7093 932.963 29.7106 931.532 25.0088L929.619 25.5912ZM931.676 40C931.676 45.0413 930.989 49.8094 929.619 54.3088L931.532 54.8912C932.963 50.1906 933.676 45.2253 933.676 40H931.676ZM929.615 54.3216C928.313 58.8142 926.365 62.7692 923.778 66.1976L925.374 67.4024C928.12 63.7642 930.172 59.5858 931.536 54.8784L929.615 54.3216ZM923.783 66.1903C921.205 69.5414 918.052 72.1794 914.316 74.1118L915.235 75.8882C919.233 73.8206 922.613 70.9919 925.368 67.4097L923.783 66.1903ZM914.31 74.1151C910.674 76.0289 906.471 77 901.676 77V79C906.747 79 911.278 77.9711 915.242 75.8849L914.31 74.1151ZM901.676 65.3C906.449 65.3 910.339 63.0662 913.299 58.7671L911.652 57.6329C909.012 61.4671 905.703 63.3 901.676 63.3V65.3ZM913.293 58.7762C916.332 54.4653 917.776 48.1558 917.776 40H915.776C915.776 47.9776 914.353 53.8013 911.658 57.6238L913.293 58.7762ZM917.776 40C917.776 31.8442 916.332 25.5346 913.293 21.2238L911.658 22.3762C914.353 26.1987 915.776 32.0224 915.776 40H917.776ZM913.299 21.2329C910.339 16.9338 906.449 14.7 901.676 14.7V16.7C905.703 16.7 909.012 18.5329 911.652 22.3671L913.299 21.2329ZM901.676 14.7C896.904 14.7 892.984 16.9317 889.958 21.2238L891.593 22.3762C894.301 18.535 897.647 16.7 901.676 16.7V14.7ZM889.952 21.2329C886.985 25.5419 885.576 31.8475 885.576 40H887.576C887.576 32.0191 888.966 26.1914 891.599 22.3671L889.952 21.2329ZM885.576 40C885.576 48.1525 886.985 54.4581 889.952 58.7671L891.599 57.6329C888.966 53.8086 887.576 47.9809 887.576 40H885.576ZM889.958 58.7762C892.984 63.0683 896.904 65.3 901.676 65.3V63.3C897.647 63.3 894.301 61.465 891.593 57.6238L889.958 58.7762ZM948.295 51.8H947.295V52.8H948.295V51.8ZM948.295 39.8V38.8H947.295V39.8H948.295ZM963.295 39.8V40.8H964.295V39.8H963.295ZM963.295 24.8V23.8H962.295V24.8H963.295ZM975.295 24.8H976.295V23.8H975.295V24.8ZM975.295 39.8H974.295V40.8H975.295V39.8ZM990.295 39.8H991.295V38.8H990.295V39.8ZM990.295 51.8V52.8H991.295V51.8H990.295ZM975.295 51.8V50.8H974.295V51.8H975.295ZM975.295 66.8V67.8H976.295V66.8H975.295ZM963.295 66.8H962.295V67.8H963.295V66.8ZM963.295 51.8H964.295V50.8H963.295V51.8ZM949.295 51.8V39.8H947.295V51.8H949.295ZM948.295 40.8H963.295V38.8H948.295V40.8ZM964.295 39.8V24.8H962.295V39.8H964.295ZM963.295 25.8H975.295V23.8H963.295V25.8ZM974.295 24.8V39.8H976.295V24.8H974.295ZM975.295 40.8H990.295V38.8H975.295V40.8ZM989.295 39.8V51.8H991.295V39.8H989.295ZM990.295 50.8H975.295V52.8H990.295V50.8ZM974.295 51.8V66.8H976.295V51.8H974.295ZM975.295 65.8H963.295V67.8H975.295V65.8ZM964.295 66.8V51.8H962.295V66.8H964.295ZM963.295 50.8H948.295V52.8H963.295V50.8Z" fill="#E38E73"/>
<path d="M680.385 120.181V113.291L688.705 106.206C692.172 103.303 695.14 100.833 697.61 98.7964C700.08 96.7597 701.965 94.8531 703.265 93.0764C704.565 91.2997 705.215 89.3931 705.215 87.3564C705.215 85.7964 704.847 84.4964 704.11 83.4564C703.374 82.3731 702.42 81.5714 701.25 81.0514C700.124 80.4881 698.932 80.2064 697.675 80.2064C696.159 80.2064 694.88 80.4881 693.84 81.0514C692.844 81.6147 692.042 82.3514 691.435 83.2614C690.872 84.1281 690.46 85.0381 690.2 85.9914C689.94 86.9447 689.81 87.7681 689.81 88.4614H680.19C680.19 86.6414 680.537 84.7564 681.23 82.8064C681.924 80.8131 682.985 78.9714 684.415 77.2814C685.845 75.5481 687.687 74.1397 689.94 73.0564C692.194 71.9731 694.88 71.4314 698 71.4314C701.164 71.4314 704.045 72.0597 706.645 73.3164C709.245 74.5297 711.325 76.2847 712.885 78.5814C714.489 80.8781 715.29 83.5864 715.29 86.7064C715.29 89.6531 714.554 92.3397 713.08 94.7664C711.65 97.1497 709.635 99.4897 707.035 101.786C704.435 104.04 701.445 106.488 698.065 109.131L695.335 111.406H715.94V120.181H680.385ZM742.53 120.831C739.323 120.831 736.463 120.181 733.95 118.881C731.48 117.581 729.378 115.805 727.645 113.551C725.911 111.255 724.59 108.611 723.68 105.621C722.813 102.631 722.38 99.4681 722.38 96.1314C722.38 92.7514 722.813 89.5664 723.68 86.5764C724.59 83.5864 725.911 80.9647 727.645 78.7114C729.378 76.4147 731.48 74.6381 733.95 73.3814C736.463 72.0814 739.323 71.4314 742.53 71.4314C745.736 71.4314 748.575 72.0814 751.045 73.3814C753.558 74.6381 755.681 76.4147 757.415 78.7114C759.148 80.9647 760.448 83.5864 761.315 86.5764C762.225 89.5664 762.68 92.7514 762.68 96.1314C762.68 99.4681 762.225 102.631 761.315 105.621C760.448 108.611 759.148 111.255 757.415 113.551C755.681 115.805 753.558 117.581 751.045 118.881C748.575 120.181 745.736 120.831 742.53 120.831ZM742.53 111.926C745.39 111.926 747.73 110.605 749.55 107.961C751.413 105.318 752.345 101.375 752.345 96.1314C752.345 90.8881 751.413 86.9447 749.55 84.3014C747.73 81.6581 745.39 80.3364 742.53 80.3364C739.67 80.3364 737.308 81.6581 735.445 84.3014C733.625 86.9447 732.715 90.8881 732.715 96.1314C732.715 101.375 733.625 105.318 735.445 107.961C737.308 110.605 739.67 111.926 742.53 111.926ZM788.042 120.831C784.836 120.831 781.976 120.181 779.462 118.881C776.992 117.581 774.891 115.805 773.157 113.551C771.424 111.255 770.102 108.611 769.192 105.621C768.326 102.631 767.892 99.4681 767.892 96.1314C767.892 92.7514 768.326 89.5664 769.192 86.5764C770.102 83.5864 771.424 80.9647 773.157 78.7114C774.891 76.4147 776.992 74.6381 779.462 73.3814C781.976 72.0814 784.836 71.4314 788.042 71.4314C791.249 71.4314 794.087 72.0814 796.557 73.3814C799.071 74.6381 801.194 76.4147 802.927 78.7114C804.661 80.9647 805.961 83.5864 806.827 86.5764C807.737 89.5664 808.192 92.7514 808.192 96.1314C808.192 99.4681 807.737 102.631 806.827 105.621C805.961 108.611 804.661 111.255 802.927 113.551C801.194 115.805 799.071 117.581 796.557 118.881C794.087 120.181 791.249 120.831 788.042 120.831ZM788.042 111.926C790.902 111.926 793.242 110.605 795.062 107.961C796.926 105.318 797.857 101.375 797.857 96.1314C797.857 90.8881 796.926 86.9447 795.062 84.3014C793.242 81.6581 790.902 80.3364 788.042 80.3364C785.182 80.3364 782.821 81.6581 780.957 84.3014C779.137 86.9447 778.227 90.8881 778.227 96.1314C778.227 101.375 779.137 105.318 780.957 107.961C782.821 110.605 785.182 111.926 788.042 111.926ZM833.555 120.831C830.348 120.831 827.488 120.181 824.975 118.881C822.505 117.581 820.403 115.805 818.67 113.551C816.937 111.255 815.615 108.611 814.705 105.621C813.838 102.631 813.405 99.4681 813.405 96.1314C813.405 92.7514 813.838 89.5664 814.705 86.5764C815.615 83.5864 816.937 80.9647 818.67 78.7114C820.403 76.4147 822.505 74.6381 824.975 73.3814C827.488 72.0814 830.348 71.4314 833.555 71.4314C836.762 71.4314 839.6 72.0814 842.07 73.3814C844.583 74.6381 846.707 76.4147 848.44 78.7114C850.173 80.9647 851.473 83.5864 852.34 86.5764C853.25 89.5664 853.705 92.7514 853.705 96.1314C853.705 99.4681 853.25 102.631 852.34 105.621C851.473 108.611 850.173 111.255 848.44 113.551C846.707 115.805 844.583 117.581 842.07 118.881C839.6 120.181 836.762 120.831 833.555 120.831ZM833.555 111.926C836.415 111.926 838.755 110.605 840.575 107.961C842.438 105.318 843.37 101.375 843.37 96.1314C843.37 90.8881 842.438 86.9447 840.575 84.3014C838.755 81.6581 836.415 80.3364 833.555 80.3364C830.695 80.3364 828.333 81.6581 826.47 84.3014C824.65 86.9447 823.74 90.8881 823.74 96.1314C823.74 101.375 824.65 105.318 826.47 107.961C828.333 110.605 830.695 111.926 833.555 111.926ZM863.858 103.801V96.0014H873.608V86.2514H881.408V96.0014H891.158V103.801H881.408V113.551H873.608V103.801H863.858Z" fill="white"/>
<path d="M723.22 183V164.5H730.845C732.362 164.5 733.62 164.8 734.62 165.4C735.637 166 736.395 166.775 736.895 167.725C737.412 168.658 737.67 169.633 737.67 170.65C737.67 171.7 737.412 172.7 736.895 173.65C736.395 174.583 735.637 175.35 734.62 175.95C733.62 176.55 732.362 176.85 730.845 176.85H727.07V183H723.22ZM730.845 167.875H727.07V173.5H730.845C731.495 173.5 732.037 173.367 732.47 173.1C732.904 172.817 733.229 172.467 733.445 172.05C733.679 171.617 733.795 171.158 733.795 170.675C733.795 170.208 733.679 169.758 733.445 169.325C733.229 168.892 732.904 168.542 732.47 168.275C732.037 168.008 731.495 167.875 730.845 167.875ZM740.188 183V164.5H747.688C749.055 164.5 750.222 164.742 751.188 165.225C752.172 165.708 752.922 166.375 753.438 167.225C753.972 168.075 754.238 169.058 754.238 170.175C754.238 171.392 753.93 172.458 753.313 173.375C752.697 174.275 751.822 174.933 750.688 175.35L754.713 183H750.438L746.763 175.875H744.038V183H740.188ZM747.638 167.825H744.038V172.725H747.638C748.488 172.725 749.155 172.492 749.638 172.025C750.122 171.558 750.363 170.983 750.363 170.3C750.363 169.6 750.122 169.017 749.638 168.55C749.155 168.067 748.488 167.825 747.638 167.825ZM765.83 183.25C764.297 183.25 762.947 182.983 761.78 182.45C760.614 181.9 759.63 181.175 758.83 180.275C758.047 179.358 757.455 178.333 757.055 177.2C756.672 176.067 756.48 174.908 756.48 173.725C756.48 172.542 756.672 171.392 757.055 170.275C757.455 169.142 758.047 168.125 758.83 167.225C759.63 166.325 760.614 165.608 761.78 165.075C762.947 164.525 764.297 164.25 765.83 164.25C767.38 164.25 768.739 164.525 769.905 165.075C771.072 165.608 772.047 166.325 772.83 167.225C773.614 168.125 774.197 169.142 774.58 170.275C774.98 171.392 775.18 172.542 775.18 173.725C775.18 174.908 774.98 176.067 774.58 177.2C774.197 178.333 773.614 179.358 772.83 180.275C772.047 181.175 771.072 181.9 769.905 182.45C768.739 182.983 767.38 183.25 765.83 183.25ZM765.83 179.775C766.997 179.775 767.98 179.483 768.78 178.9C769.58 178.317 770.18 177.567 770.58 176.65C770.98 175.717 771.18 174.742 771.18 173.725C771.18 172.708 770.98 171.742 770.58 170.825C770.18 169.908 769.58 169.158 768.78 168.575C767.98 167.992 766.997 167.7 765.83 167.7C764.664 167.7 763.68 167.992 762.88 168.575C762.097 169.158 761.505 169.908 761.105 170.825C760.705 171.742 760.505 172.708 760.505 173.725C760.505 174.742 760.705 175.717 761.105 176.65C761.505 177.567 762.097 178.317 762.88 178.9C763.68 179.483 764.664 179.775 765.83 179.775ZM778.565 183.25C777.848 183.25 777.223 183.208 776.69 183.125C776.156 183.058 775.89 183.025 775.89 183.025V179.8C775.89 179.8 776.098 179.825 776.515 179.875C776.931 179.908 777.381 179.925 777.865 179.925C779.015 179.925 779.931 179.65 780.615 179.1C781.298 178.55 781.64 177.567 781.64 176.15V164.5H785.465V176.225C785.465 177.542 785.231 178.733 784.765 179.8C784.298 180.85 783.556 181.692 782.54 182.325C781.54 182.942 780.215 183.25 778.565 183.25ZM788.87 183V164.5H801.62V167.85H792.72V172H800.47V175.225H792.72V179.65H801.745V183H788.87ZM813.092 183.25C811.559 183.25 810.217 182.983 809.067 182.45C807.934 181.9 806.984 181.175 806.217 180.275C805.45 179.358 804.875 178.333 804.492 177.2C804.109 176.067 803.917 174.908 803.917 173.725C803.917 172.558 804.109 171.408 804.492 170.275C804.875 169.142 805.45 168.125 806.217 167.225C806.984 166.308 807.934 165.583 809.067 165.05C810.217 164.517 811.559 164.25 813.092 164.25C814.375 164.25 815.467 164.417 816.367 164.75C817.284 165.067 818.042 165.483 818.642 166C819.259 166.5 819.75 167.042 820.117 167.625C820.5 168.192 820.784 168.733 820.967 169.25C821.15 169.75 821.267 170.167 821.317 170.5C821.384 170.817 821.417 170.975 821.417 170.975H817.592C817.592 170.975 817.559 170.867 817.492 170.65C817.442 170.417 817.334 170.142 817.167 169.825C817 169.492 816.75 169.167 816.417 168.85C816.1 168.533 815.667 168.267 815.117 168.05C814.584 167.817 813.917 167.7 813.117 167.7C811.967 167.7 811 168 810.217 168.6C809.45 169.183 808.867 169.933 808.467 170.85C808.084 171.767 807.892 172.725 807.892 173.725C807.892 174.725 808.084 175.692 808.467 176.625C808.867 177.542 809.45 178.3 810.217 178.9C811 179.483 811.967 179.775 813.117 179.775C813.917 179.775 814.584 179.667 815.117 179.45C815.667 179.233 816.1 178.967 816.417 178.65C816.75 178.317 817 177.992 817.167 177.675C817.334 177.342 817.442 177.067 817.492 176.85C817.559 176.633 817.592 176.525 817.592 176.525H821.417C821.417 176.525 821.384 176.692 821.317 177.025C821.267 177.342 821.15 177.758 820.967 178.275C820.784 178.775 820.5 179.317 820.117 179.9C819.75 180.467 819.259 181.008 818.642 181.525C818.042 182.025 817.284 182.442 816.367 182.775C815.467 183.092 814.375 183.25 813.092 183.25ZM827.926 183V167.85H822.251V164.5H837.451V167.85H831.776V183H827.926ZM846.356 183.25C845.156 183.25 844.131 183.108 843.281 182.825C842.447 182.525 841.747 182.15 841.181 181.7C840.631 181.233 840.189 180.75 839.856 180.25C839.522 179.733 839.272 179.25 839.106 178.8C838.956 178.333 838.856 177.958 838.806 177.675C838.772 177.375 838.756 177.225 838.756 177.225H842.656C842.656 177.225 842.689 177.367 842.756 177.65C842.839 177.933 843.006 178.267 843.256 178.65C843.506 179.017 843.889 179.342 844.406 179.625C844.922 179.892 845.622 180.025 846.506 180.025C847.589 180.025 848.389 179.8 848.906 179.35C849.422 178.883 849.681 178.333 849.681 177.7C849.681 177.133 849.481 176.683 849.081 176.35C848.697 176.017 848.097 175.767 847.281 175.6L844.806 175.125C843.806 174.942 842.872 174.65 842.006 174.25C841.156 173.85 840.464 173.3 839.931 172.6C839.397 171.883 839.131 170.967 839.131 169.85C839.131 168.717 839.414 167.733 839.981 166.9C840.547 166.05 841.339 165.4 842.356 164.95C843.389 164.483 844.597 164.25 845.981 164.25C847.281 164.25 848.356 164.442 849.206 164.825C850.072 165.192 850.756 165.65 851.256 166.2C851.772 166.733 852.147 167.275 852.381 167.825C852.631 168.375 852.789 168.833 852.856 169.2C852.939 169.567 852.981 169.75 852.981 169.75H849.181C849.181 169.75 849.147 169.633 849.081 169.4C849.031 169.167 848.897 168.9 848.681 168.6C848.464 168.3 848.131 168.033 847.681 167.8C847.247 167.567 846.647 167.45 845.881 167.45C844.831 167.45 844.072 167.683 843.606 168.15C843.139 168.6 842.906 169.092 842.906 169.625C842.906 170.175 843.139 170.6 843.606 170.9C844.072 171.2 844.681 171.425 845.431 171.575L848.056 172.1C849.056 172.283 849.972 172.592 850.806 173.025C851.639 173.458 852.297 174.042 852.781 174.775C853.281 175.492 853.531 176.383 853.531 177.45C853.531 178.55 853.256 179.542 852.706 180.425C852.156 181.292 851.347 181.983 850.281 182.5C849.214 183 847.906 183.25 846.356 183.25Z" fill="white"/>
</g>
<defs>
<clipPath id="clip0_413_99">
<rect width="995" height="188" fill="white"/>
</clipPath>
</defs>
</svg>
