[35m[1mScanning dependencies of target srrg2_navigation_2d_library[0m
[  9%] [32mBuilding CXX object src/srrg2_navigation_2d/CMakeFiles/srrg2_navigation_2d_library.dir/localizer_2d.cpp.o[0m
[ 18%] [32mBuilding CXX object src/srrg2_navigation_2d/CMakeFiles/srrg2_navigation_2d_library.dir/navigation_2d_base.cpp.o[0m
[ 27%] [32mBuilding CXX object src/srrg2_navigation_2d/CMakeFiles/srrg2_navigation_2d_library.dir/planner_2d_utils.cpp.o[0m
[ 36%] [32mBuilding CXX object src/srrg2_navigation_2d/CMakeFiles/srrg2_navigation_2d_library.dir/planner_2d_dmap.cpp.o[0m
[ 45%] [32mBuilding CXX object src/srrg2_navigation_2d/CMakeFiles/srrg2_navigation_2d_library.dir/planner_2d_search.cpp.o[0m
[ 54%] [32mBuilding CXX object src/srrg2_navigation_2d/CMakeFiles/srrg2_navigation_2d_library.dir/planner_2d_path.cpp.o[0m
[ 63%] [32mBuilding CXX object src/srrg2_navigation_2d/CMakeFiles/srrg2_navigation_2d_library.dir/planner_2d.cpp.o[0m
[ 72%] [32mBuilding CXX object src/srrg2_navigation_2d/CMakeFiles/srrg2_navigation_2d_library.dir/instances.cpp.o[0m
[ 81%] [32mBuilding CXX object src/srrg2_navigation_2d/CMakeFiles/srrg2_navigation_2d_library.dir/obstacle_avoidance_base.cpp.o[0m
[ 90%] [32mBuilding CXX object src/srrg2_navigation_2d/CMakeFiles/srrg2_navigation_2d_library.dir/local_path_planner.cpp.o[0m
[100%] [32m[1mLinking CXX shared library /home/alessiohu/Desktop/progetto-labiagi/catkin_ws/devel/.private/srrg2_navigation_2d/lib/libsrrg2_navigation_2d_library.so[0m
[100%] Built target srrg2_navigation_2d_library
