Symlinking /home/alessiohu/Desktop/progetto-labiagi/catkin_ws/devel/./local_setup.zsh
Symlinking /home/alessiohu/Desktop/progetto-labiagi/catkin_ws/devel/./env.sh
Symlinking /home/alessiohu/Desktop/progetto-labiagi/catkin_ws/devel/./local_setup.sh
Symlinking /home/alessiohu/Desktop/progetto-labiagi/catkin_ws/devel/./cmake.lock
Symlinking /home/alessiohu/Desktop/progetto-labiagi/catkin_ws/devel/./setup.zsh
Symlinking /home/alessiohu/Desktop/progetto-labiagi/catkin_ws/devel/./_setup_util.py
Symlinking /home/alessiohu/Desktop/progetto-labiagi/catkin_ws/devel/./setup.bash
Symlinking /home/alessiohu/Desktop/progetto-labiagi/catkin_ws/devel/./local_setup.bash
Symlinking /home/alessiohu/Desktop/progetto-labiagi/catkin_ws/devel/./setup.sh
Symlinking /home/alessiohu/Desktop/progetto-labiagi/catkin_ws/devel/share/catkin_tools_prebuild/cmake/catkin_tools_prebuildConfig-version.cmake
Symlinking /home/alessiohu/Desktop/progetto-labiagi/catkin_ws/devel/share/catkin_tools_prebuild/cmake/catkin_tools_prebuildConfig.cmake
Symlinking /home/alessiohu/Desktop/progetto-labiagi/catkin_ws/devel/lib/pkgconfig/catkin_tools_prebuild.pc
