[35m[1mScanning dependencies of target srrg2_solver_extras_types2d_library[0m
[  6%] [32mBuilding CXX object src/srrg_solver_extras/types_2d_ad/CMakeFiles/srrg2_solver_extras_types2d_library.dir/instances.cpp.o[0m
[ 13%] [32mBuilding CXX object src/srrg_solver_extras/types_2d_ad/CMakeFiles/srrg2_solver_extras_types2d_library.dir/se2_point2point_left_error_factor_ad.cpp.o[0m
[ 20%] [32mBuilding CXX object src/srrg_solver_extras/types_2d_ad/CMakeFiles/srrg2_solver_extras_types2d_library.dir/se2_pose_point_bearing_left_error_factor_ad.cpp.o[0m
[35m[1mScanning dependencies of target srrg2_solver_extras_types3d_library[0m
[ 26%] [32mBuilding CXX object src/srrg_solver_extras/types_3d_ad/CMakeFiles/srrg2_solver_extras_types3d_library.dir/instances.cpp.o[0m
[ 33%] [32mBuilding CXX object src/srrg_solver_extras/types_3d_ad/CMakeFiles/srrg2_solver_extras_types3d_library.dir/se3_point2point_euler_error_factor_ad.cpp.o[0m
[ 40%] [32mBuilding CXX object src/srrg_solver_extras/types_3d_ad/CMakeFiles/srrg2_solver_extras_types3d_library.dir/se3_pose_point_euler_error_factor_ad.cpp.o[0m
[ 46%] [32mBuilding CXX object src/srrg_solver_extras/types_2d_ad/CMakeFiles/srrg2_solver_extras_types2d_library.dir/se2_pose_point_left_error_factor_ad.cpp.o[0m
[ 53%] [32mBuilding CXX object src/srrg_solver_extras/types_2d_ad/CMakeFiles/srrg2_solver_extras_types2d_library.dir/se2_pose_pose_left_error_factor_ad.cpp.o[0m
[ 60%] [32mBuilding CXX object src/srrg_solver_extras/types_3d_ad/CMakeFiles/srrg2_solver_extras_types3d_library.dir/se3_pose_point_offset_euler_error_factor_ad.cpp.o[0m
[ 66%] [32mBuilding CXX object src/srrg_solver_extras/types_3d_ad/CMakeFiles/srrg2_solver_extras_types3d_library.dir/se3_pose_pose_chordal_quaternion_error_factor_ad.cpp.o[0m
[ 73%] [32mBuilding CXX object src/srrg_solver_extras/types_3d_ad/CMakeFiles/srrg2_solver_extras_types3d_library.dir/se3_pose_pose_error_factor_ad.cpp.o[0m
[ 80%] [32m[1mLinking CXX shared library /home/alessiohu/Desktop/progetto-labiagi/catkin_ws/devel/.private/srrg2_solver_extras/lib/libsrrg2_solver_extras_types2d_library.so[0m
[ 80%] Built target srrg2_solver_extras_types2d_library
[ 86%] [32mBuilding CXX object src/srrg_solver_extras/types_3d_ad/CMakeFiles/srrg2_solver_extras_types3d_library.dir/se3_pose_pose_euler_error_factor_ad.cpp.o[0m
[ 93%] [32mBuilding CXX object src/srrg_solver_extras/types_3d_ad/CMakeFiles/srrg2_solver_extras_types3d_library.dir/se3_prior_euler_error_factor_ad.cpp.o[0m
[100%] [32m[1mLinking CXX shared library /home/alessiohu/Desktop/progetto-labiagi/catkin_ws/devel/.private/srrg2_solver_extras/lib/libsrrg2_solver_extras_types3d_library.so[0m
[100%] Built target srrg2_solver_extras_types3d_library
