[  0%] Built target geometry_msgs_generate_messages_eus
[  0%] Built target _srrg2_navigation_2d_msgs_generate_messages_check_deps_PathFollowerStatus
[  0%] Built target std_msgs_generate_messages_eus
[  0%] Built target geometry_msgs_generate_messages_nodejs
[  0%] Built target _srrg2_navigation_2d_msgs_generate_messages_check_deps_CollisionAvoiderStatus
[  0%] Built target geometry_msgs_generate_messages_lisp
[  0%] Built target std_msgs_generate_messages_nodejs
[  0%] Built target _srrg2_navigation_2d_msgs_generate_messages_check_deps_LocalPathPlannerStatus
[  0%] Built target std_msgs_generate_messages_lisp
[  0%] Built target geometry_msgs_generate_messages_cpp
[  0%] Built target std_msgs_generate_messages_cpp
[  0%] Built target geometry_msgs_generate_messages_py
[  0%] Built target std_msgs_generate_messages_py
[ 23%] Built target srrg2_navigation_2d_msgs_generate_messages_eus
[ 41%] Built target srrg2_navigation_2d_msgs_generate_messages_nodejs
[ 58%] Built target srrg2_navigation_2d_msgs_generate_messages_lisp
[ 76%] Built target srrg2_navigation_2d_msgs_generate_messages_cpp
[100%] Built target srrg2_navigation_2d_msgs_generate_messages_py
[100%] Built target srrg2_navigation_2d_msgs_generate_messages
