Linked: (/home/alessiohu/Desktop/progetto-labiagi/catkin_ws/devel/.private/srrg2_slam_interfaces/share/srrg2_slam_interfaces/cmake/srrg2_slam_interfacesConfig-version.cmake, /home/alessiohu/Desktop/progetto-labiagi/catkin_ws/devel/share/srrg2_slam_interfaces/cmake/srrg2_slam_interfacesConfig-version.cmake)
Linked: (/home/alessiohu/Desktop/progetto-labiagi/catkin_ws/devel/.private/srrg2_slam_interfaces/share/srrg2_slam_interfaces/cmake/srrg2_slam_interfacesConfig.cmake, /home/alessiohu/Desktop/progetto-labiagi/catkin_ws/devel/share/srrg2_slam_interfaces/cmake/srrg2_slam_interfacesConfig.cmake)
Linked: (/home/alessiohu/Desktop/progetto-labiagi/catkin_ws/devel/.private/srrg2_slam_interfaces/lib/libsrrg2_slam_interfaces_library.so, /home/alessiohu/Desktop/progetto-labiagi/catkin_ws/devel/lib/libsrrg2_slam_interfaces_library.so)
Linked: (/home/alessiohu/Desktop/progetto-labiagi/catkin_ws/devel/.private/srrg2_slam_interfaces/lib/pkgconfig/srrg2_slam_interfaces.pc, /home/alessiohu/Desktop/progetto-labiagi/catkin_ws/devel/lib/pkgconfig/srrg2_slam_interfaces.pc)
Linked: (/home/alessiohu/Desktop/progetto-labiagi/catkin_ws/devel/.private/srrg2_slam_interfaces/lib/srrg2_slam_interfaces/app_benchmark, /home/alessiohu/Desktop/progetto-labiagi/catkin_ws/devel/lib/srrg2_slam_interfaces/app_benchmark)
