Symlinking /home/alessiohu/Desktop/progetto-labiagi/catkin_ws/devel/share/srrg2_solver_calib_addons/cmake/srrg2_solver_calib_addonsConfig-version.cmake
Symlinking /home/alessiohu/Desktop/progetto-labiagi/catkin_ws/devel/share/srrg2_solver_calib_addons/cmake/srrg2_solver_calib_addonsConfig.cmake
Symlinking /home/alessiohu/Desktop/progetto-labiagi/catkin_ws/devel/lib/libsrrg2_solver_calib_utils_library.so
Symlinking /home/alessiohu/Desktop/progetto-labiagi/catkin_ws/devel/lib/pkgconfig/srrg2_solver_calib_addons.pc
