test/template/context/LocalContext.class
test/template/utils/TestngRetry.class
test/template/common/Environment.class
test/template/utils/SftpUtils.class
test/template/utils/SeleniumUtils.class
test/template/utils/SeleniumWaitUtils$1.class
test/template/utils/EncryptUtils.class
test/template/utils/SendEmailReporter.class
test/template/utils/ClassPathResource.class
test/template/utils/FileUtils.class
test/template/utils/HttpUtils$2.class
test/template/utils/TestngRetryOnce.class
test/template/utils/DBRestoreUtils.class
test/template/dataObjects/AccountInfo.class
test/template/testCases/register/RegisterAccount.class
test/template/testCases/base/BaseWebTestCase.class
test/template/context/GlobalContext.class
test/template/utils/MTLogAppender.class
test/template/context/LocalContext$1.class
test/template/utils/SeleniumWaitUtils.class
test/template/utils/MTLogBuffer.class
test/template/utils/DBUtils.class
test/template/pageObject/RegisterPageObject.class
test/template/common/BasePage.class
test/template/testCases/base/BaseTestCase.class
test/template/utils/TakeScreenshotOnFailureListener.class
test/template/utils/SeleniumUtils$1.class
test/template/utils/DownloadUtils.class
test/template/utils/HttpUtils.class
test/template/utils/MTLogBuffer$1.class
test/template/common/Config.class
test/template/utils/HtmlReporter.class
test/template/utils/HttpSession$1.class
test/template/pageObject/StoreFront.class
test/template/utils/HttpSession.class
test/template/utils/HttpUtils$1.class
