<?xml version="1.0" encoding="UTF-8"?>
<testng-results ignored="0" total="4" passed="4" failed="0" skipped="0">
  <reporter-output>
  </reporter-output>
  <suite started-at="2022-03-17T00:05:04 ICT" name="Register Suite" finished-at="2022-03-17T00:05:17 ICT" duration-ms="12947">
    <groups>
    </groups>
    <test started-at="2022-03-17T00:05:04 ICT" name="Test" finished-at="2022-03-17T00:05:17 ICT" duration-ms="12947">
      <class name="test.template.testCases.register.RegisterAccount">
        <test-method is-config="true" signature="setupEnvironment(java.lang.String)[pri:0, instance:test.template.testCases.register.RegisterAccount@4e08711f]" started-at="2022-03-17T00:05:04 ICT" name="setupEnvironment" finished-at="2022-03-17T00:05:04 ICT" duration-ms="14" status="PASS">
          <params>
            <param index="0">
              <value is-null="true"/>
            </param>
          </params>
          <reporter-output>
          </reporter-output>
        </test-method> <!-- setupEnvironment -->
        <test-method is-config="true" signature="setupDriver(java.lang.String, java.lang.String)[pri:0, instance:test.template.testCases.register.RegisterAccount@4e08711f]" started-at="2022-03-17T00:05:04 ICT" name="setupDriver" finished-at="2022-03-17T00:05:07 ICT" depends-on-methods="test.template.testCases.base.BaseTestCase.setupEnvironment" duration-ms="3216" status="PASS">
          <params>
            <param index="0">
              <value is-null="true"/>
            </param>
            <param index="1">
              <value is-null="true"/>
            </param>
          </params>
          <reporter-output>
          </reporter-output>
        </test-method> <!-- setupDriver -->
        <test-method is-config="true" signature="beforeMethod()[pri:0, instance:test.template.testCases.register.RegisterAccount@4e08711f]" started-at="2022-03-17T00:05:07 ICT" name="beforeMethod" finished-at="2022-03-17T00:05:09 ICT" depends-on-methods="test.template.testCases.base.BaseWebTestCase.setupDriver, test.template.testCases.base.BaseTestCase.setupEnvironment" duration-ms="2005" status="PASS">
          <reporter-output>
          </reporter-output>
        </test-method> <!-- beforeMethod -->
        <test-method is-config="true" signature="loadTestData()[pri:0, instance:test.template.testCases.register.RegisterAccount@4e08711f]" started-at="2022-03-17T00:05:09 ICT" name="loadTestData" finished-at="2022-03-17T00:05:09 ICT" duration-ms="2" status="PASS">
          <reporter-output>
          </reporter-output>
        </test-method> <!-- loadTestData -->
        <test-method signature="a()[pri:1, instance:test.template.testCases.register.RegisterAccount@4e08711f]" started-at="2022-03-17T00:05:09 ICT" name="a" finished-at="2022-03-17T00:05:10 ICT" duration-ms="501" status="PASS">
          <reporter-output>
          </reporter-output>
        </test-method> <!-- a -->
        <test-method signature="b()[pri:2, instance:test.template.testCases.register.RegisterAccount@4e08711f]" started-at="2022-03-17T00:05:11 ICT" name="b" finished-at="2022-03-17T00:05:12 ICT" duration-ms="1354" status="PASS">
          <reporter-output>
          </reporter-output>
        </test-method> <!-- b -->
        <test-method signature="c()[pri:3, instance:test.template.testCases.register.RegisterAccount@4e08711f]" started-at="2022-03-17T00:05:13 ICT" name="c" finished-at="2022-03-17T00:05:14 ICT" duration-ms="1376" status="PASS">
          <reporter-output>
          </reporter-output>
        </test-method> <!-- c -->
        <test-method signature="d()[pri:4, instance:test.template.testCases.register.RegisterAccount@4e08711f]" started-at="2022-03-17T00:05:15 ICT" name="d" finished-at="2022-03-17T00:05:16 ICT" duration-ms="1281" status="PASS">
          <reporter-output>
          </reporter-output>
        </test-method> <!-- d -->
        <test-method is-config="true" signature="tearDown()[pri:0, instance:test.template.testCases.register.RegisterAccount@4e08711f]" started-at="2022-03-17T00:05:17 ICT" name="tearDown" finished-at="2022-03-17T00:05:17 ICT" duration-ms="179" status="PASS">
          <reporter-output>
          </reporter-output>
        </test-method> <!-- tearDown -->
      </class> <!-- test.template.testCases.register.RegisterAccount -->
    </test> <!-- Test -->
  </suite> <!-- Register Suite -->
</testng-results>
