name,firstname,age,city,zip
Smith,John,17,New York,10001
Smith,John,17,New York,10001
Johnson,Emily,35,Los Angeles,90001
Williams,James,42,Chicago,60601
Jones,Sarah,24,Houston,77001
Brown,Michael,56,Philadelphia,19019
Davis,Ashley,19,Phoenix,85001
Miller,David,31,San Antonio,78201
Wilson,Samantha,27,San Diego,92101
Moore,Christopher,48,Dallas,75201
Taylor,Elizabeth,29,San Jose,95101
Anderson,Kevin,33,Austin,73301
Thomas,Melissa,25,Jacksonville,32099
Jackson,Matthew,40,Indianapolis,46201
White,Amanda,22,San Francisco,94101
Harris,Benjamin,37,Columbus,43085
Martin,Nicole,26,Fort Worth,76101
Thompson,Daniel,44,Charlotte,28201
Garcia,Laura,21,Seattle,98101
Martinez,William,39,Denver,80201
Robinson,Taylor,30,Washington,20001