{
  "commitMessage": "{{hostname}}: Obsidian Vault Backup: {{date}}",
  "autoCommitMessage": "{{hostname}}: Auto Vault Backup: {{date}}",
  "commitDateFormat": "YY-MM-DD HH:mm:ss",
  "autoSaveInterval": 60,
  "autoPushInterval": 0,
  "autoPullInterval": 60,
  "autoPullOnBoot": true,
  "disablePush": false,
  "pullBeforePush": true,
  "disablePopups": false,
  "listChangedFilesInMessageBody": false,
  "showStatusBar": true,
  "updateSubmodules": false,
  "syncMethod": "merge",
  "customMessageOnAutoBackup": true,
  "autoBackupAfterFileChange": true,
  "treeStructure": false,
  "refreshSourceControl": true,
  "basePath": "",
  "differentIntervalCommitAndPush": false,
  "changedFilesInStatusBar": true,
  "showedMobileNotice": true,
  "refreshSourceControlTimer": 7000,
  "showBranchStatusBar": true
}