\relax 
\providecommand\babel@aux[2]{}
\@nameuse{bbl@beforestart}
\providecommand\hyper@newdestlabel[2]{}
\providecommand\HyperFirstAtBeginDocument{\AtBeginDocument}
\HyperFirstAtBeginDocument{\ifx\hyper@anchor\@undefined
\global\let\oldnewlabel\newlabel
\gdef\newlabel#1#2{\newlabelxx{#1}#2}
\gdef\newlabelxx#1#2#3#4#5#6{\oldnewlabel{#1}{{#2}{#3}}}
\AtEndDocument{\ifx\hyper@anchor\@undefined
\let\newlabel\oldnewlabel
\fi}
\fi}
\global\let\hyper@last\relax 
\gdef\HyperFirstAtBeginDocument#1{#1}
\providecommand\HyField@AuxAddToFields[1]{}
\providecommand\HyField@AuxAddToCoFields[2]{}
\babel@aux{english}{}
\@writefile{toc}{\contentsline {section}{Education}{1}{section*.1}\protected@file@percent }
\@writefile{toc}{\contentsline {section}{Master thesis}{1}{section*.2}\protected@file@percent }
\@writefile{toc}{\contentsline {section}{Experience}{1}{section*.3}\protected@file@percent }
\@writefile{toc}{\contentsline {subsection}{Vocational}{1}{section*.4}\protected@file@percent }
\@writefile{toc}{\contentsline {subsection}{Miscellaneous}{1}{section*.5}\protected@file@percent }
\@writefile{toc}{\contentsline {section}{Languages}{1}{section*.6}\protected@file@percent }
\@writefile{toc}{\contentsline {section}{Computer skills}{1}{section*.7}\protected@file@percent }
\@writefile{toc}{\contentsline {section}{Interests}{1}{section*.8}\protected@file@percent }
\@writefile{toc}{\contentsline {section}{Extra 1}{1}{section*.9}\protected@file@percent }
\@writefile{toc}{\contentsline {section}{Extra 2}{2}{section*.10}\protected@file@percent }
\@writefile{toc}{\contentsline {section}{References}{2}{section*.11}\protected@file@percent }
\gdef \@abspage@last{2}
