<?xml version="1.0" encoding="UTF-8" standalone="no"?>
<!DOCTYPE svg PUBLIC "-//W3C//DTD SVG 1.1//EN" "http://www.w3.org/Graphics/SVG/1.1/DTD/svg11.dtd">
<svg width="100%" height="100%" viewBox="0 0 90 23" version="1.1" xmlns="http://www.w3.org/2000/svg" xmlns:xlink="http://www.w3.org/1999/xlink" xml:space="preserve" xmlns:serif="http://www.serif.com/" style="fill-rule:evenodd;clip-rule:evenodd;stroke-linejoin:round;stroke-miterlimit:2;">
    <g transform="matrix(0.0521306,0,0,0.0492808,-5.44887,-1.87373)">
        <g>
            <path id="Shape-3-copy" serif:id="Shape 3 copy" d="M1726.27,496.999L1706.9,461.624C1757.41,413.701 1788.94,345.774 1788.94,270.432C1788.94,192.274 1755,122.098 1701.15,73.953L1719.51,38.022C1785.79,93.438 1828,176.975 1828,270.432C1828,360.664 1788.65,441.641 1726.27,496.999ZM1761.9,270.432C1761.9,335.444 1735.72,394.305 1693.38,436.94L1677.97,408.814C1711.17,372.345 1731.44,323.77 1731.44,270.432C1731.44,214.877 1709.45,164.493 1673.76,127.57L1688.35,99.018C1733.63,141.984 1761.9,202.885 1761.9,270.432ZM1661.08,377.962L1645.29,349.146C1660.23,326.606 1668.94,299.547 1668.94,270.432C1668.94,239.755 1659.25,211.372 1642.82,188.143L1657.77,158.878C1683.24,188.914 1698.63,227.864 1698.63,270.432C1698.63,311.123 1684.57,348.508 1661.08,377.962ZM1601.07,268.894C1601.07,268.894 1611.24,251.711 1620.41,230.079C1626.62,241.487 1630.19,254.939 1630.19,270.435C1630.19,283.725 1627.69,296.428 1623.14,308.094C1608.88,283.999 1601.07,268.894 1601.07,268.894Z" style="fill:rgb(77,94,135);"/>
            <path id="CAST" d="M1006.98,161.596C996.609,154.479 985.73,149.167 974.336,145.659C962.941,142.154 950.982,140.398 938.459,140.398C922.65,140.398 907.611,143.365 893.344,149.295C879.075,155.228 866.499,163.762 855.62,174.903C844.842,186.043 836.628,198.886 830.984,213.43C825.337,227.975 822.515,243.552 822.515,260.158C822.515,279.449 826.338,297.269 833.986,313.617C841.632,329.968 852.641,343.816 867.014,355.162C877.177,363.208 888.287,369.295 900.35,373.42C912.411,377.544 925.01,379.609 938.151,379.609C950.366,379.609 962.145,377.907 973.489,374.503C984.83,371.099 995.277,366.147 1004.82,359.649L1008.21,300.078C997.021,309.57 985.807,316.687 974.567,321.431C963.326,326.177 952.06,328.548 940.769,328.548C921.676,328.548 906.175,322.18 894.268,309.439C882.359,296.701 876.407,280.068 876.407,259.539C876.407,239.014 882.412,222.199 894.422,209.098C906.432,195.999 921.88,189.447 940.769,189.447C951.648,189.447 962.042,191.872 971.949,196.72C981.854,201.569 991.632,208.996 1001.28,219L1006.98,161.596ZM1270.59,368.778C1282.29,372.491 1293.01,375.223 1302.77,376.978C1312.52,378.731 1321.55,379.609 1329.87,379.609C1354.4,379.609 1374.08,372.878 1388.92,359.417C1403.75,345.955 1411.17,328.292 1411.17,306.422C1411.17,292.291 1407.39,280.068 1399.85,269.751C1392.3,259.438 1377.6,248.193 1355.74,236.021L1329.56,221.476C1324.42,218.691 1320.58,215.596 1318.01,212.192C1315.44,208.788 1314.16,205.128 1314.16,201.207C1314.16,195.636 1316.32,191.227 1320.63,187.977C1324.94,184.728 1330.84,183.103 1338.34,183.103C1345.11,183.103 1353.32,184.96 1362.97,188.674C1372.62,192.387 1382.84,197.648 1393.61,204.456L1393.61,151.848C1382.32,147.929 1372.06,145.04 1362.82,143.183C1353.58,141.327 1345.01,140.398 1337.1,140.398C1315.65,140.398 1298.15,146.176 1284.6,157.728C1271.05,169.282 1264.27,184.085 1264.27,202.135C1264.27,215.442 1267.82,227.356 1274.9,237.877C1281.98,248.399 1292.86,257.837 1307.54,266.193L1322.63,274.703C1324.38,275.735 1326.84,277.178 1330.02,279.035C1349.93,290.485 1359.89,300.801 1359.89,309.981C1359.89,316.378 1357.09,321.612 1351.5,325.686C1345.9,329.762 1338.49,331.798 1329.25,331.798C1320.11,331.798 1310.75,330.096 1301.15,326.692C1291.55,323.288 1279.88,317.357 1266.12,308.898L1270.59,368.778ZM1548.67,372.337L1548.67,194.863L1619.34,194.863L1619.34,147.98L1424.41,147.98L1424.41,194.863L1495.39,194.863L1495.39,372.337L1548.67,372.337ZM1073.03,372.337L1087.51,339.689L1178.05,339.689L1192.21,372.337L1247.95,372.337L1136.63,141.017L1133.24,141.017L1019.45,372.337L1073.03,372.337ZM1132.62,230.76L1161.57,301.007L1102.91,301.007L1132.62,230.76Z" style="fill:rgb(77,94,135);"/>
            <path id="MAX" d="M539.353,372.337L652.987,372.337L704.415,296.21L758.615,372.337L824.209,372.337L736.288,251.648L808.195,147.98L750.146,147.98L706.879,212.038L660.84,147.98L595.708,147.98L674.852,256.29L594.902,371.943L483.767,141.017L480.38,141.017L368.339,368.783L322.4,140.708L318.397,140.708L238.945,286.772L154.72,140.708L150.87,140.708L104.524,372.337L152.102,372.337L171.657,268.359L236.019,380.537L239.561,380.537L299.458,269.906L318.397,372.337L420.175,372.337L434.649,339.689L525.187,339.689L539.353,372.337ZM479.764,230.76L508.711,301.007L450.046,301.007L479.764,230.76Z" style="fill:rgb(77,94,135);"/>
        </g>
    </g>
</svg>
