<?xml version="1.0" encoding="UTF-8" standalone="no"?>
<!DOCTYPE svg PUBLIC "-//W3C//DTD SVG 1.1//EN" "http://www.w3.org/Graphics/SVG/1.1/DTD/svg11.dtd">
<svg width="100%" height="100%" viewBox="0 0 150 110" version="1.1" xmlns="http://www.w3.org/2000/svg" xmlns:xlink="http://www.w3.org/1999/xlink" xml:space="preserve" xmlns:serif="http://www.serif.com/" style="fill-rule:evenodd;clip-rule:evenodd;stroke-linejoin:round;stroke-miterlimit:2;">
    <g>
        <path d="M52.8,51.8C52.8,51.8 43.3,42 45,36L40.7,33.9L56.5,16.9L68,26.5L58.3,36.5L57.6,43.3L60.8,48.7L52.8,51.7L52.8,51.8Z" style="fill:rgb(75,41,221);"/>
        <path d="M72.8,13C73.1,12.6 73.1,12.1 72.8,11.9L67.3,6.7C67.009,6.467 66.591,6.467 66.3,6.7L65.2,7.7C64.9,8.1 64.9,8.6 65.2,8.8L70.7,14C71,14.3 71.5,14.3 71.7,14L72.7,13L72.8,13Z" style="fill:rgb(109,80,235);"/>
        <path d="M53.7,41.7C53.525,41.381 53.188,41.182 52.824,41.182C52.597,41.182 52.377,41.259 52.2,41.4L50.5,42.8C50.181,42.975 49.982,43.312 49.982,43.676C49.982,43.903 50.059,44.123 50.2,44.3L56,51.9C56.4,52.4 57,52.5 57.5,52.1L59.3,50.8C59.7,50.4 59.8,49.8 59.5,49.3L53.7,41.7ZM58.1,37.7C58.1,37.7 55.8,38.4 56.1,40.1C56.3,41.8 60.4,48 60.4,48L63.4,45.3L58.1,37.7Z" style="fill:rgb(109,80,235);"/>
        <path d="M52.8,89.5C52.8,89.5 43.7,98.5 42.6,103C41.6,107.4 41.9,110 41.9,110L44.9,110C44.9,110 44.5,106.5 45.9,103.2C47.8,98.6 55,91.4 55,91.4L52.8,89.4L52.8,89.5Z" style="fill:rgb(109,80,235);"/>
        <path d="M50.2,64C50.2,64 51.2,59.3 50,58.2C49,57.1 47.7,57.2 47.7,54L47.9,45.6C47.9,45.6 52,51.7 52.9,50.3L60,37.1C61.2,34.6 63.9,35.1 62.2,38.7C61.5,40.1 60.2,43.4 59.5,45.1C62.3,42.1 64.1,44.4 62.8,46.9C64.9,45.2 66.4,45.9 65.2,48.9C67.2,47.8 68.1,49.9 66.7,51.8C65.7,53.1 58.4,64.2 58.4,64.2L50.1,64L50.2,64Z" style="fill:white;stroke:rgb(75,41,221);stroke-width:1px;"/>
        <rect x="47.7" y="63.2" width="13" height="47.1" style="fill:rgb(75,41,221);"/>
        <path d="M85,16.5L85,18.8C85,18.8 74.3,19 74.3,30.1C74.3,41.1 74.1,51.2 74.1,51.2C74.1,51.2 73.4,55.5 78.4,55.5L102.4,55.5L102.4,24.6C102.2,19.1 94,18.7 94,18.7L94,17L85,16.6L85,16.5ZM92,22.6C92,24.9 91.7,28.5 93.8,30.3C96.5,32.7 98,33 98,33C98,33 98.6,24.7 97.9,22.8C97.1,20.8 92,20.6 92,22.8L92,22.6Z" style="fill:rgb(161,139,255);"/>
        <path d="M83,14.8L85,14.8L85,8.1L94,8.1L94,14.6L96,14.6L96,17L83,17L83,14.8Z" style="fill:rgb(75,41,221);"/>
        <path d="M78,51.8L100.4,51.8L100.4,37.4C100.4,37.4 96.2,36.8 93.4,35.4C88,32.4 91.3,21.3 84.8,21.4C79.8,21.4 78,24.7 78,29.2L78,51.8Z" style="fill:rgb(75,41,221);fill-opacity:0.6;"/>
        <path d="M107,34.8C107,34.8 106.4,32.2 107.4,31.5C108.4,30.7 109.7,32.4 110,27.7C110.5,19.7 109.6,15.7 106.7,18.3C107.2,15.9 104.1,15.1 103.7,17.9C103.4,15.1 100.9,14.7 99.7,17.1C99.4,10.5 96,11.1 96.3,17.5L96.3,24.4C96.3,25.1 95.5,25.7 94.3,24.9C93.525,24.413 93.251,23.913 92.492,23.4L92.492,27.3L98,31.7L98,35L107,35L107,34.8Z" style="fill:white;stroke:rgb(75,41,221);stroke-width:1px;"/>
        <path d="M63.2,49.5L37.6,91.8L52.7,96.7L74.5,60.7L63.2,49.5Z" style="fill:white;"/>
        <path d="M63.2,49.5L37.6,91.8L52.7,96.7L74.5,60.7L63.2,49.5ZM63.398,51.104L73.237,60.856C73.237,60.856 52.255,95.504 52.255,95.504C52.255,95.504 39.109,91.238 39.109,91.238L63.398,51.104Z" style="fill:rgb(75,41,221);"/>
        <path d="M73.5,60L51.7,96L53.7,97.2L75.4,61.2L73.5,60.1L73.5,60Z" style="fill:rgb(109,80,235);"/>
        <path d="M67.5,85.8L58.8,98C58.2,99 56.9,99.2 55.8,98.5L52.8,96.7L74.6,60.7L77.6,62.5C78.7,63.2 79.1,64.5 78.6,65.5L70.6,80.5L71.6,82.5L91.9,92.7C93.9,93.9 94.7,96.4 93.6,98.2C92.6,99.9 90,100.3 88,99.2L69.6,85.8L67.5,85.7L67.5,85.8Z" style="fill:rgb(161,139,255);"/>
        <path d="M86.3,100C86.3,100 85.8,97.5 86.8,96.7C87.8,95.9 89.1,97.6 89.4,92.9C89.9,84.9 89,80.9 86.1,83.6C86.7,81.1 83.5,80.3 83.1,83.2C82.8,80.4 80.3,79.9 79.1,82.4C78.8,75.7 75.4,76.4 75.8,82.8L75.8,89.6C75.8,90.4 75.4,89.9 74.2,89.2C72.9,88.4 72,87.2 71.8,87.5C71.5,87.9 70.2,89.6 71.8,91.4C73.636,93.297 75.503,95.164 77.4,97L77.4,100L86.4,100L86.3,100Z" style="fill:white;stroke:rgb(75,41,221);stroke-width:1px;"/>
        <rect x="96.8" y="33.9" width="11.1" height="76.1" style="fill:rgb(75,41,221);"/>
        <rect x="76.2" y="99.1" width="11.1" height="10.9" style="fill:rgb(75,41,221);"/>
        <path d="M55.8,20.8C55.687,20.699 55.513,20.699 55.4,20.8L45.4,32C45.2,32.1 45.2,32.3 45.4,32.4L47.6,34.5L48.1,34.5L58.1,23.3C58.3,23.3 58.3,23 58.1,22.9L55.8,20.9L55.8,20.8ZM67.8,26.8C67.8,26.8 70.2,24.8 69.4,21.6C68.7,18.4 67.4,18.7 67.9,16.9C68.107,16.017 68.518,15.195 69.1,14.5L64.1,9.5L56.3,17.1L67.7,26.7L67.8,26.8Z" style="fill:rgb(161,139,255);"/>
        <path d="M65.6,9.2L70.3,13.7L68.2,13.6L65.9,11.3L65.6,9.2Z" style="fill:rgb(75,41,221);"/>
        <path d="M76.7,1.7C76.624,1.614 76.515,1.565 76.4,1.565C76.285,1.565 76.176,1.614 76.1,1.7L70.1,7.9C69.9,8 69.9,8.3 70.1,8.4L70.6,8.9C70.7,9.1 71,9.1 71.1,8.9L77.2,2.8L77.2,2.2L76.7,1.7Z" style="fill:rgb(109,80,235);"/>
        <path d="M72.4,11.5L67.4,6.8L69.8,6.9L72.1,9.2L72.4,11.5Z" style="fill:rgb(75,41,221);"/>
        <path d="M62.5,20L59.4,23.1L64.8,28.1L68,25.1L62.5,20.1L62.5,20Z" style="fill:rgb(109,80,235);"/>
    </g>
</svg>
