<?xml version="1.0" encoding="UTF-8" standalone="no"?>
<!DOCTYPE svg PUBLIC "-//W3C//DTD SVG 1.1//EN" "http://www.w3.org/Graphics/SVG/1.1/DTD/svg11.dtd">
<svg width="100%" height="100%" viewBox="0 0 205 150" version="1.1" xmlns="http://www.w3.org/2000/svg" xmlns:xlink="http://www.w3.org/1999/xlink" xml:space="preserve" xmlns:serif="http://www.serif.com/" style="fill-rule:evenodd;clip-rule:evenodd;stroke-linejoin:round;stroke-miterlimit:2;">
    <g transform="matrix(0.972123,0,0,0.928442,1.3992,2.4562)">
        <path d="M158.594,121.148L158.594,134.18C158.594,140.588 153.391,145.79 146.983,145.79L58.61,145.79C52.202,145.79 47,140.588 47,134.18L47,121.148L158.594,121.148Z" style="fill:rgb(184,169,244);"/>
    </g>
    <g transform="matrix(0.972123,0,0,0.928442,1.3992,2.4562)">
        <rect x="47" y="115.781" width="24" height="30.009" style="fill:rgb(165,148,238);"/>
    </g>
    <g transform="matrix(0.972123,0,0,0.928442,1.3992,2.4562)">
        <path d="M161,6.568C160.999,4.692 159.456,3.149 157.58,3.148L50.42,3.148C48.544,3.149 47.001,4.692 47,6.568L47,121.148L157.58,121.148C159.456,121.147 160.999,119.604 161,117.728L161,6.568Z" style="fill:rgb(75,41,221);"/>
    </g>
    <g transform="matrix(0.972123,0,0,0.928442,1.3992,2.4562)">
        <rect x="47" y="1.27" width="24" height="124" style="fill:rgb(165,148,238);"/>
    </g>
    <g transform="matrix(0.972123,0,0,0.928442,1.3992,2.4562)">
        <path d="M155.469,136.102L155.5,121.102L57.469,121.102C54.71,121.102 52.469,123.343 52.469,126.102L52.469,136.102C52.469,138.862 54.71,141.102 57.469,141.102L150.469,141.102C153.229,141.102 155.469,138.862 155.469,136.102Z" style="fill:white;"/>
    </g>
    <g transform="matrix(0.972123,0,0,0.928442,1.3992,2.4562)">
        <path d="M141.185,121.102L49.291,121.102L49.291,141.102L126.185,141.102L141.185,121.102Z" style="fill:rgb(165,148,238);fill-opacity:0.3;"/>
    </g>
    <g transform="matrix(0.972123,0,0,0.928442,1.3992,2.4562)">
        <path d="M90.268,40.764L107.271,40.764L107.271,17.264L119.271,17.264L119.271,40.764L134.268,40.764L134.268,52.764L119.271,52.764L119.271,102.264L107.271,102.264L107.271,52.764L90.268,52.764L90.268,40.764Z" style="fill:rgb(165,148,238);"/>
    </g>
    <g transform="matrix(0.972123,0,0,0.928442,1.3992,2.4562)">
        <rect x="61" y="131" width="6" height="24" style="fill:rgb(75,41,221);"/>
    </g>
</svg>
