<?xml version="1.0" encoding="UTF-8" standalone="no"?>
<!DOCTYPE svg PUBLIC "-//W3C//DTD SVG 1.1//EN" "http://www.w3.org/Graphics/SVG/1.1/DTD/svg11.dtd">
<svg width="100%" height="100%" viewBox="0 0 205 150" version="1.1" xmlns="http://www.w3.org/2000/svg" xmlns:xlink="http://www.w3.org/1999/xlink" xml:space="preserve" xmlns:serif="http://www.serif.com/" style="fill-rule:evenodd;clip-rule:evenodd;stroke-linejoin:round;stroke-miterlimit:2;">
    <g transform="matrix(1,0,0,1,1.6963,1.00385)">
        <rect x="42.9" y="80" width="36" height="12" style="fill:white;stroke:rgb(219,212,248);stroke-width:1px;"/>
        <rect x="41" y="92" width="40" height="63" style="fill:rgb(75,41,221);"/>
        <rect x="45.7" y="48.9" width="19.7" height="31.1" style="fill:rgb(165,148,238);"/>
        <path d="M94.7,32.6C95.518,31.949 95.694,30.76 95.1,29.9L74.6,1.9C73.978,1.049 72.785,0.828 71.9,1.4L20,39.4C19.239,40.042 19.067,41.159 19.6,42L40.1,70C40.751,70.818 41.94,70.994 42.8,70.4L94.6,32.6L94.7,32.6Z" style="fill:white;"/>
        <path d="M94.982,33.559C95.105,33.523 95.221,33.463 95.323,33.382C96.55,32.405 96.814,30.623 95.923,29.332C95.918,29.324 95.912,29.317 95.907,29.309L75.407,1.309C74.475,0.034 72.685,-0.298 71.357,0.56C71.341,0.571 71.325,0.582 71.309,0.593L19.409,38.593C19.391,38.607 19.373,38.621 19.355,38.635C18.214,39.598 17.956,41.274 18.755,42.535C18.767,42.554 18.78,42.573 18.793,42.591L39.293,70.591C39.301,70.602 39.309,70.612 39.318,70.623C40.295,71.85 42.077,72.114 43.368,71.223C43.375,71.218 43.382,71.213 43.389,71.208L94.982,33.559ZM93.859,33.141L94.6,32.6L94.7,32.6C95.518,31.949 95.694,30.76 95.1,29.9L74.6,1.9C73.978,1.049 72.785,0.828 71.9,1.4L20,39.4C19.239,40.042 19.067,41.159 19.6,42L40.1,70C40.751,70.818 41.94,70.994 42.8,70.4L93.792,33.189C93.977,33.443 94.275,33.6 94.6,33.6L94.598,33.595C94.293,33.563 94.022,33.394 93.859,33.141Z" style="fill:rgb(219,212,248);"/>
        <path d="M88.2,35L67.6,6.9L27,36.6L47.5,64.7L88.2,35Z" style="fill:rgb(75,41,221);"/>
        <path d="M78.2,12.5C78.5,12.9 78.5,13.5 78.1,13.8C77.7,14 77.1,13.9 76.9,13.5C76.6,13.1 76.6,12.5 77,12.3C77.4,12 78,12.1 78.2,12.5ZM84.7,21.5C85,21.8 85,22.4 84.6,22.6C84.2,22.9 83.6,22.8 83.4,22.4L79,16.4C78.7,16.1 78.8,15.5 79.2,15.2C79.5,15 80.1,15.1 80.4,15.5L84.7,21.5Z" style="fill:rgb(165,148,238);"/>
        <circle cx="32.7" cy="52.5" r="3" style="fill:rgb(165,148,238);"/>
        <circle cx="49.5" cy="86.8" r="2.5" style="fill:rgb(75,41,221);"/>
        <path d="M43.2,19.9C42.533,18.897 41.406,18.292 40.202,18.292C39.489,18.292 38.792,18.504 38.2,18.9L36.7,19.9C35.697,20.567 35.092,21.694 35.092,22.898C35.092,23.611 35.304,24.308 35.7,24.9L43.7,37.2C44.9,38.9 47.1,39.4 48.7,38.2L50.3,37.2C51.9,36.2 52.3,34 51.3,32.3L43.3,19.9L43.2,19.9Z" style="fill:rgb(219,212,248);"/>
        <path d="M36.7,19.8L33,22.4L45,40.8L48.8,38.3L36.8,19.8L36.7,19.8Z" style="fill:rgb(165,148,238);"/>
        <path d="M49.1,12.5C48.433,11.497 47.306,10.892 46.102,10.892C45.389,10.892 44.692,11.104 44.1,11.5L42.6,12.4C41.597,13.067 40.992,14.194 40.992,15.398C40.992,16.111 41.204,16.808 41.6,17.4L51.3,32.3C52.3,34 54.6,34.4 56.3,33.3L57.8,32.3C59.5,31.3 59.9,29.1 58.8,27.3L49.1,12.5Z" style="fill:rgb(219,212,248);"/>
        <path d="M42.6,12.4L38.8,14.9L52.4,35.9L56.3,33.4L42.6,12.4Z" style="fill:rgb(165,148,238);"/>
        <path d="M55.6,6C54.933,4.997 53.806,4.392 52.602,4.392C51.889,4.392 51.192,4.604 50.6,5L49.1,5.9C48.097,6.567 47.492,7.694 47.492,8.898C47.492,9.611 47.704,10.308 48.1,10.9L59.1,27.9C60.2,29.5 62.4,29.9 64.1,28.9L65.6,27.9C67.3,26.8 67.8,24.6 66.6,22.9L55.6,5.9L55.6,6Z" style="fill:rgb(219,212,248);"/>
        <path d="M49.1,5.9L45.3,8.4L60.3,31.4L64.1,28.9L49.1,5.9Z" style="fill:rgb(165,148,238);"/>
        <path d="M64.2,2.6C63.533,1.597 62.406,0.992 61.202,0.992C60.489,0.992 59.792,1.204 59.2,1.6L57.7,2.6C56.697,3.267 56.092,4.394 56.092,5.598C56.092,6.311 56.304,7.008 56.7,7.6L66,22C67,23.7 69.3,24.1 71,23L72.5,22C74.1,21 74.6,18.7 73.5,17L64.2,2.7L64.2,2.6Z" style="fill:rgb(219,212,248);"/>
        <path d="M58.6,2L54.7,4.5L68,25L72,22.5L58.5,2L58.6,2Z" style="fill:rgb(165,148,238);"/>
        <path d="M62.3,80L62.3,68.3C62.3,68.3 54.4,52.3 74.3,42.5C74.8,40.6 75,38.1 75,35.6C74.8,31.6 59.4,41.7 60.4,25.1C75.3,25.2 88.1,21.8 88,39.5C87.7,64.8 77.5,60.6 77.3,70.2L77.3,80L62.3,80Z" style="fill:rgb(219,212,248);"/>
        <rect x="99.9" y="122" width="36" height="12" style="fill:white;stroke:rgb(219,212,248);stroke-width:1px;"/>
        <rect x="98" y="134" width="40" height="21" style="fill:rgb(75,41,221);"/>
        <circle cx="106.5" cy="128.8" r="2.5" style="fill:rgb(75,41,221);"/>
        <path d="M101.3,122L101.3,105C98.3,103.6 94.3,94.6 94.3,94.6L122.8,90.6L120.8,122L101.3,122Z" style="fill:rgb(165,148,238);"/>
        <path d="M149.7,88.7L89,95.7L75,92.2L71.7,94.2L71,88.5L60,89.8L59.4,84.8L70.4,83.5L69.7,77.4L73.4,78.3L86.3,71.8L147,64.8L149.7,88.8L149.7,88.7Z" style="fill:rgb(75,41,221);"/>
        <path d="M182.2,73C182.277,73.697 182.316,74.398 182.316,75.1C182.316,85.532 173.732,94.116 163.3,94.116C153.658,94.116 145.465,86.783 144.4,77.2C144.319,76.486 144.278,75.768 144.278,75.05C144.278,64.615 152.865,56.028 163.3,56.028C172.926,56.028 181.112,63.335 182.2,72.9L182.2,73Z" style="fill:rgb(165,148,238);"/>
        <path d="M165,96.8C166.775,96.592 168.075,94.978 167.9,93.2L163.7,56.4C163.522,54.721 162.089,53.431 160.4,53.431C158.58,53.431 157.081,54.93 157.081,56.75C157.081,56.867 157.088,56.984 157.1,57.1L161.3,93.9C161.442,95.601 162.882,96.926 164.589,96.926C164.726,96.926 164.864,96.917 165,96.9L165,96.8Z" style="fill:rgb(219,212,248);"/>
        <path d="M107.3,65.6C107.3,63.6 105.7,62 103.7,62L102,62C100,62 98.4,63.6 98.4,65.6L98.4,80.4C98.4,82.4 100.1,84 102,84L103.8,84C105.8,84 107.4,82.4 107.4,80.4L107.4,65.6L107.3,65.6Z" style="fill:rgb(219,212,248);"/>
        <g>
            <clipPath id="_clip1">
                <path d="M107.3,65.6C107.3,63.6 105.7,62 103.7,62L102,62C100,62 98.4,63.6 98.4,65.6L98.4,80.4C98.4,82.4 100.1,84 102,84L103.8,84C105.8,84 107.4,82.4 107.4,80.4L107.4,65.6L107.3,65.6Z"/>
            </clipPath>
            <g clip-path="url(#_clip1)">
                <rect x="97.3" y="62" width="4.6" height="22" style="fill:rgb(165,148,238);"/>
            </g>
        </g>
        <path d="M116.3,62.6C116.3,60.6 114.7,59 112.7,59L111,59C109,59 107.4,60.6 107.4,62.6L107.4,80.4C107.4,82.4 109.1,84 111,84L112.8,84C114.8,84 116.4,82.4 116.4,80.4L116.4,62.6L116.3,62.6Z" style="fill:rgb(219,212,248);"/>
        <g>
            <clipPath id="_clip2">
                <path d="M116.3,62.6C116.3,60.6 114.7,59 112.7,59L111,59C109,59 107.4,60.6 107.4,62.6L107.4,80.4C107.4,82.4 109.1,84 111,84L112.8,84C114.8,84 116.4,82.4 116.4,80.4L116.4,62.6L116.3,62.6Z"/>
            </clipPath>
            <g clip-path="url(#_clip2)">
                <rect x="106.3" y="59" width="4.6" height="25" style="fill:rgb(165,148,238);"/>
            </g>
        </g>
        <path d="M125.3,60.7C125.3,58.7 123.7,57.1 121.7,57.1L120,57.1C118,57.1 116.4,58.7 116.4,60.7L116.4,80.9C116.4,82.9 118.1,84.5 120,84.5L121.8,84.5C123.8,84.5 125.4,82.9 125.4,80.9L125.4,60.7L125.3,60.7Z" style="fill:rgb(219,212,248);"/>
        <g>
            <clipPath id="_clip3">
                <path d="M125.3,60.7C125.3,58.7 123.7,57.1 121.7,57.1L120,57.1C118,57.1 116.4,58.7 116.4,60.7L116.4,80.9C116.4,82.9 118.1,84.5 120,84.5L121.8,84.5C123.8,84.5 125.4,82.9 125.4,80.9L125.4,60.7L125.3,60.7Z"/>
            </clipPath>
            <g clip-path="url(#_clip3)">
                <rect x="115.3" y="57.1" width="4.6" height="27.4" style="fill:rgb(165,148,238);"/>
            </g>
        </g>
        <path d="M134.3,62.6C134.3,60.6 132.7,59 130.7,59L129,59C127,59 125.4,60.6 125.4,62.6L125.4,79.8C125.4,81.8 127.1,83.4 129,83.4L130.8,83.4C132.8,83.4 134.4,81.8 134.4,79.8L134.4,62.6L134.3,62.6Z" style="fill:rgb(219,212,248);"/>
        <g>
            <clipPath id="_clip4">
                <path d="M134.3,62.6C134.3,60.6 132.7,59 130.7,59L129,59C127,59 125.4,60.6 125.4,62.6L125.4,79.8C125.4,81.8 127.1,83.4 129,83.4L130.8,83.4C132.8,83.4 134.4,81.8 134.4,79.8L134.4,62.6L134.3,62.6Z"/>
            </clipPath>
            <g clip-path="url(#_clip4)">
                <rect x="125.3" y="59" width="4.6" height="24.4" style="fill:rgb(165,148,238);"/>
            </g>
        </g>
        <path d="M119.3,122L119.3,110.3C119.3,110.3 111.4,94.3 131.3,84.5C131.8,82.6 132,80.1 132,77.6C131.8,73.6 116.4,83.7 117.4,67.1C132.3,67.2 145.1,63.8 145,81.5C144.7,106.8 134.5,102.6 134.3,112.2L134.3,122L119.3,122Z" style="fill:rgb(219,212,248);"/>
    </g>
</svg>
