<?xml version="1.0" encoding="UTF-8" standalone="no"?>
<!DOCTYPE svg PUBLIC "-//W3C//DTD SVG 1.1//EN" "http://www.w3.org/Graphics/SVG/1.1/DTD/svg11.dtd">
<svg width="100%" height="100%" viewBox="0 0 19 19" version="1.1" xmlns="http://www.w3.org/2000/svg" xmlns:xlink="http://www.w3.org/1999/xlink" xml:space="preserve" xmlns:serif="http://www.serif.com/" style="fill-rule:evenodd;clip-rule:evenodd;stroke-linecap:round;stroke-linejoin:round;stroke-miterlimit:1.5;">
    <g transform="matrix(0.0729928,0,0,0.0729928,-9.87053,-66.188)">
        <path d="M371.551,1033.5C371.551,1093.99 322.441,1143.1 261.951,1143.1C201.461,1143.1 152.351,1093.99 152.351,1033.5C152.351,973.01 201.461,923.9 261.951,923.9" style="fill:none;stroke:rgb(79,41,220);stroke-width:34.25px;"/>
    </g>
    <g transform="matrix(0.0776398,0,0,0.0776398,-11.0257,-70.9286)">
        <path d="M351.445,966.989L254.746,1064.32L217.939,1024.83" style="fill:none;stroke:rgb(79,41,220);stroke-width:32.2px;"/>
    </g>
</svg>
