<?xml version="1.0" encoding="UTF-8" standalone="no"?>
<!DOCTYPE svg PUBLIC "-//W3C//DTD SVG 1.1//EN" "http://www.w3.org/Graphics/SVG/1.1/DTD/svg11.dtd">
<svg width="100%" height="100%" viewBox="0 0 150 110" version="1.1" xmlns="http://www.w3.org/2000/svg" xmlns:xlink="http://www.w3.org/1999/xlink" xml:space="preserve" xmlns:serif="http://www.serif.com/" style="fill-rule:evenodd;clip-rule:evenodd;stroke-linecap:square;stroke-miterlimit:2;">
    <rect x="26.5" y="2" width="95" height="106" style="fill:white;stroke:rgb(75,41,221);stroke-width:5px;"/>
    <g transform="matrix(1,0,0,1,0.907732,3.2366)">
        <g transform="matrix(0.954031,0,0,0.954031,1.53998,0.31091)">
            <path d="M116.5,85.167L116.5,88.167L66.5,88.167L66.5,85.167L116.5,85.167ZM60.764,56.5L60.764,59.5L33.764,59.5L33.764,56.5L60.764,56.5ZM92.251,28.5L92.251,31.5L67.251,31.5L67.251,28.5L92.251,28.5Z" style="fill:rgb(75,41,221);"/>
        </g>
        <g transform="matrix(0.954031,0,0,0.954031,1.53998,0.31091)">
            <rect x="66.5" y="56.975" width="50" height="22" style="fill:rgb(75,41,221);fill-opacity:0.2;"/>
        </g>
        <g transform="matrix(0.954031,0,0,0.954031,1.53998,0.31091)">
            <path d="M69.879,63.091L89.905,63.091L89.905,66.046L69.879,66.046L69.879,63.091ZM69.879,70.091L89.905,70.091L89.905,73.046L69.879,73.046L69.879,70.091Z" style="fill:white;"/>
        </g>
        <g transform="matrix(0.954031,0,0,0.954031,1.53998,-0.68909)">
            <rect x="96.026" y="60.035" width="17" height="17" style="fill:rgb(75,41,221);"/>
        </g>
        <g transform="matrix(0.954031,0,0,0.954031,1.53998,-0.68909)">
            <path d="M110.934,75C110.934,75.001 98.934,75.012 98.934,75C98.934,72.742 101.118,70.605 103.974,70.257L103.974,69.31C102.924,68.853 102.175,67.666 102.175,66.276C102.175,64.49 103.411,63.04 104.934,63.04C106.457,63.04 107.694,64.49 107.694,66.276C107.694,67.666 106.945,68.853 105.894,69.31L105.894,70.257C108.75,70.605 110.934,72.742 110.934,75Z" style="fill:white;"/>
        </g>
        <g transform="matrix(0.954031,0,0,0.954031,41.8506,22.0437)">
            <text x="0px" y="0px" style="font-family:'Arial-BoldMT', 'Arial', sans-serif;font-weight:700;font-size:22px;fill:rgb(75,41,221);">NEWS</text>
        </g>
        <g transform="matrix(0.954031,0,0,0.954031,1.53998,0.31091)">
            <path d="M116.236,98.1L116.236,101.1L66.236,101.1L66.236,98.1L116.236,98.1ZM116.236,91.633L116.236,94.633L66.236,94.633L66.236,91.633L116.236,91.633ZM60.5,76.5L60.5,79.5L33.5,79.5L33.5,76.5L60.5,76.5ZM60.5,69.833L60.5,72.833L33.5,72.833L33.5,69.833L60.5,69.833ZM60.5,63.167L60.5,66.167L33.5,66.167L33.5,63.167L60.5,63.167ZM91.987,48.5L91.987,51.5L66.987,51.5L66.987,48.5L91.987,48.5ZM91.987,41.833L91.987,44.833L66.987,44.833L66.987,41.833L91.987,41.833ZM91.987,35.167L91.987,38.167L66.987,38.167L66.987,35.167L91.987,35.167Z" style="fill:rgb(75,41,221);"/>
        </g>
        <g transform="matrix(0.954031,0,0,0.954031,1.53998,0.31091)">
            <rect x="33.5" y="28.721" width="27" height="23" style="fill:rgb(75,41,221);fill-opacity:0.5;"/>
        </g>
        <g transform="matrix(0.954031,0,0,0.954031,1.53998,0.31091)">
            <rect x="95.5" y="28.721" width="21" height="9" style="fill:rgb(75,41,221);fill-opacity:0.5;"/>
        </g>
        <g transform="matrix(0.954031,0,0,0.954031,1.53998,0.31091)">
            <rect x="95.5" y="42.721" width="21" height="9" style="fill:rgb(75,41,221);fill-opacity:0.5;"/>
        </g>
        <g transform="matrix(0.954031,0,0,0.954031,1.53998,0.31091)">
            <rect x="33.5" y="84.5" width="27" height="16.6" style="fill:rgb(75,41,221);fill-opacity:0.5;"/>
        </g>
    </g>
</svg>
