<?xml version="1.0" encoding="UTF-8" standalone="no"?>
<!-- Created with Inkscape (http://www.inkscape.org/) -->

<svg
   xmlns:dc="http://purl.org/dc/elements/1.1/"
   xmlns:cc="http://creativecommons.org/ns#"
   xmlns:rdf="http://www.w3.org/1999/02/22-rdf-syntax-ns#"
   xmlns:svg="http://www.w3.org/2000/svg"
   xmlns="http://www.w3.org/2000/svg"
   xmlns:sodipodi="http://sodipodi.sourceforge.net/DTD/sodipodi-0.dtd"
   xmlns:inkscape="http://www.inkscape.org/namespaces/inkscape"
   width="123.27489mm"
   height="43.3825mm"
   viewBox="0 0 123.27489 43.3825"
   version="1.1"
   id="svg983"
   inkscape:version="0.92.4 (5da689c313, 2019-01-14)"
   sodipodi:docname="data_transport.svg">
  <defs
     id="defs977">
    <marker
       inkscape:stockid="Arrow2Send"
       orient="auto"
       refY="0"
       refX="0"
       id="Arrow2Send"
       style="overflow:visible"
       inkscape:isstock="true">
      <path
         id="path2415"
         style="fill:#000000;fill-opacity:1;fill-rule:evenodd;stroke:#000000;stroke-width:0.625;stroke-linejoin:round;stroke-opacity:1"
         d="M 8.7185878,4.0337352 -2.2072895,0.01601326 8.7185884,-4.0017078 c -1.7454984,2.3720609 -1.7354408,5.6174519 -6e-7,8.035443 z"
         transform="matrix(-0.3,0,0,-0.3,0.69,0)"
         inkscape:connector-curvature="0" />
    </marker>
    <marker
       inkscape:stockid="Arrow1Send"
       orient="auto"
       refY="0"
       refX="0"
       id="Arrow1Send"
       style="overflow:visible"
       inkscape:isstock="true">
      <path
         id="path2397"
         d="M 0,0 5,-5 -12.5,0 5,5 Z"
         style="fill:#000000;fill-opacity:1;fill-rule:evenodd;stroke:#000000;stroke-width:1.00000003pt;stroke-opacity:1"
         transform="matrix(-0.2,0,0,-0.2,-1.2,0)"
         inkscape:connector-curvature="0" />
    </marker>
    <marker
       inkscape:stockid="Arrow2Lend"
       orient="auto"
       refY="0"
       refX="0"
       id="Arrow2Lend"
       style="overflow:visible"
       inkscape:isstock="true">
      <path
         id="path2403"
         style="fill:#000000;fill-opacity:1;fill-rule:evenodd;stroke:#000000;stroke-width:0.625;stroke-linejoin:round;stroke-opacity:1"
         d="M 8.7185878,4.0337352 -2.2072895,0.01601326 8.7185884,-4.0017078 c -1.7454984,2.3720609 -1.7354408,5.6174519 -6e-7,8.035443 z"
         transform="matrix(-1.1,0,0,-1.1,-1.1,0)"
         inkscape:connector-curvature="0" />
    </marker>
    <marker
       inkscape:isstock="true"
       style="overflow:visible"
       id="marker10174"
       refX="0"
       refY="0"
       orient="auto"
       inkscape:stockid="Arrow1Mend">
      <path
         transform="matrix(-0.4,0,0,-0.4,-4,0)"
         style="fill:#800000;fill-opacity:1;fill-rule:evenodd;stroke:#800000;stroke-width:1.00000003pt;stroke-opacity:1"
         d="M 0,0 5,-5 -12.5,0 5,5 Z"
         id="path10172"
         inkscape:connector-curvature="0" />
    </marker>
    <marker
       inkscape:stockid="Arrow1Mend"
       orient="auto"
       refY="0"
       refX="0"
       id="marker9829"
       style="overflow:visible"
       inkscape:isstock="true">
      <path
         inkscape:connector-curvature="0"
         id="path9827"
         d="M 0,0 5,-5 -12.5,0 5,5 Z"
         style="fill:#800000;fill-opacity:1;fill-rule:evenodd;stroke:#800000;stroke-width:1.00000003pt;stroke-opacity:1"
         transform="matrix(-0.4,0,0,-0.4,-4,0)" />
    </marker>
  </defs>
  <sodipodi:namedview
     id="base"
     pagecolor="#ffffff"
     bordercolor="#666666"
     borderopacity="1.0"
     inkscape:pageopacity="0.0"
     inkscape:pageshadow="2"
     inkscape:zoom="0.98994949"
     inkscape:cx="65.629404"
     inkscape:cy="85.903647"
     inkscape:document-units="mm"
     inkscape:current-layer="layer1"
     showgrid="false"
     inkscape:snap-global="false"
     showguides="true"
     inkscape:guide-bbox="true"
     fit-margin-top="0"
     fit-margin-left="0"
     fit-margin-right="0"
     fit-margin-bottom="0"
     inkscape:window-width="1872"
     inkscape:window-height="1016"
     inkscape:window-x="48"
     inkscape:window-y="27"
     inkscape:window-maximized="1" />
  <metadata
     id="metadata980">
    <rdf:RDF>
      <cc:Work
         rdf:about="">
        <dc:format>image/svg+xml</dc:format>
        <dc:type
           rdf:resource="http://purl.org/dc/dcmitype/StillImage" />
        <dc:title></dc:title>
      </cc:Work>
    </rdf:RDF>
  </metadata>
  <g
     inkscape:label="Layer 1"
     inkscape:groupmode="layer"
     id="layer1"
     transform="translate(-2.6263938,-0.56798394)">
    <g
       id="g8147"
       transform="translate(87.129866,5.0781211)">
      <text
         id="text1737"
         font-weight="bold"
         font-size="5px"
         y="-10.396692"
         x="13.127643"
         style="font-weight:bold;font-size:1.32291663px;font-family:'Helvetica Neue', Helvetica, Arial-Unicode, Arial, Sans-serif;fill:#000000;stroke-width:0.26458332">Created by Shocho</text>
      <text
         id="text1739"
         font-weight="bold"
         font-size="5px"
         y="-9.0737553"
         x="12.812066"
         style="font-weight:bold;font-size:1.32291663px;font-family:'Helvetica Neue', Helvetica, Arial-Unicode, Arial, Sans-serif;fill:#000000;stroke-width:0.26458332">from the Noun Project</text>
    </g>
    <g
       id="g2340"
       transform="translate(-11.759859,-60.670183)">
      <text
         id="text1795"
         font-weight="bold"
         font-size="5px"
         y="52.966667"
         x="69.25473"
         style="font-weight:bold;font-size:1.32291663px;font-family:'Helvetica Neue', Helvetica, Arial-Unicode, Arial, Sans-serif;fill:#000000;stroke-width:0.26458332">Created by Wilson Joseph</text>
      <text
         id="text1797"
         font-weight="bold"
         font-size="5px"
         y="54.289585"
         x="69.25473"
         style="font-weight:bold;font-size:1.32291663px;font-family:'Helvetica Neue', Helvetica, Arial-Unicode, Arial, Sans-serif;fill:#000000;stroke-width:0.26458332">from the Noun Project</text>
    </g>
    <g
       id="g2329"
       transform="translate(1.6036171,-190.29591)">
      <text
         id="text2030"
         font-weight="bold"
         font-size="5px"
         y="187.375"
         x="56.498558"
         style="font-weight:bold;font-size:1.32291663px;font-family:'Helvetica Neue', Helvetica, Arial-Unicode, Arial, Sans-serif;fill:#000000;stroke-width:0.26458332">Created by Aman</text>
      <text
         id="text2032"
         font-weight="bold"
         font-size="5px"
         y="188.69791"
         x="56.498558"
         style="font-weight:bold;font-size:1.32291663px;font-family:'Helvetica Neue', Helvetica, Arial-Unicode, Arial, Sans-serif;fill:#000000;stroke-width:0.26458332">from the Noun Project</text>
    </g>
    <g
       id="g5255"
       transform="translate(-8.26962,11.179464)">
      <g
         id="g8116"
         inkscape:export-xdpi="150"
         inkscape:export-ydpi="150">
        <g
           transform="matrix(0.08078029,0,0,0.08078029,93.296083,-11.710092)"
           id="g1735">
          <g
             id="g1733">
            <g
               id="g1731">
              <g
                 id="g1687">
                <path
                   id="path1673"
                   d="M 256,233.1 C 195.8,233.1 146.9,184.2 146.9,124 146.9,63.8 195.8,14.9 256,14.9 c 60.2,0 109.1,48.9 109.1,109.1 0,60.2 -48.9,109.1 -109.1,109.1 z m 0,-208.2 c -54.6,0 -99.1,44.5 -99.1,99.1 0,54.6 44.5,99.1 99.1,99.1 54.6,0 99.1,-44.5 99.1,-99.1 0,-54.6 -44.5,-99.1 -99.1,-99.1 z"
                   inkscape:connector-curvature="0" />
                <path
                   id="path1675"
                   d="m 151.9,128.1 c -1.3,0 -2.6,-0.5 -3.5,-1.5 -0.9,-0.9 -1.5,-2.2 -1.5,-3.5 -0.1,-28.9 11.2,-56.2 31.7,-77 20.6,-20.8 48,-32.4 77,-32.5 v 0 c 0.1,0 0.3,0 0.4,0 28.9,0 56.2,11.4 76.8,32 20.7,20.6 32.1,47.9 32.2,76.8 0,1.3 -0.5,2.6 -1.5,3.5 -0.9,0.9 -2.2,1.5 -3.5,1.5 l -208.1,0.7 c 0,0 0,0 0,0 z M 255.7,23.7 c -52.9,0.2 -96.2,42.1 -98.7,94.4 l 197.9,-0.6 C 352.1,65.3 308.8,23.7 256,23.7 c -0.1,0 -0.2,0 -0.3,0 z m 0,-5 z"
                   inkscape:connector-curvature="0" />
                <path
                   id="path1677"
                   d="m 255.3,231.2 c -28.7,0 -55.8,-11.2 -76.4,-31.6 -20.7,-20.5 -32.3,-47.8 -32.6,-76.6 0,-1.3 0.5,-2.6 1.4,-3.5 0.9,-0.9 2.2,-1.5 3.5,-1.5 l 208.2,-1.6 c 0,0 0,0 0,0 1.3,0 2.6,0.5 3.5,1.4 0.9,0.9 1.5,2.2 1.5,3.5 0.2,28.9 -10.9,56.3 -31.4,77.1 -20.5,21 -47.8,32.6 -76.9,32.8 -0.2,0 -0.5,0 -0.8,0 z M 156.5,127.9 c 3.1,52.1 46.3,93.3 98.8,93.3 0.3,0 0.6,0 0.9,0 0,0 0,0 0,0 26.4,-0.2 51.2,-10.8 69.8,-29.8 17.4,-17.7 27.4,-40.7 28.4,-65.1 z"
                   inkscape:connector-curvature="0" />
                <path
                   id="path1679"
                   d="m 256.6,82.8 c -0.3,0 -0.5,0 -0.8,0 -28.4,-0.2 -55.2,-11.2 -75.5,-30.9 -2,-1.9 -2,-5.1 -0.1,-7.1 1.9,-2 5.1,-2 7.1,-0.1 18.4,17.9 42.8,27.9 68.5,28.1 0.2,0 0.5,0 0.7,0 25.5,0 49.7,-9.7 68.2,-27.3 2,-1.9 5.2,-1.8 7.1,0.2 1.9,2 1.8,5.2 -0.2,7.1 -20.3,19.3 -47,30 -75,30 z"
                   inkscape:connector-curvature="0" />
                <path
                   id="path1681"
                   d="m 327.5,204.6 c -1.3,0 -2.6,-0.5 -3.6,-1.5 -17.8,-18.5 -41.8,-29.3 -67.6,-30.3 -25.7,-1 -50.5,7.9 -69.8,25.1 -2.1,1.8 -5.2,1.7 -7.1,-0.4 -1.8,-2.1 -1.7,-5.2 0.4,-7.1 21.3,-19 48.5,-28.8 76.8,-27.7 28.4,1.1 54.8,13 74.4,33.3 1.9,2 1.9,5.2 -0.1,7.1 -0.9,1 -2.2,1.5 -3.4,1.5 z"
                   inkscape:connector-curvature="0" />
                <path
                   id="path1683"
                   d="m 256.2,231.2 c -2.8,0 -5,-2.2 -5,-5 L 251,19.9 c 0,-2.8 2.2,-5 5,-5 0,0 0,0 0,0 2.8,0 5,2.2 5,5 l 0.2,206.3 c 0,2.8 -2.2,5 -5,5 0,0 0,0 0,0 z"
                   inkscape:connector-curvature="0" />
                <path
                   id="path1685"
                   d="m 256,231.3 c -0.9,0 -1.9,-0.3 -2.7,-0.8 -34,-22 -55.2,-63.1 -55.2,-107.4 0,-44.3 21.1,-85.4 55.2,-107.4 1.7,-1.1 3.8,-1.1 5.4,0 34,21.9 55.2,63.1 55.2,107.4 0,44.3 -21.1,85.4 -55.2,107.4 -0.8,0.5 -1.8,0.8 -2.7,0.8 z m 0,-205.4 c -29.6,20.6 -47.9,57.5 -47.9,97.2 0,39.7 18.3,76.6 47.9,97.2 29.6,-20.6 47.9,-57.5 47.9,-97.2 0,-39.7 -18.3,-76.7 -47.9,-97.2 z"
                   inkscape:connector-curvature="0" />
              </g>
              <g
                 id="g1729">
                <g
                   id="g1717">
                  <g
                     id="g1715">
                    <g
                       id="g1701">
                      <path
                         id="path1689"
                         d="m 280,306.8 h -48 c -2.8,0 -5,-2.2 -5,-5 v -29.3 c 0,-2.8 2.2,-5 5,-5 h 48 c 2.8,0 5,2.2 5,5 v 29.3 c 0,2.8 -2.2,5 -5,5 z m -43,-10 h 38 v -19.3 h -38 z"
                         inkscape:connector-curvature="0" />
                      <path
                         id="path1691"
                         d="m 230.6,292.2 h -123 c -2.8,0 -5,-2.2 -5,-5 0,-2.8 2.2,-5 5,-5 h 123 c 2.8,0 5,2.2 5,5 0,2.8 -2.2,5 -5,5 z"
                         inkscape:connector-curvature="0" />
                      <path
                         id="path1693"
                         d="M 404.7,292.2 H 281.6 c -2.8,0 -5,-2.2 -5,-5 0,-2.8 2.2,-5 5,-5 h 123.1 c 2.8,0 5,2.2 5,5 0,2.8 -2.2,5 -5,5 z"
                         inkscape:connector-curvature="0" />
                      <path
                         id="path1695"
                         d="m 107.6,324.4 c -2.8,0 -5,-2.2 -5,-5 v -32.2 c 0,-2.8 2.2,-5 5,-5 2.8,0 5,2.2 5,5 v 32.2 c 0,2.8 -2.2,5 -5,5 z"
                         inkscape:connector-curvature="0" />
                      <path
                         id="path1697"
                         d="m 405.9,324.4 c -2.8,0 -5,-2.2 -5,-5 v -32.2 c 0,-2.8 2.2,-5 5,-5 2.8,0 5,2.2 5,5 v 32.2 c 0,2.8 -2.2,5 -5,5 z"
                         inkscape:connector-curvature="0" />
                      <path
                         id="path1699"
                         d="m 256,277.5 c -2.8,0 -5,-2.2 -5,-5 v -16.7 c 0,-2.8 2.2,-5 5,-5 2.8,0 5,2.2 5,5 v 16.7 c 0,2.8 -2.2,5 -5,5 z"
                         inkscape:connector-curvature="0" />
                    </g>
                    <g
                       id="g1707">
                      <path
                         id="path1703"
                         d="M 202.6,465.6 H 11 c -2.8,0 -5,-2.2 -5,-5 V 325.2 c 0,-2.8 2.2,-5 5,-5 h 191.6 c 2.8,0 5,2.2 5,5 v 135.4 c 0,2.8 -2.2,5 -5,5 z M 16,455.6 H 197.6 V 330.2 H 16 Z"
                         inkscape:connector-curvature="0" />
                      <path
                         id="path1705"
                         d="m 183.8,445.3 h -154 c -2.8,0 -5,-2.2 -5,-5 V 344 c 0,-2.8 2.2,-5 5,-5 h 154 c 2.8,0 5,2.2 5,5 v 96.3 c 0,2.8 -2.2,5 -5,5 z m -149,-10 h 144 V 349 h -144 z"
                         inkscape:connector-curvature="0" />
                    </g>
                    <g
                       id="g1713">
                      <path
                         id="path1709"
                         d="M 501,465.6 H 309.4 c -2.8,0 -5,-2.2 -5,-5 V 325.2 c 0,-2.8 2.2,-5 5,-5 H 501 c 2.8,0 5,2.2 5,5 v 135.4 c 0,2.8 -2.2,5 -5,5 z m -186.6,-10 H 496 V 330.2 H 314.4 Z"
                         inkscape:connector-curvature="0" />
                      <path
                         id="path1711"
                         d="m 482.2,445.3 h -154 c -2.8,0 -5,-2.2 -5,-5 V 344 c 0,-2.8 2.2,-5 5,-5 h 154 c 2.8,0 5,2.2 5,5 v 96.3 c 0,2.8 -2.2,5 -5,5 z m -149,-10 h 144 V 349 h -144 z"
                         inkscape:connector-curvature="0" />
                    </g>
                  </g>
                </g>
                <g
                   id="g1727">
                  <path
                     id="path1719"
                     d="m 107.6,498.3 c -2.8,0 -5,-2.2 -5,-5 v -28.1 c 0,-2.8 2.2,-5 5,-5 2.8,0 5,2.2 5,5 v 28.1 c 0,2.8 -2.2,5 -5,5 z"
                     inkscape:connector-curvature="0" />
                  <path
                     id="path1721"
                     d="M 137.1,498.3 H 79.7 c -2.8,0 -5,-2.2 -5,-5 0,-2.8 2.2,-5 5,-5 h 57.4 c 2.8,0 5,2.2 5,5 0,2.8 -2.2,5 -5,5 z"
                     inkscape:connector-curvature="0" />
                  <path
                     id="path1723"
                     d="m 405.9,498.3 c -2.8,0 -5,-2.2 -5,-5 v -28.1 c 0,-2.8 2.2,-5 5,-5 2.8,0 5,2.2 5,5 v 28.1 c 0,2.8 -2.2,5 -5,5 z"
                     inkscape:connector-curvature="0" />
                  <path
                     id="path1725"
                     d="m 435.4,498.3 h -57.3 c -2.8,0 -5,-2.2 -5,-5 0,-2.8 2.2,-5 5,-5 h 57.3 c 2.8,0 5,2.2 5,5 0,2.8 -2.2,5 -5,5 z"
                     inkscape:connector-curvature="0" />
                </g>
              </g>
            </g>
          </g>
        </g>
        <g
           transform="matrix(0.55115277,0,0,0.55115277,-38.624225,-11.450425)"
           inkscape:export-ydpi="150"
           inkscape:export-xdpi="150"
           id="g10218">
          <g
             id="g10193">
            <path
               inkscape:connector-curvature="0"
               d="m 120.48879,22.397608 -10e-6,12.733368 0.10025,24.312728 16.4766,0.09449 V 26.430142 h 11.35899 v -0.743625 h 17.00465 c 0,0 0.89605,-4.176311 -0.56696,-4.989801 -1.63218,-0.907549 -3.19614,2.33184 -5.06241,2.400148 -2.2135,0.08102 -3.98284,-2.481166 -6.19634,-2.400148 -1.86627,0.06831 -3.19614,2.33184 -5.06241,2.400148 -2.2135,0.08102 -3.98284,-2.481166 -6.19633,-2.400148 -1.86627,0.06831 -3.19614,2.33184 -5.06241,2.400148 -2.2135,0.08102 -3.98805,-2.572181 -6.19634,-2.400148 -1.65394,0.128845 -2.63472,1.491454 -4.30646,2.494642 -0.62076,0.372512 -2.05083,0.944068 -3.26742,1.081277 -2.86265,0.322852 -3.0234,-1.875027 -3.0234,-1.875027 z m -30.43599,3.201931 0.09449,3.177656 h 16.75041 v 0.480591 h 8.21862 v 30.067932 l 10.42314,18.775598 v 1.620573 h 6.74892 v -1.88774 l 10.4531,-18.260384 V 24.182128 c 0,0 -17.8334,0.564303 -26.29709,0 -2.2052,-0.147028 -4.35112,1.064184 -6.57428,1.237872 -2.18576,0.170766 -4.38351,-0.283768 -6.57427,-0.198438 -2.21843,0.08641 -4.402295,0.655217 -6.62152,0.718155 -2.209196,0.06265 -6.62152,-0.340178 -6.62152,-0.340178 z"
               style="opacity:1;fill:#000000;fill-opacity:1;stroke:none;stroke-width:0.25;stroke-linecap:butt;stroke-linejoin:round;stroke-miterlimit:4;stroke-dasharray:none;stroke-dashoffset:0;stroke-opacity:1"
               id="rect948" />
          </g>
          <path
             style="fill:none;stroke:#000000;stroke-width:0.5;stroke-linecap:butt;stroke-linejoin:miter;stroke-miterlimit:4;stroke-dasharray:none;stroke-opacity:1"
             d="m 142.84482,17.71421 v -7.153011 l -27.99649,-0.06682 v 8.753077 h -7.95127 v 10.089425 h 8.21854 v 30.067821 l 10.42351,18.775685 v 1.80407 h 6.74857 V 77.913118 L 142.84482,59.471522 V 26.396918"
             id="path838"
             inkscape:connector-curvature="0"
             sodipodi:nodetypes="cccccccccccccc" />
          <path
             style="fill:none;stroke:#000000;stroke-width:0.5;stroke-linecap:butt;stroke-linejoin:miter;stroke-miterlimit:4;stroke-dasharray:none;stroke-opacity:1"
             d="m 120.32736,13.367529 0.20045,46.170811 h 16.57072 V 26.3301 h 11.35895 v -8.552624 h -11.49259 v -4.34313"
             id="path840"
             inkscape:connector-curvature="0"
             sodipodi:nodetypes="cccccccc" />
          <path
             id="path864"
             style="fill:none;stroke:#000000;stroke-width:0.5;stroke-linecap:butt;stroke-linejoin:miter;stroke-miterlimit:4;stroke-dasharray:none;stroke-opacity:1"
             d="m 127.94455,10.427564 h 1.80406 l -0.10022,-6.2474255 c -0.003,-0.4620649 0.49946,-0.8069371 0.90203,-0.8031578 0.39433,0.0037 0.84657,0.3483532 0.86863,0.8031578 h 1.63702 c 0.0773,-1.7296334 -1.02656,-2.4148142 -2.47243,-2.4079223 -1.44587,0.00689 -2.69952,0.7736909 -2.70591,2.4079223 z m -14.11064,0.03423 h 29.81288 c 0.57676,0.499935 0.34611,0.961422 0,1.417411 h -29.81288 c -0.5229,-0.47247 -0.7595,-0.944941 0,-1.417411 z"
             inkscape:connector-curvature="0" />
          <rect
             style="opacity:1;fill:none;fill-opacity:1;stroke:#000000;stroke-width:0.5;stroke-linecap:butt;stroke-linejoin:round;stroke-miterlimit:4;stroke-dasharray:none;stroke-dashoffset:0;stroke-opacity:1"
             id="rect867"
             width="16.640604"
             height="9.0695591"
             x="90.09848"
             y="19.786745" />
          <rect
             style="opacity:1;fill:none;fill-opacity:1;stroke:#000000;stroke-width:0.5;stroke-linecap:butt;stroke-linejoin:round;stroke-miterlimit:4;stroke-dasharray:none;stroke-dashoffset:0;stroke-opacity:1"
             id="rect867-3"
             width="16.999008"
             height="7.0650349"
             x="148.61084"
             y="18.521271" />
          <path
             id="path859"
             style="fill:none;stroke:#000000;stroke-width:0.5;stroke-linecap:butt;stroke-linejoin:miter;stroke-miterlimit:4;stroke-dasharray:none;stroke-opacity:1"
             d="m 145.20013,43.368533 h 3.50791 v 3.725069 h -3.55802 z m 3.59144,0.835216 h 0.73499 v 0.467722 h 0.36749 v 1.202714 h -0.58465 l -0.51783,0.267269 z m 0.61806,-0.03341 1.43657,-1.302938 V 36.25248 m -5.27858,7.149475 v -0.7684 l 0.21716,-0.183748 v -1.87089 c -0.24935,-0.541246 -0.70472,-0.784914 -1.23614,-0.918739 h -1.68713 l -0.0167,-1.971124 2.03793,-0.01669 c 1.46972,0.38704 2.58221,1.196264 3.0736,2.739511 l -0.0334,2.037932 0.13125,0.183748 v 0.7684 m -3.50556,-3.741777 v -2.007724 m 1.22427,3.354538 h 2.10249 m -2.12611,1.13393 h 2.19698 m -2.19698,0.472469 h 2.17336"
             inkscape:connector-curvature="0"
             sodipodi:nodetypes="cccccccccccccccccccccccccccccccccccc" />
        </g>
        <g
           id="g2378"
           transform="matrix(0.89817568,0,0,0.89817568,17.834816,-12.05886)">
          <g
             id="g2366">
            <path
               sodipodi:nodetypes="cscscccc"
               id="path1785"
               d="m 65.044441,15.955433 c -0.02223,1.023408 -1.539346,1.849437 -3.407569,1.849437 -1.868752,0 -3.385343,-0.826029 -3.407568,-1.849437 -2.858294,0.261408 -5.097463,2.66409 -5.097463,5.590117 0,2.250545 1.324769,2.863056 3.236648,3.030008 h 10.536502 c 1.911879,-0.166952 3.236648,-0.779463 3.236648,-3.030008 2.65e-4,-2.926027 -2.238375,-5.328973 -5.097198,-5.590117 z"
               inkscape:connector-curvature="0"
               style="stroke-width:0.26458332" />
            <path
               id="path1787"
               d="m 61.636872,15.778691 c -1.833562,0 -3.359414,-1.922198 -3.686174,-4.461933 h -0.516203 c 0.361421,2.91121 2.10529,5.118894 4.202377,5.118894 2.097088,0 3.840957,-2.207684 4.202642,-5.118894 h -0.516731 c -0.326761,2.54 -1.851819,4.461933 -3.685911,4.461933 z"
               inkscape:connector-curvature="0"
               style="stroke-width:0.26458332" />
            <path
               id="path1789"
               d="m 57.204573,10.473796 h 8.864599 c 0.345546,0 0.625211,-0.27993 0.625211,-0.6252108 0,-0.3452813 -0.279929,-0.6252104 -0.625211,-0.6252104 h -0.170127 c 0,-1.6610542 -0.951706,-3.0990646 -2.338123,-3.8023271 l -0.352689,2.0026312 c -0.02805,0.15875 -0.165894,0.2701396 -0.321469,0.2701396 -0.01905,0 -0.0381,-0.00159 -0.05741,-0.00503 -0.1778,-0.031485 -0.296334,-0.2008187 -0.265113,-0.3786187 l 0.40349,-2.2875875 C 62.816914,4.7804915 62.548097,4.6190956 62.241445,4.6190956 H 61.03177 c -0.306122,0 -0.574675,0.1613959 -0.726016,0.403225 l 0.403225,2.2875875 c 0.03122,0.1778 -0.08731,0.3471333 -0.265113,0.3786188 -0.01879,0.00317 -0.03836,0.00503 -0.05715,0.00503 -0.155575,0 -0.293423,-0.1113895 -0.320939,-0.2701395 L 59.712558,5.4210477 C 58.325612,6.1240456 57.374964,7.562056 57.374964,9.2233748 h -0.170391 c -0.345282,0 -0.625211,0.2799291 -0.625211,0.6252104 0,0.3452808 0.279929,0.6252108 0.625211,0.6252108 z"
               inkscape:connector-curvature="0"
               style="stroke-width:0.26458332" />
          </g>
          <g
             transform="matrix(0.25330316,0,0,0.25330316,33.582678,-24.076043)"
             id="g2325">
            <path
               sodipodi:nodetypes="scccccccssccccss"
               inkscape:connector-curvature="0"
               id="path2347"
               d="m 96.163621,168.15023 h 20.195669 l 12.15791,10.22883 v 7.21248 l -1.00028,3.23857 1.00028,3.23856 v 21.00802 c -0.002,1.78217 -1.44606,3.22642 -3.22823,3.22771 H 96.163621 c -1.753504,0 -3.175001,-1.4215 -3.175001,-3.175 v -20.21944 h 2.414347 v -7.78402 H 92.98862 v -13.80071 c 0,-1.7535 1.421497,-3.175 3.175001,-3.175 z"
               style="opacity:1;fill:#000000;fill-opacity:1;stroke:#ffffff;stroke-width:3.02799225;stroke-linecap:butt;stroke-linejoin:round;stroke-miterlimit:4;stroke-dasharray:none;stroke-dashoffset:0;stroke-opacity:1" />
            <g
               transform="translate(27.856873,32.062071)"
               id="g2353">
              <path
                 style="fill:#ffffff;stroke-width:0.26458332"
                 id="path2026"
                 d="m 73.529787,144.84323 v 30.64404 a 0.52916666,0.52916666 0 0 0 0.529167,0.52916 H 91.73312 a 0.52916666,0.52916666 0 0 0 0.529167,-0.52916 V 144.84323 A 0.52916666,0.52916666 0 0 0 91.73312,144.31406 H 74.058954 a 0.52916666,0.52916666 0 0 0 -0.529167,0.52917 z m 1.058333,0.52916 H 91.203953 V 174.9581 H 74.58812 Z"
                 inkscape:connector-curvature="0" />
              <polygon
                 transform="matrix(0.26458333,0,0,0.26458333,56.498558,130.48958)"
                 id="polygon2028"
                 points="84.75,98.06 115.25,98.06 100,68.28 "
                 style="fill:#ffffff" />
            </g>
          </g>
        </g>
        <path
           style="fill:none;stroke:#000000;stroke-width:4;stroke-linecap:butt;stroke-linejoin:miter;stroke-miterlimit:4;stroke-dasharray:none;stroke-opacity:1;marker-end:url(#Arrow2Send)"
           d="m 45.646227,19.738249 h 40.89697"
           id="path2380"
           inkscape:connector-curvature="0"
           sodipodi:nodetypes="cc" />
      </g>
    </g>
    <flowRoot
       xml:space="preserve"
       id="flowRoot8137"
       style="fill:black;fill-opacity:1;stroke:none;font-family:Ubuntu;font-style:normal;font-weight:normal;font-size:32px;line-height:1.25;letter-spacing:0px;word-spacing:0px;-inkscape-font-specification:'Ubuntu, Normal';font-stretch:normal;font-variant:normal;text-anchor:start;text-align:start;writing-mode:lr;font-variant-ligatures:normal;font-variant-caps:normal;font-variant-numeric:normal;font-feature-settings:normal"><flowRegion
         id="flowRegion8139"><rect
           id="rect8141"
           width="51.51778"
           height="63.63961"
           x="-161.6244"
           y="-108.77584" /></flowRegion><flowPara
         id="flowPara8143"></flowPara></flowRoot>  </g>
</svg>
