{
  "annotations": {
    "list": [
      {
        "builtIn": 1,
        "datasource": {
          "type": "datasource",
          "uid": "grafana"
        },
        "enable": true,
        "hide": true,
        "iconColor": "rgba(0, 211, 255, 1)",
        "name": "Annotations & Alerts",
        "target": {
          "limit": 100,
          "matchAny": false,
          "tags": [],
          "type": "dashboard"
        },
        "type": "dashboard"
      }
    ]
  },
  "description": "Landing dashboard",
  "editable": true,
  "fiscalYearStartMonth": 0,
  "graphTooltip": 0,
  "id": 1,
  "links": [],
  "liveNow": false,
  "panels": [
    {
      "datasource": {
        "type": "influxdb",
        "uid": "nT-paMyMz"
      },
      "gridPos": {
        "h": 6,
        "w": 17,
        "x": 0,
        "y": 0
      },
      "id": 1,
      "options": {
        "content": "<img style=\"background-color:#68896A;\" height=\"200px\"\nsrc='https://gitlab.com/hsr-iet/wabesense/wabesense/-/raw/master/doc/img/WABEsense_background_header.png'>\n",
        "mode": "html"
      },
      "pluginVersion": "9.1.6",
      "targets": [
        {
          "datasource": {
            "type": "influxdb",
            "uid": "nT-paMyMz"
          },
          "refId": "A"
        }
      ],
      "type": "text"
    },
    {
      "datasource": {
        "type": "influxdb",
        "uid": "nT-paMyMz"
      },
      "gridPos": {
        "h": 21,
        "w": 7,
        "x": 17,
        "y": 0
      },
      "id": 4,
      "links": [],
      "options": {
        "feedUrl": "https://hsr-iet.gitlab.io/wabesense/blog/feeds/all.rss.xml",
        "showImage": true
      },
      "targets": [
        {
          "datasource": {
            "type": "influxdb",
            "uid": "nT-paMyMz"
          },
          "refId": "A"
        }
      ],
      "title": "Latest from the blog",
      "type": "news"
    },
    {
      "datasource": {
        "type": "influxdb",
        "uid": "nT-paMyMz"
      },
      "gridPos": {
        "h": 15,
        "w": 5,
        "x": 0,
        "y": 6
      },
      "id": 3,
      "links": [],
      "options": {
        "maxItems": 10,
        "query": "",
        "showHeadings": true,
        "showRecentlyViewed": true,
        "showSearch": false,
        "showStarred": true,
        "tags": []
      },
      "pluginVersion": "9.1.6",
      "tags": [],
      "targets": [
        {
          "datasource": {
            "type": "influxdb",
            "uid": "nT-paMyMz"
          },
          "refId": "A"
        }
      ],
      "title": "Dashboards",
      "type": "dashlist"
    },
    {
      "datasource": {
        "type": "influxdb",
        "uid": "nT-paMyMz"
      },
      "description": "Connections received in the last 24 hours",
      "fieldConfig": {
        "defaults": {
          "color": {
            "mode": "thresholds"
          },
          "custom": {
            "displayMode": "auto",
            "filterable": false,
            "inspect": false
          },
          "mappings": [],
          "thresholds": {
            "mode": "absolute",
            "steps": []
          }
        },
        "overrides": [
          {
            "matcher": {
              "id": "byName",
              "options": "operator"
            },
            "properties": [
              {
                "id": "custom.width",
                "value": 78
              }
            ]
          }
        ]
      },
      "gridPos": {
        "h": 15,
        "w": 6,
        "x": 5,
        "y": 6
      },
      "id": 6,
      "options": {
        "footer": {
          "fields": "",
          "reducer": [
            "sum"
          ],
          "show": false
        },
        "showHeader": true,
        "sortBy": []
      },
      "pluginVersion": "9.1.6",
      "targets": [
        {
          "datasource": {
            "type": "influxdb",
            "uid": "nT-paMyMz"
          },
          "groupBy": [
            {
              "params": [
                "$__interval"
              ],
              "type": "time"
            },
            {
              "params": [
                "null"
              ],
              "type": "fill"
            }
          ],
          "orderByTime": "ASC",
          "policy": "default",
          "query": "toemoji = (s, ts) => {\n    ts_ = if uint(v: ts) > 0 then uint(v: ts) else uint(v: now())\n    too_old = int(v: duration(v: uint(v: now()) - ts_)) > int(v: 12h)\n    heartb = if too_old then \"offline\" else \"\\xF0\\x9F\\x92\\x93\" \n    emoji = if s == \"heartbeat\" then  heartb\n            else if s == \"transfer\" then \"\\xF0\\x9F\\x92\\xBE\" \n            else s\n    return emoji\n}\n\nfrom(bucket: \"reporters\")  \n    |> range(start: -1y)\n    |> filter(fn: (r) => r._measurement == \"connections\")\n    |> keep(columns: [\"_time\", \"reporter\", \"type\"])\n    |> group(columns: [\"reporter\"])\n    |> max(column: \"_time\")\n    |> group()\n    |> map(fn: (r) => ({_time: r._time, operator: r.reporter, status: toemoji(s: r.type, ts: r._time)}))\n    |> sort(columns: [\"_time\"], desc: true)",
          "refId": "A",
          "resultFormat": "time_series",
          "select": [
            [
              {
                "params": [
                  "value"
                ],
                "type": "field"
              },
              {
                "params": [],
                "type": "mean"
              }
            ]
          ],
          "tags": []
        }
      ],
      "title": "Latest connections",
      "transformations": [
        {
          "id": "renameByRegex",
          "options": {
            "regex": "^_(.*)",
            "renamePattern": "$1"
          }
        }
      ],
      "type": "table"
    },
    {
      "datasource": {
        "type": "influxdb",
        "uid": "nT-paMyMz"
      },
      "description": "Data uploads in the last 2 months",
      "fieldConfig": {
        "defaults": {
          "color": {
            "mode": "thresholds"
          },
          "custom": {
            "displayMode": "auto",
            "filterable": false,
            "inspect": false
          },
          "mappings": [],
          "thresholds": {
            "mode": "absolute",
            "steps": []
          }
        },
        "overrides": [
          {
            "matcher": {
              "id": "byName",
              "options": "operator"
            },
            "properties": [
              {
                "id": "custom.width",
                "value": 78
              }
            ]
          }
        ]
      },
      "gridPos": {
        "h": 15,
        "w": 6,
        "x": 11,
        "y": 6
      },
      "id": 7,
      "options": {
        "footer": {
          "fields": "",
          "reducer": [
            "sum"
          ],
          "show": false
        },
        "showHeader": true,
        "sortBy": []
      },
      "pluginVersion": "9.1.6",
      "targets": [
        {
          "datasource": {
            "type": "influxdb",
            "uid": "nT-paMyMz"
          },
          "groupBy": [
            {
              "params": [
                "$__interval"
              ],
              "type": "time"
            },
            {
              "params": [
                "null"
              ],
              "type": "fill"
            }
          ],
          "orderByTime": "ASC",
          "policy": "default",
          "query": "toemoji = (s) => if s == \"heartbeat\" then \"\\xF0\\x9F\\x92\\x93\" else if s == \"transfer\" then \"\\xF0\\x9F\\x92\\xBE\" else s\n    \nfrom(bucket: \"reporters\")  \n    |> range(start: -2mo)\n    |> filter(fn: (r) => r._measurement == \"connections\" and r.type == \"transfer\")\n    |> keep(columns: [\"_time\", \"reporter\", \"type\"])\n    |> group(columns: [\"reporter\"])\n    |> max(column: \"_time\")\n    |> group()\n    |> map(fn: (r) => ({_time: r._time, operator: r.reporter, type: toemoji(s: r.type)}))\n    |> sort(columns: [\"_time\"], desc: true)",
          "refId": "A",
          "resultFormat": "time_series",
          "select": [
            [
              {
                "params": [
                  "value"
                ],
                "type": "field"
              },
              {
                "params": [],
                "type": "mean"
              }
            ]
          ],
          "tags": []
        }
      ],
      "title": "Data uploads",
      "transformations": [
        {
          "id": "renameByRegex",
          "options": {
            "regex": "^_(.*)",
            "renamePattern": "$1"
          }
        }
      ],
      "type": "table"
    }
  ],
  "refresh": false,
  "schemaVersion": 37,
  "style": "dark",
  "tags": [],
  "templating": {
    "list": []
  },
  "time": {
    "from": "now-24h",
    "to": "now"
  },
  "timepicker": {
    "hidden": true,
    "refresh_intervals": [],
    "time_options": [
      "5m",
      "15m",
      "1h",
      "6h",
      "12h",
      "24h",
      "2d",
      "7d",
      "30d"
    ],
    "type": "timepicker"
  },
  "timezone": "browser",
  "title": "Home",
  "uid": "1_xlwf5Mk2",
  "version": 14,
  "weekStart": ""
}
