{
  "annotations": {
    "list": [
      {
        "builtIn": 1,
        "datasource": {
          "type": "datasource",
          "uid": "grafana"
        },
        "enable": true,
        "hide": true,
        "iconColor": "rgba(0, 211, 255, 1)",
        "name": "Annotations & Alerts",
        "target": {
          "limit": 100,
          "matchAny": false,
          "tags": [],
          "type": "dashboard"
        },
        "type": "dashboard"
      }
    ]
  },
  "description": "Internal logger sensors",
  "editable": true,
  "fiscalYearStartMonth": 0,
  "graphTooltip": 0,
  "id": 3,
  "links": [],
  "liveNow": false,
  "panels": [
    {
      "datasource": {
        "type": "influxdb",
        "uid": "nT-paMyMz"
      },
      "fieldConfig": {
        "defaults": {
          "color": {
            "mode": "palette-classic"
          },
          "custom": {
            "axisCenteredZero": false,
            "axisColorMode": "text",
            "axisLabel": "",
            "axisPlacement": "auto",
            "barAlignment": 0,
            "drawStyle": "points",
            "fillOpacity": 10,
            "gradientMode": "none",
            "hideFrom": {
              "legend": false,
              "tooltip": false,
              "viz": false
            },
            "lineInterpolation": "linear",
            "lineWidth": 1,
            "pointSize": 2,
            "scaleDistribution": {
              "type": "linear"
            },
            "showPoints": "never",
            "spanNulls": true,
            "stacking": {
              "group": "A",
              "mode": "none"
            },
            "thresholdsStyle": {
              "mode": "off"
            }
          },
          "mappings": [],
          "thresholds": {
            "mode": "absolute",
            "steps": [
              {
                "color": "green",
                "value": null
              },
              {
                "color": "red",
                "value": 80
              }
            ]
          },
          "unit": "celsius"
        },
        "overrides": []
      },
      "gridPos": {
        "h": 10,
        "w": 12,
        "x": 0,
        "y": 0
      },
      "id": 2,
      "maxDataPoints": 10000,
      "options": {
        "legend": {
          "calcs": [],
          "displayMode": "list",
          "placement": "bottom",
          "showLegend": true
        },
        "tooltip": {
          "mode": "single",
          "sort": "none"
        }
      },
      "pluginVersion": "8.0.0",
      "targets": [
        {
          "datasource": {
            "type": "influxdb",
            "uid": "nT-paMyMz"
          },
          "groupBy": [
            {
              "params": [
                "$__interval"
              ],
              "type": "time"
            },
            {
              "params": [
                "null"
              ],
              "type": "fill"
            }
          ],
          "orderByTime": "ASC",
          "policy": "default",
          "query": "from(bucket: ${operator:doublequote})\n  |> range(start: v.timeRangeStart, stop:v.timeRangeStop)\n  |> filter(fn: (r) => r._measurement == \"loggersensors\" and r.sensor == \"BME\" and r.magnitude == \"temperature\" and r.auto_sample == \"True\")\n  |> map(fn: (r) => ({_time:r._time, _value:r._value, _field:r.wabeid}))",
          "refId": "logger",
          "resultFormat": "time_series",
          "select": [
            [
              {
                "params": [
                  "value"
                ],
                "type": "field"
              },
              {
                "params": [],
                "type": "mean"
              }
            ]
          ],
          "tags": []
        }
      ],
      "title": "Temperature",
      "type": "timeseries"
    },
    {
      "datasource": {
        "type": "influxdb",
        "uid": "nT-paMyMz"
      },
      "fieldConfig": {
        "defaults": {
          "color": {
            "mode": "palette-classic"
          },
          "custom": {
            "axisCenteredZero": false,
            "axisColorMode": "text",
            "axisLabel": "",
            "axisPlacement": "auto",
            "barAlignment": 0,
            "drawStyle": "points",
            "fillOpacity": 10,
            "gradientMode": "none",
            "hideFrom": {
              "legend": false,
              "tooltip": false,
              "viz": false
            },
            "lineInterpolation": "linear",
            "lineWidth": 1,
            "pointSize": 2,
            "scaleDistribution": {
              "type": "linear"
            },
            "showPoints": "never",
            "spanNulls": true,
            "stacking": {
              "group": "A",
              "mode": "none"
            },
            "thresholdsStyle": {
              "mode": "off"
            }
          },
          "mappings": [],
          "thresholds": {
            "mode": "absolute",
            "steps": [
              {
                "color": "green",
                "value": null
              },
              {
                "color": "red",
                "value": 80
              }
            ]
          },
          "unit": "pressurepa"
        },
        "overrides": []
      },
      "gridPos": {
        "h": 10,
        "w": 12,
        "x": 12,
        "y": 0
      },
      "id": 3,
      "maxDataPoints": 10000,
      "options": {
        "legend": {
          "calcs": [],
          "displayMode": "list",
          "placement": "bottom",
          "showLegend": true
        },
        "tooltip": {
          "mode": "single",
          "sort": "none"
        }
      },
      "pluginVersion": "8.0.0",
      "targets": [
        {
          "datasource": {
            "type": "influxdb",
            "uid": "nT-paMyMz"
          },
          "groupBy": [
            {
              "params": [
                "$__interval"
              ],
              "type": "time"
            },
            {
              "params": [
                "null"
              ],
              "type": "fill"
            }
          ],
          "orderByTime": "ASC",
          "policy": "default",
          "query": "from(bucket: ${operator:doublequote})\n  |> range(start: v.timeRangeStart, stop:v.timeRangeStop)\n  |> filter(fn: (r) => r._measurement == \"loggersensors\" and r.sensor == \"BME\" and r.magnitude == \"pressure\" and r.auto_sample == \"True\")\n  |> map(fn: (r) => ({_time:r._time, _value:r._value, _field:r.wabeid}))",
          "refId": "logger",
          "resultFormat": "time_series",
          "select": [
            [
              {
                "params": [
                  "value"
                ],
                "type": "field"
              },
              {
                "params": [],
                "type": "mean"
              }
            ]
          ],
          "tags": []
        }
      ],
      "title": "Atmospheric pressure",
      "type": "timeseries"
    },
    {
      "datasource": {
        "type": "influxdb",
        "uid": "nT-paMyMz"
      },
      "fieldConfig": {
        "defaults": {
          "color": {
            "mode": "palette-classic"
          },
          "custom": {
            "axisCenteredZero": false,
            "axisColorMode": "text",
            "axisLabel": "",
            "axisPlacement": "auto",
            "barAlignment": 0,
            "drawStyle": "points",
            "fillOpacity": 10,
            "gradientMode": "none",
            "hideFrom": {
              "legend": false,
              "tooltip": false,
              "viz": false
            },
            "lineInterpolation": "linear",
            "lineWidth": 1,
            "pointSize": 2,
            "scaleDistribution": {
              "type": "linear"
            },
            "showPoints": "never",
            "spanNulls": true,
            "stacking": {
              "group": "A",
              "mode": "none"
            },
            "thresholdsStyle": {
              "mode": "off"
            }
          },
          "mappings": [],
          "thresholds": {
            "mode": "absolute",
            "steps": [
              {
                "color": "green",
                "value": null
              },
              {
                "color": "red",
                "value": 80
              }
            ]
          },
          "unit": "humidity"
        },
        "overrides": []
      },
      "gridPos": {
        "h": 10,
        "w": 12,
        "x": 0,
        "y": 10
      },
      "id": 4,
      "maxDataPoints": 10000,
      "options": {
        "legend": {
          "calcs": [],
          "displayMode": "list",
          "placement": "bottom",
          "showLegend": true
        },
        "tooltip": {
          "mode": "single",
          "sort": "none"
        }
      },
      "pluginVersion": "8.0.0",
      "targets": [
        {
          "datasource": {
            "type": "influxdb",
            "uid": "nT-paMyMz"
          },
          "groupBy": [
            {
              "params": [
                "$__interval"
              ],
              "type": "time"
            },
            {
              "params": [
                "null"
              ],
              "type": "fill"
            }
          ],
          "orderByTime": "ASC",
          "policy": "default",
          "query": "from(bucket: ${operator:doublequote})\n  |> range(start: v.timeRangeStart, stop:v.timeRangeStop)\n  |> filter(fn: (r) => r._measurement == \"loggersensors\" and r.sensor == \"BME\" and r.magnitude == \"humidity\" and r.auto_sample == \"True\")\n  |> map(fn: (r) => ({_time:r._time, _value:r._value, _field:r.wabeid}))",
          "refId": "logger",
          "resultFormat": "time_series",
          "select": [
            [
              {
                "params": [
                  "value"
                ],
                "type": "field"
              },
              {
                "params": [],
                "type": "mean"
              }
            ]
          ],
          "tags": []
        }
      ],
      "title": "Relative humidity",
      "type": "timeseries"
    },
    {
      "datasource": {
        "type": "influxdb",
        "uid": "nT-paMyMz"
      },
      "fieldConfig": {
        "defaults": {
          "color": {
            "mode": "palette-classic"
          },
          "custom": {
            "axisCenteredZero": false,
            "axisColorMode": "text",
            "axisLabel": "",
            "axisPlacement": "auto",
            "barAlignment": 0,
            "drawStyle": "points",
            "fillOpacity": 10,
            "gradientMode": "none",
            "hideFrom": {
              "legend": false,
              "tooltip": false,
              "viz": false
            },
            "lineInterpolation": "linear",
            "lineWidth": 1,
            "pointSize": 2,
            "scaleDistribution": {
              "type": "linear"
            },
            "showPoints": "never",
            "spanNulls": true,
            "stacking": {
              "group": "A",
              "mode": "none"
            },
            "thresholdsStyle": {
              "mode": "off"
            }
          },
          "mappings": [],
          "thresholds": {
            "mode": "absolute",
            "steps": [
              {
                "color": "green",
                "value": null
              },
              {
                "color": "red",
                "value": 80
              }
            ]
          },
          "unit": "volt"
        },
        "overrides": []
      },
      "gridPos": {
        "h": 10,
        "w": 12,
        "x": 12,
        "y": 10
      },
      "id": 5,
      "maxDataPoints": 10000,
      "options": {
        "legend": {
          "calcs": [],
          "displayMode": "list",
          "placement": "bottom",
          "showLegend": true
        },
        "tooltip": {
          "mode": "single",
          "sort": "none"
        }
      },
      "pluginVersion": "8.0.0",
      "targets": [
        {
          "datasource": {
            "type": "influxdb",
            "uid": "nT-paMyMz"
          },
          "groupBy": [
            {
              "params": [
                "$__interval"
              ],
              "type": "time"
            },
            {
              "params": [
                "null"
              ],
              "type": "fill"
            }
          ],
          "orderByTime": "ASC",
          "policy": "default",
          "query": "from(bucket: ${operator:doublequote})\n  |> range(start: v.timeRangeStart, stop:v.timeRangeStop)\n  |> filter(fn: (r) => r._measurement == \"loggersensors\" and r.sensor == \"battery\" and r.auto_sample == \"True\")\n  |> map(fn: (r) => ({_time:r._time, _value:r._value, _field:r.wabeid}))",
          "refId": "logger",
          "resultFormat": "time_series",
          "select": [
            [
              {
                "params": [
                  "value"
                ],
                "type": "field"
              },
              {
                "params": [],
                "type": "mean"
              }
            ]
          ],
          "tags": []
        }
      ],
      "title": "Battery voltage",
      "type": "timeseries"
    }
  ],
  "refresh": false,
  "schemaVersion": 37,
  "style": "dark",
  "tags": [],
  "templating": {
    "list": [
      {
        "current": {
          "selected": false,
          "text": "null",
          "value": "null"
        },
        "datasource": {
          "type": "influxdb",
          "uid": "nT-paMyMz"
        },
        "definition": "user = ${__user.login:doublequote}\nbuckets()\n  |> map(fn: (r) => ({ r with found: if r.name == user then 0 else 1}))\n  |> sort(columns: [\"found\"])\n  |> keep(columns: [\"name\"])\n  |> filter(fn: (r) => r.name != \"reporters\")",
        "description": "all operators, with the current user first",
        "hide": 0,
        "includeAll": false,
        "label": "operator",
        "multi": false,
        "name": "operator",
        "options": [],
        "query": "user = ${__user.login:doublequote}\nbuckets()\n  |> map(fn: (r) => ({ r with found: if r.name == user then 0 else 1}))\n  |> sort(columns: [\"found\"])\n  |> keep(columns: [\"name\"])\n  |> filter(fn: (r) => r.name != \"reporters\")",
        "refresh": 1,
        "regex": "",
        "skipUrlSync": false,
        "sort": 0,
        "tagValuesQuery": "",
        "tagsQuery": "",
        "type": "query",
        "useTags": false
      },
      {
        "current": {
          "selected": false,
          "text": "null",
          "value": "null"
        },
        "datasource": {
          "type": "influxdb",
          "uid": "nT-paMyMz"
        },
        "definition": "user = ${__user.login:doublequote}\nfound = buckets()|> keep(columns: [\"name\"]) |> map(fn: (r) => ({ r with found: r.name == user}))\nanyfound = found\n  |> reduce(fn: (r, accumulator) => ({ any: r.found or accumulator.any }), identity: {any: false})\n  |> last(column: \"any\")\n  |> findRecord(fn: (key) => true, idx: 0)\nnames = buckets()|> keep(columns: [\"name\"]) |> map(fn: (r) => ({r with any: anyfound.any}))\n\njoin(tables: {names, found}, on: [\"name\"])\n    |> filter(fn: (r) => r.any == r.found and r.name != \"reporters\")\n    |> keep(columns: [\"name\"])",
        "description": "",
        "hide": 2,
        "includeAll": false,
        "label": "operator",
        "multi": false,
        "name": "operator_current",
        "options": [],
        "query": "user = ${__user.login:doublequote}\nfound = buckets()|> keep(columns: [\"name\"]) |> map(fn: (r) => ({ r with found: r.name == user}))\nanyfound = found\n  |> reduce(fn: (r, accumulator) => ({ any: r.found or accumulator.any }), identity: {any: false})\n  |> last(column: \"any\")\n  |> findRecord(fn: (key) => true, idx: 0)\nnames = buckets()|> keep(columns: [\"name\"]) |> map(fn: (r) => ({r with any: anyfound.any}))\n\njoin(tables: {names, found}, on: [\"name\"])\n    |> filter(fn: (r) => r.any == r.found and r.name != \"reporters\")\n    |> keep(columns: [\"name\"])",
        "refresh": 1,
        "regex": "",
        "skipUrlSync": false,
        "sort": 1,
        "tagValuesQuery": "",
        "tagsQuery": "",
        "type": "query",
        "useTags": false
      }
    ]
  },
  "time": {
    "from": "now-30d",
    "to": "now"
  },
  "timepicker": {},
  "timezone": "",
  "title": "Logger",
  "uid": "kgt6XcyGz",
  "version": 28,
  "weekStart": ""
}
