<?xml version="1.0" encoding="UTF-8" standalone="no"?>
<!-- Created with Inkscape (http://www.inkscape.org/) -->

<svg
   xmlns:dc="http://purl.org/dc/elements/1.1/"
   xmlns:cc="http://creativecommons.org/ns#"
   xmlns:rdf="http://www.w3.org/1999/02/22-rdf-syntax-ns#"
   xmlns:svg="http://www.w3.org/2000/svg"
   xmlns="http://www.w3.org/2000/svg"
   xmlns:xlink="http://www.w3.org/1999/xlink"
   xmlns:sodipodi="http://sodipodi.sourceforge.net/DTD/sodipodi-0.dtd"
   xmlns:inkscape="http://www.inkscape.org/namespaces/inkscape"
   sodipodi:docname="outflow_sensors.svg"
   inkscape:version="0.92.5 (2060ec1f9f, 2020-04-08)"
   version="1.1"
   id="svg3070"
   height="345.64252"
   width="360.34552"
   viewBox="0 0 252.24187 241.94977"
   inkscape:export-filename="/home/juanpi/Projects/HSR/WABEsense/wabesense/doc/img/outflow_sensors.png"
   inkscape:export-xdpi="96"
   inkscape:export-ydpi="96">
  <sodipodi:namedview
     id="base"
     pagecolor="#ffffff"
     bordercolor="#666666"
     borderopacity="1.0"
     inkscape:pageopacity="0.0"
     inkscape:pageshadow="2"
     inkscape:zoom="1.4"
     inkscape:cx="107.67489"
     inkscape:cy="213.77735"
     inkscape:document-units="px"
     inkscape:current-layer="layer1"
     showgrid="false"
     inkscape:window-width="1920"
     inkscape:window-height="1016"
     inkscape:window-x="0"
     inkscape:window-y="27"
     inkscape:window-maximized="1"
     fit-margin-top="0"
     fit-margin-left="0"
     fit-margin-right="0"
     fit-margin-bottom="0"
     showguides="true"
     inkscape:guide-bbox="true"
     scale-x="0.7" />
  <defs
     id="defs3072">
    <marker
       inkscape:stockid="DotM"
       orient="auto"
       refY="0"
       refX="0"
       id="DotM"
       style="overflow:visible">
      <path
         inkscape:connector-curvature="0"
         id="path3935"
         d="m -2.5,-1 c 0,2.76 -2.24,5 -5,5 -2.76,0 -5,-2.24 -5,-5 0,-2.76 2.24,-5 5,-5 2.76,0 5,2.24 5,5 z"
         style="fill-rule:evenodd;stroke:#000000;stroke-width:1.00000003pt"
         transform="matrix(0.4,0,0,0.4,2.96,0.4)" />
    </marker>
    <marker
       inkscape:stockid="Arrow1Send"
       orient="auto"
       refY="0"
       refX="0"
       id="Arrow1Send"
       style="overflow:visible">
      <path
         inkscape:connector-curvature="0"
         id="path3886"
         d="M 0,0 5,-5 -12.5,0 5,5 Z"
         style="fill-rule:evenodd;stroke:#000000;stroke-width:1.00000003pt"
         transform="matrix(-0.2,0,0,-0.2,-1.2,0)" />
    </marker>
    <marker
       inkscape:stockid="Arrow1Mend"
       orient="auto"
       refY="0"
       refX="0"
       id="Arrow1Mend"
       style="overflow:visible">
      <path
         inkscape:connector-curvature="0"
         id="path3880"
         d="M 0,0 5,-5 -12.5,0 5,5 Z"
         style="fill-rule:evenodd;stroke:#000000;stroke-width:1.00000003pt"
         transform="matrix(-0.4,0,0,-0.4,-4,0)" />
    </marker>
    <marker
       inkscape:stockid="Arrow1Mstart"
       orient="auto"
       refY="0"
       refX="0"
       id="Arrow1Mstart"
       style="overflow:visible">
      <path
         id="path4219"
         d="M 0,0 5,-5 -12.5,0 5,5 Z"
         style="fill-rule:evenodd;stroke:#000000;stroke-width:1.00000003pt"
         transform="matrix(0.4,0,0,0.4,4,0)"
         inkscape:connector-curvature="0" />
    </marker>
    <marker
       inkscape:stockid="Arrow1Mend"
       orient="auto"
       refY="0"
       refX="0"
       id="Arrow1Mend-8"
       style="overflow:visible">
      <path
         id="path4222"
         d="M 0,0 5,-5 -12.5,0 5,5 Z"
         style="fill-rule:evenodd;stroke:#000000;stroke-width:1.00000003pt"
         transform="matrix(-0.4,0,0,-0.4,-4,0)"
         inkscape:connector-curvature="0" />
    </marker>
    <marker
       inkscape:stockid="Arrow1Mstart5"
       orient="auto"
       refY="0"
       refX="0"
       id="Arrow1Mstart5"
       style="overflow:visible">
      <path
         id="path4757"
         d="M 0,0 5,-5 -12.5,0 5,5 Z"
         style="fill:#ff0000;fill-rule:evenodd;stroke:#ff0000;stroke-width:1.00000003pt"
         transform="matrix(0.4,0,0,0.4,4,0)"
         inkscape:connector-curvature="0" />
    </marker>
    <marker
       inkscape:stockid="Arrow1Mendw"
       orient="auto"
       refY="0"
       refX="0"
       id="Arrow1Mendw"
       style="overflow:visible">
      <path
         inkscape:connector-curvature="0"
         id="path4760"
         d="M 0,0 5,-5 -12.5,0 5,5 Z"
         style="fill:#ff0000;fill-rule:evenodd;stroke:#ff0000;stroke-width:1.00000003pt"
         transform="matrix(-0.4,0,0,-0.4,-4,0)" />
    </marker>
    <marker
       inkscape:stockid="DotMH"
       orient="auto"
       refY="0"
       refX="0"
       id="DotMH"
       style="overflow:visible">
      <path
         inkscape:connector-curvature="0"
         id="path6048"
         d="m -2.5,-1 c 0,2.76 -2.24,5 -5,5 -2.76,0 -5,-2.24 -5,-5 0,-2.76 2.24,-5 5,-5 2.76,0 5,2.24 5,5 z"
         style="fill:#0000ff;fill-rule:evenodd;stroke:#0000ff;stroke-width:1.00000003pt"
         transform="matrix(0.4,0,0,0.4,2.96,0.4)" />
    </marker>
    <marker
       inkscape:stockid="DotMg"
       orient="auto"
       refY="0"
       refX="0"
       id="DotMg"
       style="overflow:visible">
      <path
         inkscape:connector-curvature="0"
         id="path6051"
         d="m -2.5,-1 c 0,2.76 -2.24,5 -5,5 -2.76,0 -5,-2.24 -5,-5 0,-2.76 2.24,-5 5,-5 2.76,0 5,2.24 5,5 z"
         style="fill:#0000ff;fill-rule:evenodd;stroke:#0000ff;stroke-width:1.00000003pt"
         transform="matrix(0.4,0,0,0.4,2.96,0.4)" />
    </marker>
    <marker
       inkscape:stockid="Arrow1Mstart5s"
       orient="auto"
       refY="0"
       refX="0"
       id="Arrow1Mstart5s"
       style="overflow:visible">
      <path
         id="path6453"
         d="M 0,0 5,-5 -12.5,0 5,5 Z"
         style="fill:#008000;fill-rule:evenodd;stroke:#008000;stroke-width:1.00000003pt"
         transform="matrix(0.4,0,0,0.4,4,0)"
         inkscape:connector-curvature="0" />
    </marker>
    <marker
       inkscape:stockid="Arrow1Mendw2"
       orient="auto"
       refY="0"
       refX="0"
       id="Arrow1Mendw2"
       style="overflow:visible">
      <path
         inkscape:connector-curvature="0"
         id="path6456"
         d="M 0,0 5,-5 -12.5,0 5,5 Z"
         style="fill:#008000;fill-rule:evenodd;stroke:#008000;stroke-width:1.00000003pt"
         transform="matrix(-0.4,0,0,-0.4,-4,0)" />
    </marker>
  </defs>
  <metadata
     id="metadata3075">
    <rdf:RDF>
      <cc:Work
         rdf:about="">
        <dc:format>image/svg+xml</dc:format>
        <dc:type
           rdf:resource="http://purl.org/dc/dcmitype/StillImage" />
        <dc:title></dc:title>
      </cc:Work>
    </rdf:RDF>
  </metadata>
  <g
     transform="translate(-36.003536,-37.114082)"
     inkscape:label="Layer 1"
     inkscape:groupmode="layer"
     id="layer1">
    <path
       sodipodi:nodetypes="ccccccc"
       inkscape:connector-curvature="0"
       id="path3083"
       d="M 275.22646,88.691505 H 196.84181 V 38.611489 H 37.375645 V 127.06245 H 275.01403 Z"
       style="fill:#cccccc;stroke:none" />
    <g
       id="g4321"
       transform="matrix(0.3576655,0,0,0.3577145,14.946556,-5.6668708)"
       style="stroke-width:4.93243361;stroke-miterlimit:4;stroke-dasharray:none">
      <path
         sodipodi:nodetypes="ccccccc"
         inkscape:connector-curvature="0"
         id="rect3078"
         d="M 62.84375,368.78125 V 792.375 H 508.5625 V 458.0625 h 219.1563 v -89.28125 z"
         style="fill:#d5f6ff;fill-opacity:1;stroke:none" />
      <path
         sodipodi:nodetypes="csc"
         inkscape:connector-curvature="0"
         id="path3853"
         d="m 485.71429,789.50504 c -5.45687,-199.0404 -12.75873,-302.9124 18.926,-337.17436 17.37103,-18.78398 89.54797,-9.73295 222.50257,-8.53992"
         style="fill:none;stroke:#000000;stroke-width:2.795717;stroke-linecap:butt;stroke-linejoin:miter;stroke-miterlimit:4;stroke-dasharray:none;stroke-opacity:1" />
      <path
         sodipodi:nodetypes="csc"
         inkscape:connector-curvature="0"
         id="path3855"
         d="M 340,795.21932 C 426.50907,615.12671 458.20727,493.91539 495.26019,449.55665 517.8382,422.52687 565.30847,430.23598 727.14286,429.50504"
         style="fill:none;stroke:#000000;stroke-width:2.795717;stroke-linecap:butt;stroke-linejoin:miter;stroke-miterlimit:4;stroke-dasharray:none;stroke-opacity:1" />
      <path
         sodipodi:nodetypes="csc"
         inkscape:connector-curvature="0"
         id="path3857"
         d="M 177.14286,795.21933 C 255.94452,671.89746 420.1025,510.71574 491.38683,441.23927 529.1629,404.42125 560.59201,415.52889 727.14286,415.21933"
         style="fill:none;stroke:#000000;stroke-width:2.795717;stroke-linecap:butt;stroke-linejoin:miter;stroke-miterlimit:4;stroke-dasharray:none;stroke-opacity:1" />
      <path
         sodipodi:nodetypes="csc"
         inkscape:connector-curvature="0"
         id="path3859"
         d="M 64.213925,715.62543 C 158.17853,640.37472 380.24449,490.46236 481.2192,427.28625 c 57.35995,-35.88798 88.22661,-27.43811 245.92366,-26.35264"
         style="fill:none;stroke:#000000;stroke-width:2.795717;stroke-linecap:butt;stroke-linejoin:miter;stroke-miterlimit:4;stroke-dasharray:none;stroke-opacity:1" />
      <path
         sodipodi:nodetypes="csc"
         inkscape:connector-curvature="0"
         id="path3861"
         d="M 59.163162,516.46227 C 170.25502,492.92178 344.20979,428.49525 454.58679,402.10276 564.96379,375.71026 611.76303,387.3518 727.14286,386.6479"
         style="fill:none;stroke:#000000;stroke-width:2.795717;stroke-linecap:butt;stroke-linejoin:miter;stroke-miterlimit:4;stroke-dasharray:none;stroke-opacity:1" />
      <path
         sodipodi:nodetypes="csc"
         inkscape:connector-curvature="0"
         id="path3863"
         d="m 62.857143,394.66964 c 110.952387,-3.71791 228.380677,-9.19632 342.392447,-13.79448 114.01176,-4.59816 224.607,-8.31607 321.89327,-8.51298"
         style="fill:none;stroke:#000000;stroke-width:2.795717;stroke-linecap:butt;stroke-linejoin:miter;stroke-miterlimit:4;stroke-dasharray:none;stroke-opacity:1" />
      <path
         inkscape:connector-curvature="0"
         id="path3865"
         d="m 665.69053,442.52952 h 29.29442"
         style="fill:none;stroke:#000000;stroke-width:4.19357538;stroke-linecap:butt;stroke-linejoin:miter;stroke-miterlimit:4;stroke-dasharray:none;stroke-opacity:1;marker-end:url(#Arrow1Send)" />
      <use
         height="1052.3622"
         width="744.09448"
         transform="translate(0,-43.010153)"
         id="use4311"
         xlink:href="#path3865"
         y="0"
         x="0"
         style="stroke-width:4.93243361;stroke-miterlimit:4;stroke-dasharray:none" />
      <use
         height="1052.3622"
         width="744.09448"
         transform="translate(0,-28)"
         id="use4313"
         xlink:href="#path3865"
         y="0"
         x="0"
         style="stroke-width:4.93243361;stroke-miterlimit:4;stroke-dasharray:none" />
      <use
         height="1052.3622"
         width="744.09448"
         transform="translate(0,-12.989847)"
         id="use4315"
         xlink:href="#path3865"
         y="0"
         x="0"
         style="stroke-width:4.93243361;stroke-miterlimit:4;stroke-dasharray:none" />
      <use
         height="1052.3622"
         width="744.09448"
         transform="translate(0,-56.020306)"
         id="use4317"
         xlink:href="#path3865"
         y="0"
         x="0"
         style="stroke-width:4.93243361;stroke-miterlimit:4;stroke-dasharray:none" />
      <use
         height="1052.3622"
         width="744.09448"
         transform="translate(0,-70.020306)"
         id="use4319"
         xlink:href="#path3865"
         y="0"
         x="0"
         style="stroke-width:4.93243361;stroke-miterlimit:4;stroke-dasharray:none" />
    </g>
    <path
       style="fill:none;stroke:#000000;stroke-width:1;stroke-linecap:round;stroke-miterlimit:4;stroke-dasharray:none;stroke-dashoffset:0;stroke-opacity:1"
       d="M 196.84181,277.77717 V 158.18874 h 78.38465 m 0,-69.497235 H 196.84181 V 38.611489"
       id="path6376"
       inkscape:connector-curvature="0"
       sodipodi:nodetypes="cccccc" />
    <rect
       y="225.33296"
       x="193.87192"
       height="12.601927"
       width="28.039682"
       id="rect6421"
       style="fill:#ffaaaa;fill-opacity:1;stroke:#000000;stroke-width:1;stroke-linecap:round;stroke-miterlimit:4;stroke-dasharray:none;stroke-dashoffset:0;stroke-opacity:1" />
    <rect
       transform="rotate(90)"
       style="fill:#afe9af;fill-opacity:1;stroke:#000000;stroke-width:1;stroke-linecap:round;stroke-miterlimit:4;stroke-dasharray:none;stroke-dashoffset:0;stroke-opacity:1"
       id="rect4541"
       width="28.039682"
       height="12.601927"
       x="37.614082"
       y="-163.47844" />
    <text
       id="text4682"
       y="235.30577"
       x="225.67316"
       style="color:#000000;font-style:normal;font-variant:normal;font-weight:normal;font-stretch:normal;line-height:0%;font-family:'Roboto Slab';-inkscape-font-specification:'Roboto Slab';text-indent:0;text-align:start;text-decoration:none;text-decoration-line:none;letter-spacing:0px;word-spacing:0px;text-transform:none;writing-mode:lr-tb;direction:ltr;baseline-shift:baseline;text-anchor:start;display:inline;overflow:visible;visibility:visible;fill:#000000;fill-opacity:1;fill-rule:nonzero;stroke:none;stroke-width:1px;marker:none;enable-background:accumulate"
       xml:space="preserve"
       transform="scale(0.9999796,1.0000204)"><tspan
         y="235.30577"
         x="225.67316"
         id="tspan4684"
         sodipodi:role="line"
         style="font-size:10px;line-height:1.25">Drucksensor</tspan></text>
    <g
       style="fill:#ff0000;stroke:#ff0000"
       transform="translate(-1.0714286,-3.5714286)"
       id="g6423">
      <path
         style="fill:#ff0000;stroke:#ff0000;stroke-width:2;stroke-linecap:butt;stroke-linejoin:miter;stroke-miterlimit:4;stroke-dasharray:5.99999998, 5.99999998;stroke-dashoffset:0;stroke-opacity:1"
         d="m 152.89403,235.88748 h 43.42194"
         id="path6425"
         inkscape:connector-curvature="0"
         sodipodi:nodetypes="cc" />
      <path
         sodipodi:nodetypes="cc"
         inkscape:connector-curvature="0"
         id="path6427"
         d="M 157.75249,129.88278 V 234.16612"
         style="fill:#ff0000;stroke:#ff0000;stroke-width:1px;stroke-linecap:butt;stroke-linejoin:miter;stroke-opacity:1;marker-start:url(#Arrow1Mstart5);marker-end:url(#Arrow1Mendw)" />
    </g>
    <path
       sodipodi:nodetypes="cc"
       inkscape:connector-curvature="0"
       id="path6633"
       d="M 156.68106,65.977112 V 123.45184"
       style="fill:#ff0000;stroke:#008000;stroke-width:1px;stroke-linecap:butt;stroke-linejoin:miter;stroke-opacity:1;marker-start:url(#Arrow1Mstart5s);marker-end:url(#Arrow1Mendw2)" />
    <text
       xml:space="preserve"
       style="color:#000000;font-style:normal;font-variant:normal;font-weight:normal;font-stretch:normal;line-height:0%;font-family:'Roboto Slab';-inkscape-font-specification:'Roboto Slab';text-indent:0;text-align:start;text-decoration:none;text-decoration-line:none;letter-spacing:0px;word-spacing:0px;text-transform:none;writing-mode:lr-tb;direction:ltr;baseline-shift:baseline;text-anchor:start;display:inline;overflow:visible;visibility:visible;fill:#000000;fill-opacity:1;fill-rule:nonzero;stroke:none;stroke-width:1px;marker:none;enable-background:accumulate"
       x="141.42857"
       y="166.29076"
       id="text4821"><tspan
         sodipodi:role="line"
         id="tspan4823"
         x="141.42857"
         y="166.29076"
         style="font-size:14px;line-height:1.25">H</tspan></text>
    <text
       transform="scale(0.9999796,1.0000204)"
       id="text4694"
       y="48.416466"
       x="62.61964"
       style="color:#000000;font-style:normal;font-variant:normal;font-weight:normal;font-stretch:normal;line-height:0%;font-family:'Roboto Slab';-inkscape-font-specification:'Roboto Slab';text-indent:0;text-align:start;text-decoration:none;text-decoration-line:none;letter-spacing:0px;word-spacing:0px;text-transform:none;writing-mode:lr-tb;direction:ltr;baseline-shift:baseline;text-anchor:start;display:inline;overflow:visible;visibility:visible;fill:#000000;fill-opacity:1;fill-rule:nonzero;stroke:none;stroke-width:1px;marker:none;enable-background:accumulate"
       xml:space="preserve"><tspan
         y="48.416466"
         x="62.61964"
         id="tspan4696"
         sodipodi:role="line"
         style="font-size:10px;line-height:1.25">Optik- oder </tspan><tspan
         id="tspan4740"
         y="60.916466"
         x="62.61964"
         sodipodi:role="line"
         style="font-size:10px;line-height:1.25">Ultraschallsensor</tspan></text>
    <text
       xml:space="preserve"
       style="color:#000000;font-style:normal;font-variant:normal;font-weight:normal;font-stretch:normal;line-height:0%;font-family:'Roboto Slab';-inkscape-font-specification:'Roboto Slab';text-indent:0;text-align:start;text-decoration:none;text-decoration-line:none;letter-spacing:0px;word-spacing:0px;text-transform:none;writing-mode:lr-tb;direction:ltr;baseline-shift:baseline;text-anchor:start;display:inline;overflow:visible;visibility:visible;fill:#000000;fill-opacity:1;fill-rule:nonzero;stroke:none;stroke-width:1px;marker:none;enable-background:accumulate"
       x="217.19208"
       y="106.24221"
       id="text3069"><tspan
         sodipodi:role="line"
         id="tspan3071"
         x="217.19208"
         y="106.24221"
         style="font-size:14px;line-height:1.25">Abflauf</tspan></text>
    <text
       id="text6372-4"
       y="124.09935"
       x="40.049221"
       style="color:#000000;font-style:normal;font-variant:normal;font-weight:normal;font-stretch:normal;line-height:0%;font-family:'Roboto Slab';-inkscape-font-specification:'Roboto Slab';text-indent:0;text-align:start;text-decoration:none;text-decoration-line:none;letter-spacing:0px;word-spacing:0px;text-transform:none;writing-mode:lr-tb;direction:ltr;baseline-shift:baseline;text-anchor:start;display:inline;overflow:visible;visibility:visible;fill:#000000;fill-opacity:1;fill-rule:nonzero;stroke:none;stroke-width:1px;marker:none;enable-background:accumulate"
       xml:space="preserve"><tspan
         y="124.09935"
         x="40.049221"
         id="tspan6374-3"
         sodipodi:role="line"
         style="font-size:14px;line-height:1.25">Wasserstand</tspan></text>
  </g>
</svg>
