<?xml version="1.0" encoding="UTF-8" standalone="no"?>
<!-- Created with Inkscape (http://www.inkscape.org/) -->

<svg
   xmlns:dc="http://purl.org/dc/elements/1.1/"
   xmlns:cc="http://creativecommons.org/ns#"
   xmlns:rdf="http://www.w3.org/1999/02/22-rdf-syntax-ns#"
   xmlns:svg="http://www.w3.org/2000/svg"
   xmlns="http://www.w3.org/2000/svg"
   xmlns:xlink="http://www.w3.org/1999/xlink"
   xmlns:sodipodi="http://sodipodi.sourceforge.net/DTD/sodipodi-0.dtd"
   xmlns:inkscape="http://www.inkscape.org/namespaces/inkscape"
   width="162.84958mm"
   height="137.42409mm"
   viewBox="0 0 162.84958 137.42409"
   version="1.1"
   id="svg8"
   inkscape:version="0.92.5 (2060ec1f9f, 2020-04-08)"
   sodipodi:docname="wabesense_logo.svg"
   inkscape:export-filename="/home/juanpi/Projects/HSR/Lippuner/wabesense/doc/img/wabesense_logo_bw.png"
   inkscape:export-xdpi="150"
   inkscape:export-ydpi="150">
  <title
     id="title1316">WABEsense logo</title>
  <defs
     id="defs2">
    <marker
       inkscape:stockid="EmptyDiamondS"
       orient="auto"
       refY="0"
       refX="0"
       id="EmptyDiamondS"
       style="overflow:visible"
       inkscape:isstock="true">
      <path
         id="path1062"
         d="M 0,-7.0710768 -7.0710894,0 0,7.0710589 7.0710462,0 Z"
         style="fill:#ffffff;fill-rule:evenodd;stroke:#000000;stroke-width:1.00000003pt;stroke-opacity:1"
         transform="scale(0.2)"
         inkscape:connector-curvature="0" />
    </marker>
    <marker
       inkscape:stockid="EmptyDiamondSstart"
       orient="auto"
       refY="0"
       refX="0"
       id="EmptyDiamondSstart"
       style="overflow:visible"
       inkscape:isstock="true">
      <path
         id="path1071"
         d="M 0,-7.0710768 -7.0710894,0 0,7.0710589 7.0710462,0 Z"
         style="fill:#ffffff;fill-rule:evenodd;stroke:#000000;stroke-width:1.00000003pt;stroke-opacity:1"
         transform="matrix(0.2,0,0,0.2,1.2,0)"
         inkscape:connector-curvature="0" />
    </marker>
  </defs>
  <sodipodi:namedview
     id="base"
     pagecolor="#ffffff"
     bordercolor="#666666"
     borderopacity="1.0"
     inkscape:pageopacity="0"
     inkscape:pageshadow="2"
     inkscape:zoom="1.4"
     inkscape:cx="250.23282"
     inkscape:cy="223.4542"
     inkscape:document-units="mm"
     inkscape:current-layer="layer1"
     showgrid="false"
     inkscape:window-width="1920"
     inkscape:window-height="1016"
     inkscape:window-x="0"
     inkscape:window-y="27"
     inkscape:window-maximized="1"
     showguides="true"
     inkscape:guide-bbox="true"
     inkscape:object-paths="false"
     fit-margin-top="0"
     fit-margin-left="0"
     fit-margin-right="0"
     fit-margin-bottom="0">
    <sodipodi:guide
       position="-73.329933,106.81989"
       orientation="1,0"
       id="guide944"
       inkscape:locked="false" />
    <sodipodi:guide
       position="-86.259095,107.55488"
       orientation="1,0"
       id="guide946"
       inkscape:locked="false" />
    <sodipodi:guide
       position="-81.698809,107.17068"
       orientation="0,1"
       id="guide948"
       inkscape:locked="false" />
  </sodipodi:namedview>
  <metadata
     id="metadata5">
    <rdf:RDF>
      <cc:Work
         rdf:about="">
        <dc:format>image/svg+xml</dc:format>
        <dc:type
           rdf:resource="http://purl.org/dc/dcmitype/StillImage" />
        <dc:title>WABEsense logo</dc:title>
        <cc:license
           rdf:resource="http://creativecommons.org/licenses/by-sa/4.0/" />
      </cc:Work>
      <cc:License
         rdf:about="http://creativecommons.org/licenses/by-sa/4.0/">
        <cc:permits
           rdf:resource="http://creativecommons.org/ns#Reproduction" />
        <cc:permits
           rdf:resource="http://creativecommons.org/ns#Distribution" />
        <cc:requires
           rdf:resource="http://creativecommons.org/ns#Notice" />
        <cc:requires
           rdf:resource="http://creativecommons.org/ns#Attribution" />
        <cc:permits
           rdf:resource="http://creativecommons.org/ns#DerivativeWorks" />
        <cc:requires
           rdf:resource="http://creativecommons.org/ns#ShareAlike" />
      </cc:License>
    </rdf:RDF>
  </metadata>
  <g
     inkscape:label="Layer 1"
     inkscape:groupmode="layer"
     id="layer1"
     transform="translate(-12.776682,-21.159305)">
    <g
       inkscape:export-ydpi="150"
       inkscape:export-xdpi="150"
       id="g4078"
       transform="matrix(5.0228033,0,0,5.0228033,479.80768,-236.90262)">
      <g
         id="g4062">
        <path
           id="path4056"
           style="fill:none;stroke:#000000;stroke-width:0.26458332px;stroke-linecap:butt;stroke-linejoin:round;stroke-opacity:1"
           d="m -60.764143,53.189073 h -1.554574 l -0.457087,-0.913765 -0.507201,1.924323 -0.356861,-2.638767 -0.574017,2.005092 -0.473792,-1.095557 -0.239931,0.718674 h -0.971368 -2.114795 -0.417716 l -0.239931,-0.718674 -0.473792,1.095557 -0.574017,-2.005092 -0.356861,2.638767 -0.507201,-1.924323 -0.457087,0.913765 h -2.254116"
           inkscape:connector-curvature="0"
           sodipodi:nodetypes="cccccccccccccccccc" />
        <circle
           style="opacity:1;fill:#ffffff;fill-opacity:1;stroke:#000000;stroke-width:0.1;stroke-linecap:butt;stroke-linejoin:round;stroke-miterlimit:4;stroke-dasharray:none;stroke-dashoffset:0;stroke-opacity:1"
           id="circle4058"
           cx="-73.28196"
           cy="53.189072"
           r="0.15025221" />
        <circle
           style="opacity:1;fill:#ffffff;fill-opacity:1;stroke:#000000;stroke-width:0.1;stroke-linecap:butt;stroke-linejoin:round;stroke-miterlimit:4;stroke-dasharray:none;stroke-dashoffset:0;stroke-opacity:1"
           id="circle4060"
           cx="-60.760342"
           cy="53.189072"
           r="0.15025221" />
      </g>
      <text
         id="text4066"
         y="58.119045"
         x="-92.98214"
         style="font-style:normal;font-variant:normal;font-weight:normal;font-stretch:condensed;font-size:8.46666622px;line-height:1.25;font-family:Impact;-inkscape-font-specification:'Impact, Condensed';font-variant-ligatures:normal;font-variant-caps:normal;font-variant-numeric:normal;font-feature-settings:normal;text-align:start;letter-spacing:0px;word-spacing:0px;writing-mode:lr-tb;text-anchor:start;fill:#000000;fill-opacity:1;stroke:none;stroke-width:0.26458332"
         xml:space="preserve"><tspan
           style="font-style:normal;font-variant:normal;font-weight:normal;font-stretch:condensed;font-size:8.46666622px;font-family:Impact;-inkscape-font-specification:'Impact, Condensed';font-variant-ligatures:normal;font-variant-caps:normal;font-variant-numeric:normal;font-feature-settings:normal;text-align:start;writing-mode:lr-tb;text-anchor:start;stroke-width:0.26458332"
           y="58.119045"
           x="-92.98214"
           id="tspan4064"
           sodipodi:role="line">WABE</tspan></text>
      <text
         id="text4070"
         y="58.057034"
         x="-73.571045"
         style="font-style:normal;font-variant:normal;font-weight:normal;font-stretch:condensed;font-size:5.29166651px;line-height:1.25;font-family:Impact;-inkscape-font-specification:'Impact, Condensed';font-variant-ligatures:normal;font-variant-caps:normal;font-variant-numeric:normal;font-feature-settings:normal;text-align:start;letter-spacing:0px;word-spacing:0px;writing-mode:lr-tb;text-anchor:start;fill:#000000;fill-opacity:1;stroke:none;stroke-width:0.26458332"
         xml:space="preserve"><tspan
           style="font-style:normal;font-variant:normal;font-weight:normal;font-stretch:condensed;font-size:5.29166651px;font-family:Impact;-inkscape-font-specification:'Impact, Condensed';font-variant-ligatures:normal;font-variant-caps:normal;font-variant-numeric:normal;font-feature-settings:normal;text-align:start;writing-mode:lr-tb;text-anchor:start;stroke-width:0.26458332"
           y="58.057034"
           x="-73.571045"
           id="tspan4068"
           sodipodi:role="line">sense</tspan></text>
      <g
         style="stroke-width:0.92384255"
         transform="matrix(1.1716666,0,0,1,29.264561,-13.630746)"
         id="g4076">
        <path
           id="path4072"
           style="fill:#000000;stroke:#ffffff;stroke-width:0.10116132;stroke-linecap:butt;stroke-linejoin:miter;stroke-miterlimit:4;stroke-dasharray:none;stroke-opacity:1"
           d="m -82.877132,67.202605 c 0,-0.375525 0.530396,-1.357872 0.75857,-2.035327 0.228173,0.677455 0.75857,1.659802 0.75857,2.035327 0,0.375525 -0.216223,0.718759 -0.75857,0.718759 -0.542348,0 -0.75857,-0.343234 -0.75857,-0.718759 z"
           inkscape:connector-curvature="0"
           sodipodi:nodetypes="scscs" />
        <path
           style="fill:none;stroke:#ffffff;stroke-width:0.09238426;stroke-linecap:round;stroke-linejoin:round;stroke-miterlimit:4;stroke-dasharray:none;stroke-opacity:1"
           d="m -82.68586,67.105849 c -0.01238,0.282605 0.144426,0.486408 0.371671,0.584652"
           id="path4074"
           inkscape:connector-curvature="0"
           sodipodi:nodetypes="cc" />
      </g>
    </g>
    <g
       inkscape:export-ydpi="150"
       inkscape:export-xdpi="150"
       transform="matrix(5.0228033,0,0,5.0228033,479.80768,-185.11988)"
       id="g4102">
      <g
         style="stroke:#00833d;stroke-opacity:1"
         id="g4086">
        <path
           sodipodi:nodetypes="cccccccccccccccccc"
           inkscape:connector-curvature="0"
           d="m -60.764143,53.189073 h -1.554574 l -0.457087,-0.913765 -0.507201,1.924323 -0.356861,-2.638767 -0.574017,2.005092 -0.473792,-1.095557 -0.239931,0.718674 h -0.971368 -2.114795 -0.417716 l -0.239931,-0.718674 -0.473792,1.095557 -0.574017,-2.005092 -0.356861,2.638767 -0.507201,-1.924323 -0.457087,0.913765 h -2.254116"
           style="fill:none;stroke:#00833d;stroke-width:0.26458332px;stroke-linecap:butt;stroke-linejoin:round;stroke-opacity:1"
           id="path4080" />
        <circle
           r="0.15025221"
           cy="53.189072"
           cx="-73.28196"
           id="circle4082"
           style="opacity:1;fill:#ffffff;fill-opacity:1;stroke:#00833d;stroke-width:0.1;stroke-linecap:butt;stroke-linejoin:round;stroke-miterlimit:4;stroke-dasharray:none;stroke-dashoffset:0;stroke-opacity:1" />
        <use
           style="stroke:#00833d;stroke-opacity:1"
           height="100%"
           width="100%"
           transform="translate(12.521618)"
           id="use4084"
           xlink:href="#path1270"
           y="0"
           x="0" />
      </g>
      <text
         xml:space="preserve"
         style="font-style:normal;font-variant:normal;font-weight:normal;font-stretch:condensed;font-size:8.46666622px;line-height:1.25;font-family:Impact;-inkscape-font-specification:'Impact, Condensed';font-variant-ligatures:normal;font-variant-caps:normal;font-variant-numeric:normal;font-feature-settings:normal;text-align:start;letter-spacing:0px;word-spacing:0px;writing-mode:lr-tb;text-anchor:start;fill:#000000;fill-opacity:1;stroke:none;stroke-width:0.26458332"
         x="-92.98214"
         y="58.119045"
         id="text4090"><tspan
           sodipodi:role="line"
           id="tspan4088"
           x="-92.98214"
           y="58.119045"
           style="font-style:normal;font-variant:normal;font-weight:normal;font-stretch:condensed;font-size:8.46666622px;font-family:Impact;-inkscape-font-specification:'Impact, Condensed';font-variant-ligatures:normal;font-variant-caps:normal;font-variant-numeric:normal;font-feature-settings:normal;text-align:start;writing-mode:lr-tb;text-anchor:start;stroke-width:0.26458332">WABE</tspan></text>
      <text
         xml:space="preserve"
         style="font-style:normal;font-variant:normal;font-weight:normal;font-stretch:condensed;font-size:5.29166651px;line-height:1.25;font-family:Impact;-inkscape-font-specification:'Impact, Condensed';font-variant-ligatures:normal;font-variant-caps:normal;font-variant-numeric:normal;font-feature-settings:normal;text-align:start;letter-spacing:0px;word-spacing:0px;writing-mode:lr-tb;text-anchor:start;fill:#000000;fill-opacity:1;stroke:none;stroke-width:0.26458332"
         x="-73.571045"
         y="58.057034"
         id="text4094"><tspan
           sodipodi:role="line"
           id="tspan4092"
           x="-73.571045"
           y="58.057034"
           style="font-style:normal;font-variant:normal;font-weight:normal;font-stretch:condensed;font-size:5.29166651px;font-family:Impact;-inkscape-font-specification:'Impact, Condensed';font-variant-ligatures:normal;font-variant-caps:normal;font-variant-numeric:normal;font-feature-settings:normal;text-align:start;writing-mode:lr-tb;text-anchor:start;stroke-width:0.26458332">sense</tspan></text>
      <g
         id="g4100"
         transform="matrix(1.1716666,0,0,1,29.264561,-13.630746)"
         style="fill:#002255;stroke-width:0.92384255">
        <path
           sodipodi:nodetypes="scscs"
           inkscape:connector-curvature="0"
           d="m -82.877132,67.202605 c 0,-0.375525 0.530396,-1.357872 0.75857,-2.035327 0.228173,0.677455 0.75857,1.659802 0.75857,2.035327 0,0.375525 -0.216223,0.718759 -0.75857,0.718759 -0.542348,0 -0.75857,-0.343234 -0.75857,-0.718759 z"
           style="fill:#0069b2;fill-opacity:1;stroke:#ffffff;stroke-width:0.10116132;stroke-linecap:butt;stroke-linejoin:miter;stroke-miterlimit:4;stroke-dasharray:none;stroke-opacity:1"
           id="path4096" />
        <path
           sodipodi:nodetypes="cc"
           inkscape:connector-curvature="0"
           id="path4098"
           d="m -82.68586,67.105849 c -0.01238,0.282605 0.144426,0.486408 0.371671,0.584652"
           style="fill:none;stroke:#ffffff;stroke-width:0.09238426;stroke-linecap:round;stroke-linejoin:round;stroke-miterlimit:4;stroke-dasharray:none;stroke-opacity:1" />
      </g>
    </g>
    <g
       id="g1290"
       transform="matrix(4.9956409,0,0,4.9956409,478.16614,-131.75489)"
       inkscape:export-xdpi="150"
       inkscape:export-ydpi="150">
      <g
         id="g1277"
         style="stroke:#00833d;stroke-opacity:1">
        <path
           id="path882"
           style="fill:none;stroke:#00833d;stroke-width:0.26458332px;stroke-linecap:butt;stroke-linejoin:round;stroke-opacity:1"
           d="m -60.764143,53.189073 h -1.554574 l -0.457087,-0.913765 -0.507201,1.924323 -0.356861,-2.638767 -0.574017,2.005092 -0.473792,-1.095557 -0.239931,0.718674 h -0.971368 -2.114795 -0.417716 l -0.239931,-0.718674 -0.473792,1.095557 -0.574017,-2.005092 -0.356861,2.638767 -0.507201,-1.924323 -0.457087,0.913765 h -2.254116"
           inkscape:connector-curvature="0"
           sodipodi:nodetypes="cccccccccccccccccc" />
        <circle
           style="opacity:1;fill:#ffffff;fill-opacity:1;stroke:#00833d;stroke-width:0.1;stroke-linecap:butt;stroke-linejoin:round;stroke-miterlimit:4;stroke-dasharray:none;stroke-dashoffset:0;stroke-opacity:1"
           id="path1270"
           cx="-73.28196"
           cy="53.189072"
           r="0.15025221" />
        <use
           x="0"
           y="0"
           xlink:href="#path1270"
           id="use1272"
           transform="translate(12.521618)"
           width="100%"
           height="100%"
           style="stroke:#00833d;stroke-opacity:1" />
      </g>
      <text
         id="text817"
         y="58.119045"
         x="-92.98214"
         style="font-style:normal;font-variant:normal;font-weight:normal;font-stretch:condensed;font-size:8.46666622px;line-height:1.25;font-family:Impact;-inkscape-font-specification:'Impact, Condensed';font-variant-ligatures:normal;font-variant-caps:normal;font-variant-numeric:normal;font-feature-settings:normal;text-align:start;letter-spacing:0px;word-spacing:0px;writing-mode:lr-tb;text-anchor:start;fill:#ffffff;fill-opacity:1;stroke:#000000;stroke-width:0.26458332"
         xml:space="preserve"><tspan
           style="font-style:normal;font-variant:normal;font-weight:normal;font-stretch:condensed;font-size:8.46666622px;font-family:Impact;-inkscape-font-specification:'Impact, Condensed';font-variant-ligatures:normal;font-variant-caps:normal;font-variant-numeric:normal;font-feature-settings:normal;text-align:start;writing-mode:lr-tb;text-anchor:start;fill:#ffffff;stroke:#000000;stroke-width:0.26458332"
           y="58.119045"
           x="-92.98214"
           id="tspan815"
           sodipodi:role="line">WABE</tspan></text>
      <text
         id="text821"
         y="58.057034"
         x="-73.571045"
         style="font-style:normal;font-variant:normal;font-weight:normal;font-stretch:condensed;font-size:5.29166651px;line-height:1.25;font-family:Impact;-inkscape-font-specification:'Impact, Condensed';font-variant-ligatures:normal;font-variant-caps:normal;font-variant-numeric:normal;font-feature-settings:normal;text-align:start;letter-spacing:0px;word-spacing:0px;writing-mode:lr-tb;text-anchor:start;fill:#ffffff;fill-opacity:1;stroke:#000000;stroke-width:0.26458332"
         xml:space="preserve"><tspan
           style="font-style:normal;font-variant:normal;font-weight:normal;font-stretch:condensed;font-size:5.29166651px;font-family:Impact;-inkscape-font-specification:'Impact, Condensed';font-variant-ligatures:normal;font-variant-caps:normal;font-variant-numeric:normal;font-feature-settings:normal;text-align:start;writing-mode:lr-tb;text-anchor:start;fill:#ffffff;stroke:#000000;stroke-width:0.26458332"
           y="58.057034"
           x="-73.571045"
           id="tspan819"
           sodipodi:role="line">sense</tspan></text>
      <g
         style="fill:#002255;stroke-width:0.92384255"
         transform="matrix(1.1716666,0,0,1,29.264561,-13.630746)"
         id="g861">
        <path
           id="use829-9"
           style="fill:#0069b2;fill-opacity:1;stroke:#ffffff;stroke-width:0.10116132;stroke-linecap:butt;stroke-linejoin:miter;stroke-miterlimit:4;stroke-dasharray:none;stroke-opacity:1"
           d="m -82.877132,67.202605 c 0,-0.375525 0.530396,-1.357872 0.75857,-2.035327 0.228173,0.677455 0.75857,1.659802 0.75857,2.035327 0,0.375525 -0.216223,0.718759 -0.75857,0.718759 -0.542348,0 -0.75857,-0.343234 -0.75857,-0.718759 z"
           inkscape:connector-curvature="0"
           sodipodi:nodetypes="scscs" />
        <path
           style="fill:none;stroke:#ffffff;stroke-width:0.09238426;stroke-linecap:round;stroke-linejoin:round;stroke-miterlimit:4;stroke-dasharray:none;stroke-opacity:1"
           d="m -82.68586,67.105849 c -0.01238,0.282605 0.144426,0.486408 0.371671,0.584652"
           id="path853"
           inkscape:connector-curvature="0"
           sodipodi:nodetypes="cc" />
      </g>
    </g>
  </g>
</svg>
