<?xml version="1.0" encoding="UTF-8" standalone="no"?>
<!-- Created with Inkscape (http://www.inkscape.org/) -->

<svg
   xmlns:dc="http://purl.org/dc/elements/1.1/"
   xmlns:cc="http://creativecommons.org/ns#"
   xmlns:rdf="http://www.w3.org/1999/02/22-rdf-syntax-ns#"
   xmlns:svg="http://www.w3.org/2000/svg"
   xmlns="http://www.w3.org/2000/svg"
   xmlns:xlink="http://www.w3.org/1999/xlink"
   xmlns:sodipodi="http://sodipodi.sourceforge.net/DTD/sodipodi-0.dtd"
   xmlns:inkscape="http://www.inkscape.org/namespaces/inkscape"
   width="210mm"
   height="297mm"
   viewBox="0 0 210 297"
   version="1.1"
   id="svg1511"
   inkscape:version="0.92.4 (5da689c313, 2019-01-14)"
   sodipodi:docname="WABE_symbols.svg">
  <defs
     id="defs1505" />
  <sodipodi:namedview
     id="base"
     pagecolor="#ffffff"
     bordercolor="#666666"
     borderopacity="1.0"
     inkscape:pageopacity="0.0"
     inkscape:pageshadow="2"
     inkscape:zoom="0.9899495"
     inkscape:cx="269.01114"
     inkscape:cy="911.59147"
     inkscape:document-units="mm"
     inkscape:current-layer="layer1"
     showgrid="false"
     inkscape:snap-object-midpoints="true"
     inkscape:snap-global="false"
     inkscape:window-width="1872"
     inkscape:window-height="1016"
     inkscape:window-x="48"
     inkscape:window-y="27"
     inkscape:window-maximized="1" />
  <metadata
     id="metadata1508">
    <rdf:RDF>
      <cc:Work
         rdf:about="">
        <dc:format>image/svg+xml</dc:format>
        <dc:type
           rdf:resource="http://purl.org/dc/dcmitype/StillImage" />
        <dc:title />
      </cc:Work>
    </rdf:RDF>
  </metadata>
  <g
     inkscape:label="Layer 1"
     inkscape:groupmode="layer"
     id="layer1">
    <g
       transform="translate(-73.23185,-11.492589)"
       id="g910">
      <path
         sodipodi:nodetypes="cccccc"
         style="fill:none;stroke:#000000;stroke-width:1;stroke-linecap:butt;stroke-linejoin:miter;stroke-miterlimit:4;stroke-dasharray:none;stroke-opacity:1"
         d="m 37.840208,13.986156 v 2.581292 m 0,6.147199 v 14.284562 l 8.562997,12.576901 v 8.830591"
         id="path2076-9"
         inkscape:connector-curvature="0" />
      <path
         inkscape:connector-curvature="0"
         id="use2078-4"
         d="m 60.17831,13.986156 v 6.154462 m 0,5.623548 V 36.999209 L 51.615314,49.57611 v 8.830591"
         style="fill:none;stroke:#000000;stroke-width:1;stroke-linecap:butt;stroke-linejoin:miter;stroke-miterlimit:4;stroke-dasharray:none;stroke-opacity:1"
         sodipodi:nodetypes="cccccc" />
      <path
         sodipodi:nodetypes="cccc"
         style="fill:none;stroke:#000000;stroke-width:1;stroke-linecap:butt;stroke-linejoin:miter;stroke-miterlimit:4;stroke-dasharray:none;stroke-opacity:1"
         d="m 44.361327,14.251373 v 3.376975 m 0,3.921502 v 14.544716"
         id="path2096-8"
         inkscape:connector-curvature="0" />
      <path
         inkscape:connector-curvature="0"
         id="use2098-4"
         d="m 54.048725,14.251373 v 3.376975 3.921502 14.544716"
         style="fill:none;stroke:#000000;stroke-width:1;stroke-linecap:butt;stroke-linejoin:miter;stroke-miterlimit:4;stroke-dasharray:none;stroke-opacity:1"
         sodipodi:nodetypes="cccc" />
      <path
         style="opacity:1;fill:#ffffff;fill-opacity:1;stroke:#000000;stroke-width:1;stroke-linecap:round;stroke-linejoin:round;stroke-miterlimit:4;stroke-dasharray:none;stroke-dashoffset:0;stroke-opacity:1"
         d="m 31.630676,17.714216 h 13.406668 m 0,3.818121 H 31.630676"
         id="rect2100-2"
         inkscape:connector-curvature="0"
         sodipodi:nodetypes="cccc" />
      <path
         style="opacity:1;fill:#ffffff;fill-opacity:1;stroke:#000000;stroke-width:1;stroke-linecap:round;stroke-linejoin:round;stroke-miterlimit:4;stroke-dasharray:none;stroke-dashoffset:0;stroke-opacity:1"
         d="m 59.93805,20.205863 h 8.21699 m 0,5.548013 h -8.21699"
         id="rect2100-7-3"
         inkscape:connector-curvature="0"
         sodipodi:nodetypes="cccc" />
    </g>
    <g
       id="g958"
       inkscape:export-xdpi="150"
       inkscape:export-ydpi="150">
      <g
         transform="translate(-6.2774722,-8.0238371)"
         id="g902">
        <text
           xml:space="preserve"
           style="font-style:normal;font-variant:normal;font-weight:normal;font-stretch:normal;font-size:8.46666622px;line-height:1.25;font-family:Ubuntu;-inkscape-font-specification:'Ubuntu, Normal';font-variant-ligatures:normal;font-variant-caps:normal;font-variant-numeric:normal;font-feature-settings:normal;text-align:start;letter-spacing:0px;word-spacing:0px;writing-mode:lr-tb;text-anchor:start;fill:#000000;fill-opacity:1;stroke:none;stroke-width:0.26458332"
           x="56.191448"
           y="55.330814"
           id="text2200"><tspan
             y="55.330814"
             x="56.191448"
             sodipodi:role="line"
             id="tspan2202"
             style="font-style:normal;font-variant:normal;font-weight:normal;font-stretch:normal;font-size:17.63888931px;font-family:'Arial Black';-inkscape-font-specification:'Arial Black, Normal';font-variant-ligatures:normal;font-variant-caps:normal;font-variant-numeric:normal;font-feature-settings:normal;text-align:start;writing-mode:lr-tb;text-anchor:start">S</tspan></text>
        <path
           inkscape:connector-curvature="0"
           id="path2253"
           d="m 60.62738,40.580951 v 2.79702"
           style="fill:none;stroke:#000000;stroke-width:2;stroke-linecap:round;stroke-linejoin:miter;stroke-miterlimit:4;stroke-dasharray:none;stroke-opacity:1"
           sodipodi:nodetypes="cc" />
        <use
           x="0"
           y="0"
           xlink:href="#path2253"
           id="use2255"
           transform="translate(3.4773809)"
           width="100%"
           height="100%" />
        <use
           x="0"
           y="0"
           xlink:href="#path2253"
           id="use2257"
           transform="matrix(1,0,0,-1,0,98.246431)"
           width="100%"
           height="100%" />
        <use
           x="0"
           y="0"
           xlink:href="#path2253"
           id="use2259"
           transform="matrix(1,0,0,-1,3.4773809,98.246431)"
           width="100%"
           height="100%" />
      </g>
      <use
         height="100%"
         width="100%"
         transform="translate(66.550112,3.7417734)"
         id="use946"
         xlink:href="#g910"
         y="0"
         x="0" />
    </g>
    <g
       id="g966"
       inkscape:export-xdpi="150"
       inkscape:export-ydpi="150">
      <g
         transform="matrix(0.31253595,-0.31253595,0.31253595,0.31253595,122.21373,73.549475)"
         id="g916">
        <path
           id="path2067"
           style="fill:#b3b3b3;stroke:#000000;stroke-width:1;stroke-linecap:round;stroke-linejoin:miter;stroke-miterlimit:4;stroke-dasharray:none;stroke-opacity:1"
           d="m 129.11236,58.316208 7.65873,-7.658732 M 151.08266,31.42392 127.04398,55.462592 c -0.99661,0.996737 -0.41158,3.197663 0.58503,4.194399 0.9967,0.996832 3.19782,1.581973 4.19464,0.585271 l 24.03867,-24.038674 z"
           inkscape:connector-curvature="0"
           sodipodi:nodetypes="cccccccc" />
        <path
           d="m 122.27161,-84.611504 a 6.0958495,8.1278 0 0 1 6.09585,-8.1278 l 0,8.1278 z"
           sodipodi:end="4.712389"
           sodipodi:start="3.1415927"
           sodipodi:ry="8.1278"
           sodipodi:rx="6.0958495"
           sodipodi:cy="-84.611504"
           sodipodi:cx="128.36746"
           sodipodi:type="arc"
           id="path2058"
           style="opacity:1;fill:#808080;fill-opacity:1;stroke:#000000;stroke-width:1;stroke-linecap:butt;stroke-linejoin:round;stroke-miterlimit:4;stroke-dasharray:none;stroke-dashoffset:0;stroke-opacity:1"
           transform="rotate(44.999999)" />
        <path
           style="opacity:1;fill:#b3b3b3;fill-opacity:1;stroke:#000000;stroke-width:1;stroke-linecap:butt;stroke-linejoin:round;stroke-miterlimit:4;stroke-dasharray:none;stroke-dashoffset:0;stroke-opacity:1"
           id="path2056"
           sodipodi:type="arc"
           sodipodi:cx="132.43137"
           sodipodi:cy="-84.611504"
           sodipodi:rx="10.15975"
           sodipodi:ry="10.15975"
           sodipodi:start="0"
           sodipodi:end="3.1415927"
           d="m 142.59112,-84.611504 a 10.15975,10.15975 0 0 1 -5.07988,8.798602 10.15975,10.15975 0 0 1 -10.15975,0 10.15975,10.15975 0 0 1 -5.07987,-8.798602 l 10.15975,0 z"
           transform="rotate(44.999999)" />
        <use
           x="0"
           y="0"
           xlink:href="#path2058"
           id="use2065"
           transform="matrix(0,-0.99999999,-1,0,187.28623,187.28622)"
           width="100%"
           height="100%"
           style="fill:#808080;stroke-width:1.56717491;stroke-miterlimit:4;stroke-dasharray:none" />
      </g>
      <use
         height="100%"
         width="100%"
         transform="translate(190.02863,5.61266)"
         id="use948"
         xlink:href="#g910"
         y="0"
         x="0" />
    </g>
  </g>
</svg>
