<?xml version="1.0" encoding="UTF-8" standalone="no"?>
<!-- Created with Inkscape (http://www.inkscape.org/) -->

<svg
   xmlns:dc="http://purl.org/dc/elements/1.1/"
   xmlns:cc="http://creativecommons.org/ns#"
   xmlns:rdf="http://www.w3.org/1999/02/22-rdf-syntax-ns#"
   xmlns:svg="http://www.w3.org/2000/svg"
   xmlns="http://www.w3.org/2000/svg"
   xmlns:xlink="http://www.w3.org/1999/xlink"
   xmlns:sodipodi="http://sodipodi.sourceforge.net/DTD/sodipodi-0.dtd"
   xmlns:inkscape="http://www.inkscape.org/namespaces/inkscape"
   inkscape:version="0.92.5 (2060ec1f9f, 2020-04-08)"
   version="1.1"
   id="svg2"
   height="1080"
   width="1920"
   sodipodi:docname="WABE_sesnor_study.svg">
  <defs
     id="defs4">
    <marker
       inkscape:stockid="Arrow1Mstart"
       orient="auto"
       refY="0"
       refX="0"
       id="Arrow1Mstart"
       style="overflow:visible">
      <path
         id="path4219"
         d="M 0,0 5,-5 -12.5,0 5,5 Z"
         style="fill-rule:evenodd;stroke:#000000;stroke-width:1.00000003pt"
         transform="matrix(0.4,0,0,0.4,4,0)"
         inkscape:connector-curvature="0" />
    </marker>
    <marker
       inkscape:stockid="Arrow2Mstart"
       orient="auto"
       refY="0"
       refX="0"
       id="Arrow2Mstart"
       style="overflow:visible">
      <path
         id="path4237"
         style="fill-rule:evenodd;stroke-width:0.625;stroke-linejoin:round"
         d="M 8.7185878,4.0337352 -2.2072895,0.01601326 8.7185884,-4.0017078 c -1.7454984,2.3720609 -1.7354408,5.6174519 -6e-7,8.035443 z"
         transform="scale(0.6)"
         inkscape:connector-curvature="0" />
    </marker>
    <marker
       style="overflow:visible"
       id="DistanceEnd"
       refX="0"
       refY="0"
       orient="auto"
       inkscape:stockid="DistanceEnd">
      <g
         id="g2301">
        <path
           style="fill:none;stroke:#ffffff;stroke-width:1.14999998;stroke-linecap:square"
           d="M 0,0 H -2"
           id="path2316"
           inkscape:connector-curvature="0" />
        <path
           style="fill:#000000;fill-rule:evenodd;stroke:none"
           d="m 0,0 -13,4 4,-4 -4,-4 z"
           id="path2312"
           inkscape:connector-curvature="0" />
        <path
           style="fill:none;stroke:#000000;stroke-width:1;stroke-linecap:square"
           d="M 0,-4 V 40"
           id="path2314"
           inkscape:connector-curvature="0" />
      </g>
    </marker>
    <marker
       style="overflow:visible"
       id="DistanceStart"
       refX="0"
       refY="0"
       orient="auto"
       inkscape:stockid="DistanceStart">
      <g
         id="g2300">
        <path
           style="fill:none;stroke:#ffffff;stroke-width:1.14999998;stroke-linecap:square"
           d="M 0,0 H 2"
           id="path2306"
           inkscape:connector-curvature="0" />
        <path
           style="fill:#000000;fill-rule:evenodd;stroke:none"
           d="M 0,0 13,4 9,0 13,-4 Z"
           id="path2302"
           inkscape:connector-curvature="0" />
        <path
           style="fill:none;stroke:#000000;stroke-width:1;stroke-linecap:square"
           d="M 0,-4 V 40"
           id="path2304"
           inkscape:connector-curvature="0" />
      </g>
    </marker>
    <marker
       inkscape:stockid="Arrow1Mend"
       orient="auto"
       refY="0"
       refX="0"
       id="Arrow1Mend"
       style="overflow:visible">
      <path
         id="path4222"
         d="M 0,0 5,-5 -12.5,0 5,5 Z"
         style="fill-rule:evenodd;stroke:#000000;stroke-width:1.00000003pt"
         transform="matrix(-0.4,0,0,-0.4,-4,0)"
         inkscape:connector-curvature="0" />
    </marker>
    <marker
       style="overflow:visible"
       id="DotM"
       refX="0"
       refY="0"
       orient="auto"
       inkscape:stockid="DotM">
      <path
         transform="matrix(0.4,0,0,0.4,2.96,0.4)"
         style="fill-rule:evenodd;stroke:#000000;stroke-width:1pt"
         d="m -2.5,-1 c 0,2.76 -2.24,5 -5,5 -2.76,0 -5,-2.24 -5,-5 0,-2.76 2.24,-5 5,-5 2.76,0 5,2.24 5,5 z"
         id="path3935"
         inkscape:connector-curvature="0" />
    </marker>
    <marker
       style="overflow:visible"
       id="Arrow1Send"
       refX="0"
       refY="0"
       orient="auto"
       inkscape:stockid="Arrow1Send">
      <path
         transform="matrix(-0.2,0,0,-0.2,-1.2,0)"
         style="fill-rule:evenodd;stroke:#000000;stroke-width:1pt"
         d="M 0,0 5,-5 -12.5,0 5,5 0,0 z"
         id="path3886"
         inkscape:connector-curvature="0" />
    </marker>
    <marker
       style="overflow:visible"
       id="Arrow1Mend-6"
       refX="0"
       refY="0"
       orient="auto"
       inkscape:stockid="Arrow1Mend">
      <path
         transform="matrix(-0.4,0,0,-0.4,-4,0)"
         style="fill-rule:evenodd;stroke:#000000;stroke-width:1pt"
         d="M 0,0 5,-5 -12.5,0 5,5 0,0 z"
         id="path3880"
         inkscape:connector-curvature="0" />
    </marker>
    <marker
       style="overflow:visible"
       id="Arrow1Mstart-7"
       refX="0"
       refY="0"
       orient="auto"
       inkscape:stockid="Arrow1Mstart">
      <path
         inkscape:connector-curvature="0"
         transform="matrix(0.4,0,0,0.4,4,0)"
         style="fill-rule:evenodd;stroke:#000000;stroke-width:1pt"
         d="M 0,0 5,-5 -12.5,0 5,5 0,0 z"
         id="path4219-5" />
    </marker>
    <marker
       style="overflow:visible"
       id="Arrow1Mend-8"
       refX="0"
       refY="0"
       orient="auto"
       inkscape:stockid="Arrow1Mend">
      <path
         inkscape:connector-curvature="0"
         transform="matrix(-0.4,0,0,-0.4,-4,0)"
         style="fill-rule:evenodd;stroke:#000000;stroke-width:1pt"
         d="M 0,0 5,-5 -12.5,0 5,5 0,0 z"
         id="path4222-3" />
    </marker>
    <marker
       style="overflow:visible"
       id="Arrow1Mstart5"
       refX="0"
       refY="0"
       orient="auto"
       inkscape:stockid="Arrow1Mstart5">
      <path
         inkscape:connector-curvature="0"
         transform="matrix(0.4,0,0,0.4,4,0)"
         style="fill:#ff0000;fill-rule:evenodd;stroke:#ff0000;stroke-width:1pt"
         d="M 0,0 5,-5 -12.5,0 5,5 0,0 z"
         id="path4757" />
    </marker>
    <marker
       style="overflow:visible"
       id="Arrow1Mendw"
       refX="0"
       refY="0"
       orient="auto"
       inkscape:stockid="Arrow1Mendw">
      <path
         transform="matrix(-0.4,0,0,-0.4,-4,0)"
         style="fill:#ff0000;fill-rule:evenodd;stroke:#ff0000;stroke-width:1pt"
         d="M 0,0 5,-5 -12.5,0 5,5 0,0 z"
         id="path4760"
         inkscape:connector-curvature="0" />
    </marker>
    <marker
       style="overflow:visible"
       id="DotMH"
       refX="0"
       refY="0"
       orient="auto"
       inkscape:stockid="DotMH">
      <path
         transform="matrix(0.4,0,0,0.4,2.96,0.4)"
         style="fill:#0000ff;fill-rule:evenodd;stroke:#0000ff;stroke-width:1pt"
         d="m -2.5,-1 c 0,2.76 -2.24,5 -5,5 -2.76,0 -5,-2.24 -5,-5 0,-2.76 2.24,-5 5,-5 2.76,0 5,2.24 5,5 z"
         id="path6048"
         inkscape:connector-curvature="0" />
    </marker>
    <marker
       style="overflow:visible"
       id="DotMg"
       refX="0"
       refY="0"
       orient="auto"
       inkscape:stockid="DotMg">
      <path
         transform="matrix(0.4,0,0,0.4,2.96,0.4)"
         style="fill:#0000ff;fill-rule:evenodd;stroke:#0000ff;stroke-width:1pt"
         d="m -2.5,-1 c 0,2.76 -2.24,5 -5,5 -2.76,0 -5,-2.24 -5,-5 0,-2.76 2.24,-5 5,-5 2.76,0 5,2.24 5,5 z"
         id="path6051"
         inkscape:connector-curvature="0" />
    </marker>
    <marker
       style="overflow:visible"
       id="Arrow1Mstart5s"
       refX="0"
       refY="0"
       orient="auto"
       inkscape:stockid="Arrow1Mstart5s">
      <path
         inkscape:connector-curvature="0"
         transform="matrix(0.4,0,0,0.4,4,0)"
         style="stroke-width:1pt;stroke:#008000;fill-rule:evenodd;fill:#008000"
         d="M 0,0 5,-5 -12.5,0 5,5 0,0 z"
         id="path6453" />
    </marker>
    <marker
       style="overflow:visible"
       id="Arrow1Mendw2"
       refX="0"
       refY="0"
       orient="auto"
       inkscape:stockid="Arrow1Mendw2">
      <path
         transform="matrix(-0.4,0,0,-0.4,-4,0)"
         style="stroke-width:1pt;stroke:#008000;fill-rule:evenodd;fill:#008000"
         d="M 0,0 5,-5 -12.5,0 5,5 0,0 z"
         id="path6456"
         inkscape:connector-curvature="0" />
    </marker>
  </defs>
  <sodipodi:namedview
     id="base"
     pagecolor="#ffffff"
     bordercolor="#666666"
     borderopacity="1.0"
     inkscape:pageopacity="0.0"
     inkscape:pageshadow="2"
     inkscape:zoom="0.49497474"
     inkscape:cx="993.34029"
     inkscape:cy="246.08103"
     inkscape:document-units="px"
     inkscape:current-layer="layer3"
     showgrid="false"
     showguides="true"
     inkscape:guide-bbox="true"
     inkscape:window-width="1920"
     inkscape:window-height="1016"
     inkscape:window-x="0"
     inkscape:window-y="27"
     inkscape:window-maximized="1"
     fit-margin-top="0"
     fit-margin-left="0"
     fit-margin-right="0"
     fit-margin-bottom="0" />
  <metadata
     id="metadata7">
    <rdf:RDF>
      <cc:Work
         rdf:about="">
        <dc:format>image/svg+xml</dc:format>
        <dc:type
           rdf:resource="http://purl.org/dc/dcmitype/StillImage" />
        <dc:title></dc:title>
      </cc:Work>
    </rdf:RDF>
  </metadata>
  <g
     inkscape:label="Wabe"
     inkscape:groupmode="layer"
     id="layer1"
     transform="translate(-25.196895,481.09978)" />
  <g
     inkscape:groupmode="layer"
     id="layer2"
     inkscape:label="Sensoren"
     style="display:inline"
     transform="translate(-25.196895,481.09978)" />
  <g
     inkscape:groupmode="layer"
     id="layer3"
     inkscape:label="Grössen"
     transform="translate(-25.196895,481.09978)">
    <g
       id="g2829"
       transform="translate(-131.31983,-6.0609153)"
       inkscape:export-xdpi="96"
       inkscape:export-ydpi="96">
      <g
         style="stroke-width:0.71242499"
         transform="matrix(1.4035474,0,0,1.4037657,650.69009,-395.18255)"
         id="g381">
        <g
           style="stroke-width:0.71242499"
           id="g4732"
           transform="matrix(0.78872517,0,0,0.78875738,72.253269,-34.26164)">
          <path
             id="path4655"
             style="fill:#d5f6ff;fill-opacity:1;stroke:none;stroke-width:0.71242499"
             d="M 407.77941,640.21994 523.81358,469.58405 V 330.01776 c 0,0 -6.85317,3.09194 -10.52242,3.283 -5.545,0.28871 -10.87363,-2.25846 -16.3308,-3.283 -5.05306,-0.94867 -10.0547,-2.78237 -15.19438,-2.65165 -3.98424,0.10134 -11.65884,2.65165 -11.65884,2.65165 h -1.78659 c 0,0 -4.51293,-7.71135 -8.14883,-7.45674 -5.06354,0.35457 -10.69583,13.62469 -15.77177,13.62651 -4.31368,0.002 -1.06916,-12.23947 -5.34108,-12.83829 -5.40808,-0.75809 -9.05971,13.08643 -14.50348,12.65345 -3.74527,-0.29789 -6.81182,-11.37693 -10.56869,-11.33579 -3.73815,0.0409 -6.99141,11.57534 -10.71031,11.19418 -3.71847,-0.38112 -1.4612,-16.05354 -5.11931,-16.82196 -5.09606,-1.07049 -13.00807,10.04068 -18.13018,10.97864 -3.61873,0.66266 -7.35781,0 -11.03671,0 -3.6789,0 -7.3578,0 -11.0367,0 -3.6789,0 -7.40078,0.56066 -11.03671,0 -4.49168,-0.69261 -10.15388,-7.92139 -14.60192,-6.98869 -3.62494,0.76011 0.69445,12.89424 -2.91498,13.72487 -3.95746,0.9107 -11.78062,-5.33799 -15.59321,-6.73618 -3.44053,-1.26175 -6.30293,-4.51491 -9.96528,-4.64286 -4.31996,-0.15092 -12.10814,4.64286 -12.10814,4.64286 h -1.58146 c 0,0 -9.03574,1.63655 -13.60294,1.6415 -4.65079,0.005 -9.25086,-0.98782 -13.85548,-1.6415 -4.84612,-0.68797 -9.59233,-2.44504 -14.48682,-2.39911 -4.39701,0.0413 -12.9716,2.39911 -12.9716,2.39911 v 139.56629 l 116.03417,170.63589"
             inkscape:connector-curvature="0"
             sodipodi:nodetypes="cccsssccsssssssssssssssccsssccc" />
          <path
             sodipodi:nodetypes="ccccccc"
             inkscape:connector-curvature="0"
             id="path3025"
             d="M 64.385797,253.72386 H 328.03561 c 29.15859,0.0306 57.50884,56.57413 62.37692,79.79112 h -52.02286 c 3.70668,-12.79527 -3.8898,-61.92315 -7.3236,-62.36599 l -267.690426,0.75762 z"
             style="fill:#d5f6ff;fill-opacity:1;stroke:none;stroke-width:0.71242499" />
          <path
             sodipodi:type="spiral"
             style="fill:none;stroke:#000000;stroke-width:0.90324295px;stroke-linecap:butt;stroke-linejoin:miter;stroke-opacity:1"
             id="path3414"
             sodipodi:cx="618.71844"
             sodipodi:cy="420.51178"
             sodipodi:expansion="2.9200001"
             sodipodi:revolution="2.96"
             sodipodi:radius="20.127148"
             sodipodi:argument="-15.707963"
             sodipodi:t0="0.58283955"
             d="m 619.36405,424.62227 c -2.69966,1.20211 -5.70002,-0.57946 -6.74808,-3.15201 -1.59749,-3.92117 0.99319,-8.18156 4.74505,-9.60098 5.45767,-2.06476 11.2894,1.54915 13.15148,6.79008 2.60917,7.34363 -2.26644,15.09126 -9.3407,17.47254 -8.87715,2.98814 -18.35673,-2.2846 -21.94817,-10.61471"
             transform="matrix(-0.38699478,0.92208191,0.92208191,0.38699478,191.75305,-384.57164)" />
          <path
             sodipodi:type="spiral"
             style="fill:none;stroke:#000000;stroke-width:0.90324295px;stroke-linecap:butt;stroke-linejoin:miter;stroke-opacity:1"
             id="path3416"
             sodipodi:cx="618.71844"
             sodipodi:cy="420.51178"
             sodipodi:expansion="2.9200001"
             sodipodi:revolution="2.96"
             sodipodi:radius="20.127148"
             sodipodi:argument="-15.707963"
             sodipodi:t0="0.58283955"
             d="m 619.36405,424.62227 c -2.69966,1.20211 -5.70002,-0.57946 -6.74808,-3.15201 -1.59749,-3.92117 0.99319,-8.18156 4.74505,-9.60098 5.45767,-2.06476 11.2894,1.54915 13.15148,6.79008 2.60917,7.34363 -2.26644,15.09126 -9.3407,17.47254 -8.87715,2.98814 -18.35673,-2.2846 -21.94817,-10.61471"
             transform="rotate(46.382009,584.87038,123.15262)" />
          <path
             sodipodi:type="spiral"
             style="fill:none;stroke:#000000;stroke-width:0.35710937px;stroke-linecap:butt;stroke-linejoin:miter;stroke-opacity:1"
             id="path3418"
             sodipodi:cx="618.71844"
             sodipodi:cy="420.51178"
             sodipodi:expansion="2.9200001"
             sodipodi:revolution="2.96"
             sodipodi:radius="20.127148"
             sodipodi:argument="-15.707963"
             sodipodi:t0="0.58283955"
             d="m 619.36405,424.62227 c -2.69966,1.20211 -5.70002,-0.57946 -6.74808,-3.15201 -1.59749,-3.92117 0.99319,-8.18156 4.74505,-9.60098 5.45767,-2.06476 11.2894,1.54915 13.15148,6.79008 2.60917,7.34363 -2.26644,15.09126 -9.3407,17.47254 -8.87715,2.98814 -18.35673,-2.2846 -21.94817,-10.61471"
             transform="matrix(1.7448418,1.8311128,-1.8311128,1.7448418,125.29473,-1443.4057)" />
          <path
             transform="matrix(-1.7448418,1.8311128,1.8311128,1.7448418,635.03032,-1403.5047)"
             d="m 619.36405,424.62227 c -2.69966,1.20211 -5.70002,-0.57946 -6.74808,-3.15201 -1.59749,-3.92117 0.99319,-8.18156 4.74505,-9.60098 5.45767,-2.06476 11.2894,1.54915 13.15148,6.79008 2.60917,7.34363 -2.26644,15.09126 -9.3407,17.47254 -8.87715,2.98814 -18.35673,-2.2846 -21.94817,-10.61471"
             sodipodi:t0="0.58283955"
             sodipodi:argument="-15.707963"
             sodipodi:radius="20.127148"
             sodipodi:revolution="2.96"
             sodipodi:expansion="2.9200001"
             sodipodi:cy="420.51178"
             sodipodi:cx="618.71844"
             id="path3412"
             style="fill:none;stroke:#000000;stroke-width:0.35710937px;stroke-linecap:butt;stroke-linejoin:miter;stroke-opacity:1"
             sodipodi:type="spiral" />
        </g>
        <path
           style="fill:none;stroke:#000000;stroke-width:1.42484999;stroke-linecap:butt;stroke-linejoin:miter;stroke-miterlimit:4;stroke-dasharray:none;stroke-opacity:1;marker-end:url(#Arrow1Mend)"
           d="m 358.47049,356.38074 c -14.41151,28.76193 -75.4495,44.97812 -79.67328,-23.90295"
           id="path3420"
           inkscape:connector-curvature="0"
           sodipodi:nodetypes="cc" />
        <use
           style="stroke-width:0.71242499"
           x="0"
           y="0"
           xlink:href="#path3420"
           id="use4653"
           transform="matrix(-1,0,0,1,744.24479,0)"
           width="744.09448"
           height="1052.3622" />
        <g
           style="stroke-width:0.71242499"
           id="g5364">
          <path
             sodipodi:nodetypes="czcccc"
             inkscape:connector-curvature="0"
             id="path4657"
             d="m 328.8143,439.44748 c 0,0 28.97739,14.58103 43.59901,14.50382 14.62163,-0.0772 42.59738,-14.78553 42.59738,-14.78553 l -21.68994,32.3954 -43.94327,0.5634 z"
             style="fill:#f4e3d7;stroke:none;stroke-width:0.71242499" />
          <circle
             inkscape:tile-y0="431.51961"
             inkscape:tile-x0="315.68789"
             inkscape:tile-h="0.97969491"
             inkscape:tile-w="0.97969491"
             inkscape:tile-cy="432.00946"
             inkscape:tile-cx="316.17774"
             transform="matrix(0.32656497,0,0,0.32656497,229.89364,302.98025)"
             style="fill:#000000;stroke:none;stroke-width:0.71242499"
             id="path4062"
             cx="341.37463"
             cy="449.90271"
             r="1.5" />
          <use
             style="stroke-width:0.71242499"
             id="use5164"
             transform="translate(2.5737333,-2.0180818)"
             xlink:href="#path4062"
             inkscape:tiled-clone-of="#path4062"
             y="0"
             x="0"
             width="100%"
             height="100%" />
          <use
             style="stroke-width:0.71242499"
             id="use5186"
             transform="translate(5.5771903,2.6488578)"
             xlink:href="#path4062"
             inkscape:tiled-clone-of="#path4062"
             y="0"
             x="0"
             width="100%"
             height="100%" />
          <use
             style="stroke-width:0.71242499"
             id="use5188"
             transform="translate(11.037158,8.0752467)"
             xlink:href="#path4062"
             inkscape:tiled-clone-of="#path4062"
             y="0"
             x="0"
             width="100%"
             height="100%" />
          <use
             style="stroke-width:0.71242499"
             id="use5190"
             transform="translate(10.373135,13.343528)"
             xlink:href="#path4062"
             inkscape:tiled-clone-of="#path4062"
             y="0"
             x="0"
             width="100%"
             height="100%" />
          <use
             style="stroke-width:0.71242499"
             id="use5192"
             transform="translate(11.203373,14.779898)"
             xlink:href="#path4062"
             inkscape:tiled-clone-of="#path4062"
             y="0"
             x="0"
             width="100%"
             height="100%" />
          <use
             style="stroke-width:0.71242499"
             id="use5204"
             transform="translate(12.949642,0.46213778)"
             xlink:href="#path4062"
             inkscape:tiled-clone-of="#path4062"
             y="0"
             x="0"
             width="100%"
             height="100%" />
          <use
             style="stroke-width:0.71242499"
             id="use5206"
             transform="translate(12.373394,6.2830534)"
             xlink:href="#path4062"
             inkscape:tiled-clone-of="#path4062"
             y="0"
             x="0"
             width="100%"
             height="100%" />
          <use
             style="stroke-width:0.71242499"
             id="use5208"
             transform="translate(18.630907,9.9601535)"
             xlink:href="#path4062"
             inkscape:tiled-clone-of="#path4062"
             y="0"
             x="0"
             width="100%"
             height="100%" />
          <use
             style="stroke-width:0.71242499"
             id="use5210"
             transform="translate(14.647086,12.228961)"
             xlink:href="#path4062"
             inkscape:tiled-clone-of="#path4062"
             y="0"
             x="0"
             width="100%"
             height="100%" />
          <use
             style="stroke-width:0.71242499"
             id="use5212"
             transform="translate(16.708573,14.653475)"
             xlink:href="#path4062"
             inkscape:tiled-clone-of="#path4062"
             y="0"
             x="0"
             width="100%"
             height="100%" />
          <use
             style="stroke-width:0.71242499"
             id="use5214"
             transform="translate(19.100517,18.739559)"
             xlink:href="#path4062"
             inkscape:tiled-clone-of="#path4062"
             y="0"
             x="0"
             width="100%"
             height="100%" />
          <use
             style="stroke-width:0.71242499"
             id="use5224"
             transform="translate(16.806352,2.4144129)"
             xlink:href="#path4062"
             inkscape:tiled-clone-of="#path4062"
             y="0"
             x="0"
             width="100%"
             height="100%" />
          <use
             style="stroke-width:0.71242499"
             id="use5226"
             transform="translate(18.265459,2.506591)"
             xlink:href="#path4062"
             inkscape:tiled-clone-of="#path4062"
             y="0"
             x="0"
             width="100%"
             height="100%" />
          <use
             style="stroke-width:0.71242499"
             id="use5228"
             transform="translate(18.999868,8.9318733)"
             xlink:href="#path4062"
             inkscape:tiled-clone-of="#path4062"
             y="0"
             x="0"
             width="100%"
             height="100%" />
          <use
             style="stroke-width:0.71242499"
             id="use5230"
             transform="translate(24.030426,14.253064)"
             xlink:href="#path4062"
             inkscape:tiled-clone-of="#path4062"
             y="0"
             x="0"
             width="100%"
             height="100%" />
          <use
             style="stroke-width:0.71242499"
             id="use5232"
             transform="translate(16.259229,15.164111)"
             xlink:href="#path4062"
             inkscape:tiled-clone-of="#path4062"
             y="0"
             x="0"
             width="100%"
             height="100%" />
          <use
             style="stroke-width:0.71242499"
             id="use5246"
             transform="translate(23.581116,3.560644)"
             xlink:href="#path4062"
             inkscape:tiled-clone-of="#path4062"
             y="0"
             x="0"
             width="100%"
             height="100%" />
          <use
             style="stroke-width:0.71242499"
             id="use5248"
             transform="translate(32.847009,6.2733525)"
             xlink:href="#path4062"
             inkscape:tiled-clone-of="#path4062"
             y="0"
             x="0"
             width="100%"
             height="100%" />
          <use
             style="stroke-width:0.71242499"
             id="use5250"
             transform="translate(32.137162,9.6916851)"
             xlink:href="#path4062"
             inkscape:tiled-clone-of="#path4062"
             y="0"
             x="0"
             width="100%"
             height="100%" />
          <use
             style="stroke-width:0.71242499"
             id="use5252"
             transform="translate(26.965627,16.616136)"
             xlink:href="#path4062"
             inkscape:tiled-clone-of="#path4062"
             y="0"
             x="0"
             width="100%"
             height="100%" />
          <use
             style="stroke-width:0.71242499"
             id="use5266"
             transform="translate(30.462994,4.3026612)"
             xlink:href="#path4062"
             inkscape:tiled-clone-of="#path4062"
             y="0"
             x="0"
             width="100%"
             height="100%" />
          <use
             style="stroke-width:0.71242499"
             id="use5268"
             transform="translate(33.455212,8.8017341)"
             xlink:href="#path4062"
             inkscape:tiled-clone-of="#path4062"
             y="0"
             x="0"
             width="100%"
             height="100%" />
          <use
             style="stroke-width:0.71242499"
             id="use5270"
             transform="translate(29.896982,13.82928)"
             xlink:href="#path4062"
             inkscape:tiled-clone-of="#path4062"
             y="0"
             x="0"
             width="100%"
             height="100%" />
          <use
             style="stroke-width:0.71242499"
             id="use5272"
             transform="translate(31.324388,18.078028)"
             xlink:href="#path4062"
             inkscape:tiled-clone-of="#path4062"
             y="0"
             x="0"
             width="100%"
             height="100%" />
          <use
             style="stroke-width:0.71242499"
             id="use5274"
             transform="translate(29.302769,17.26976)"
             xlink:href="#path4062"
             inkscape:tiled-clone-of="#path4062"
             y="0"
             x="0"
             width="100%"
             height="100%" />
          <use
             style="stroke-width:0.71242499"
             height="581.00696"
             width="585.34607"
             id="use5284"
             transform="translate(40.405575,5.1447948)"
             xlink:href="#path4062"
             inkscape:tiled-clone-of="#path4062"
             y="0"
             x="0" />
          <use
             style="stroke-width:0.71242499"
             height="581.00696"
             width="585.34607"
             id="use5286"
             transform="translate(38.645743,5.1054682)"
             xlink:href="#path4062"
             inkscape:tiled-clone-of="#path4062"
             y="0"
             x="0" />
          <use
             style="stroke-width:0.71242499"
             id="use5288"
             transform="translate(46.510033,9.9866757)"
             xlink:href="#path4062"
             inkscape:tiled-clone-of="#path4062"
             y="0"
             x="0"
             width="100%"
             height="100%" />
          <use
             style="stroke-width:0.71242499"
             id="use5290"
             transform="translate(42.681875,10.401069)"
             xlink:href="#path4062"
             inkscape:tiled-clone-of="#path4062"
             y="0"
             x="0"
             width="100%"
             height="100%" />
          <use
             style="stroke-width:0.71242499"
             id="use5292"
             transform="translate(43.098446,13.306295)"
             xlink:href="#path4062"
             inkscape:tiled-clone-of="#path4062"
             y="0"
             x="0"
             width="100%"
             height="100%" />
          <use
             style="stroke-width:0.71242499"
             height="581.00696"
             width="585.34607"
             id="use5300"
             transform="translate(40.615386,18.32828)"
             xlink:href="#path4062"
             inkscape:tiled-clone-of="#path4062"
             y="0"
             x="0" />
          <use
             style="stroke-width:0.71242499"
             height="581.00696"
             width="585.34607"
             id="use5302"
             transform="translate(25.539512,8.9752859)"
             xlink:href="#path4062"
             inkscape:tiled-clone-of="#path4062"
             y="0"
             x="0" />
          <use
             style="stroke-width:0.71242499"
             height="581.00696"
             width="585.34607"
             id="use5304"
             transform="translate(43.877046,3.7493039)"
             xlink:href="#path4062"
             inkscape:tiled-clone-of="#path4062"
             y="0"
             x="0" />
          <use
             style="stroke-width:0.71242499"
             id="use5306"
             transform="translate(51.38279,6.0169001)"
             xlink:href="#path4062"
             inkscape:tiled-clone-of="#path4062"
             y="0"
             x="0"
             width="100%"
             height="100%" />
          <use
             style="stroke-width:0.71242499"
             id="use5308"
             transform="translate(48.85305,9.4279402)"
             xlink:href="#path4062"
             inkscape:tiled-clone-of="#path4062"
             y="0"
             x="0"
             width="100%"
             height="100%" />
          <use
             style="stroke-width:0.71242499"
             id="use5310"
             transform="translate(47.428855,13.828017)"
             xlink:href="#path4062"
             inkscape:tiled-clone-of="#path4062"
             y="0"
             x="0"
             width="100%"
             height="100%" />
          <use
             style="stroke-width:0.71242499"
             id="use5312"
             transform="translate(43.051848,14.404515)"
             xlink:href="#path4062"
             inkscape:tiled-clone-of="#path4062"
             y="0"
             x="0"
             width="100%"
             height="100%" />
          <use
             style="stroke-width:0.71242499"
             height="581.00696"
             width="585.34607"
             id="use5316"
             transform="translate(37.086003,13.132978)"
             xlink:href="#path4062"
             inkscape:tiled-clone-of="#path4062"
             y="0"
             x="0" />
          <use
             style="stroke-width:0.71242499"
             height="581.00696"
             width="585.34607"
             id="use5324"
             transform="translate(57.440166,5.9674917)"
             xlink:href="#path4062"
             inkscape:tiled-clone-of="#path4062"
             y="0"
             x="0" />
          <use
             style="stroke-width:0.71242499"
             id="use5326"
             transform="translate(60.570633,4.5537953)"
             xlink:href="#path4062"
             inkscape:tiled-clone-of="#path4062"
             y="0"
             x="0"
             width="100%"
             height="100%" />
          <use
             style="stroke-width:0.71242499"
             id="use5330"
             transform="translate(52.008033,12.617211)"
             xlink:href="#path4062"
             inkscape:tiled-clone-of="#path4062"
             y="0"
             x="0"
             width="100%"
             height="100%" />
          <use
             style="stroke-width:0.71242499"
             id="use5332"
             transform="translate(49.776652,15.885896)"
             xlink:href="#path4062"
             inkscape:tiled-clone-of="#path4062"
             y="0"
             x="0"
             width="100%"
             height="100%" />
          <use
             style="stroke-width:0.71242499"
             height="581.00696"
             width="585.34607"
             id="use5342"
             transform="translate(5.7300879,8.5013775)"
             xlink:href="#path4062"
             inkscape:tiled-clone-of="#path4062"
             y="0"
             x="0" />
          <use
             style="stroke-width:0.71242499"
             height="581.00696"
             width="585.34607"
             id="use5344"
             transform="translate(61.363308,2.6361186)"
             xlink:href="#path4062"
             inkscape:tiled-clone-of="#path4062"
             y="0"
             x="0" />
          <use
             style="stroke-width:0.71242499"
             height="581.00696"
             width="585.34607"
             id="use5354"
             transform="translate(64.98761,-3.3643124)"
             xlink:href="#path4062"
             inkscape:tiled-clone-of="#path4062"
             y="0"
             x="0" />
          <use
             style="stroke-width:0.71242499"
             height="581.00696"
             width="585.34607"
             id="use5360"
             transform="translate(55.909273,1.472414)"
             xlink:href="#path4062"
             inkscape:tiled-clone-of="#path4062"
             y="0"
             x="0" />
          <use
             style="stroke-width:0.71242499"
             height="581.00696"
             width="585.34607"
             id="use5362"
             transform="translate(51.298479,2.13874)"
             xlink:href="#path4062"
             inkscape:tiled-clone-of="#path4062"
             y="0"
             x="0" />
        </g>
        <g
           style="stroke-width:0.71242499"
           id="g4724"
           transform="matrix(0.78872517,0,0,0.78875738,72.253269,-34.26164)">
          <path
             id="path3023"
             style="fill:none;stroke:#000000;stroke-width:2.70972896;stroke-linecap:round;stroke-miterlimit:4;stroke-dashoffset:0;stroke-opacity:1"
             d="M 407.77941,640.21994 523.81358,469.58405 V 298.70147 m 0,-56.25 V 146.17 H 235.23495 v 68.29766 m 0,56.3431 v 198.77329 l 116.03417,170.63589"
             inkscape:connector-curvature="0"
             sodipodi:nodetypes="cccccccccc" />
          <path
             sodipodi:nodetypes="cccccc"
             inkscape:connector-curvature="0"
             id="rect2991"
             d="m 469.17148,178.50139 v 302.8187 m -177.87307,0 V 270.81331 m 0,-55.80738 v -36.50454"
             style="fill:#ffffff;fill-opacity:1;stroke:#000000;stroke-width:2.70972919;stroke-linecap:round;stroke-miterlimit:4;stroke-dashoffset:0;stroke-opacity:1" />
          <path
             sodipodi:nodetypes="cccc"
             inkscape:connector-curvature="0"
             id="rect2997"
             d="M 64.385796,214.95228 H 329.04577 v 55.55839 H 64.385796"
             style="fill:none;stroke:#000000;stroke-width:2.70972896;stroke-linecap:round;stroke-miterlimit:4;stroke-dashoffset:0;stroke-opacity:1" />
          <path
             sodipodi:nodetypes="cccc"
             inkscape:connector-curvature="0"
             id="rect3007"
             d="m 523.80389,242.84421 h 156.77497 m 0,55.55839 H 523.80389"
             style="fill:none;stroke:#000000;stroke-width:2.70972896;stroke-linecap:round;stroke-miterlimit:4;stroke-dashoffset:0;stroke-opacity:1" />
          <path
             inkscape:connector-curvature="0"
             id="rect3015"
             d="m 329.21875,800.83166 h 78.625 v -29.6875 -25.875 -103.40625 h -55.5625 v 103.40625 h -23.0625"
             style="fill:#ffffff;fill-opacity:1;stroke:#000000;stroke-width:2.70972896;stroke-linecap:round;stroke-miterlimit:4;stroke-dasharray:none;stroke-dashoffset:0;stroke-opacity:1"
             sodipodi:nodetypes="cccccccc" />
          <path
             sodipodi:nodetypes="czcccc"
             inkscape:connector-curvature="0"
             id="rect4702"
             d="m 227.28432,132.19443 c 0,0 54.1379,-33.928556 144.50139,-33.928556 90.3635,0 158.54438,33.928556 158.54438,33.928556 v 14.14213 H 227.28432 Z"
             style="fill:none;stroke:#000000;stroke-width:2.70972896;stroke-linecap:round;stroke-miterlimit:4;stroke-dashoffset:0;stroke-opacity:1" />
        </g>
        <rect
           y="287.85895"
           x="476.78528"
           height="22.309431"
           width="31.07258"
           id="rect4672"
           style="display:inline;opacity:0.25;fill:#ff0000;fill-opacity:1;stroke:#000000;stroke-width:0.71242499" />
        <rect
           y="-468.81799"
           x="31.971153"
           height="15.137924"
           width="67.725052"
           id="rect4692"
           style="display:inline;opacity:0.25;fill:#00ff00;fill-opacity:1;stroke:#000000;stroke-width:0.71242499"
           transform="rotate(90,-2.5e-6,-2.5e-6)" />
        <rect
           y="116.52951"
           x="200.31905"
           height="67.725052"
           width="39.039906"
           id="rect4676"
           style="display:inline;opacity:0.25;fill:#ffff00;fill-opacity:1;stroke:#000000;stroke-width:0.71242499" />
        <text
           id="text4682"
           y="306.09006"
           x="509.46173"
           style="color:#000000;font-style:normal;font-variant:normal;font-weight:normal;font-stretch:normal;font-size:18.99799919px;line-height:0%;font-family:'Roboto Slab';-inkscape-font-specification:'Roboto Slab';text-indent:0;text-align:start;text-decoration:none;text-decoration-line:none;letter-spacing:0px;word-spacing:0px;text-transform:none;writing-mode:lr-tb;direction:ltr;baseline-shift:baseline;text-anchor:start;display:inline;overflow:visible;visibility:visible;fill:#000000;fill-opacity:1;fill-rule:nonzero;stroke:none;stroke-width:0.71242499px;marker:none;enable-background:accumulate"
           xml:space="preserve"
           transform="scale(0.9999796,1.0000204)"><tspan
             y="306.09006"
             x="509.46173"
             id="tspan4684"
             sodipodi:role="line"
             style="font-size:18.99799919px;line-height:1.25;stroke-width:0.71242499px">Drucksensor</tspan></text>
        <text
           xml:space="preserve"
           style="color:#000000;font-style:normal;font-variant:normal;font-weight:normal;font-stretch:normal;font-size:18.99799919px;line-height:0%;font-family:'Roboto Slab';-inkscape-font-specification:'Roboto Slab';text-indent:0;text-align:start;text-decoration:none;text-decoration-line:none;letter-spacing:0px;word-spacing:0px;text-transform:none;writing-mode:lr-tb;direction:ltr;baseline-shift:baseline;text-anchor:start;display:inline;overflow:visible;visibility:visible;fill:#000000;fill-opacity:1;fill-rule:nonzero;stroke:none;stroke-width:0.71242499px;marker:none;enable-background:accumulate"
           x="476.79504"
           y="30.828487"
           id="text4694"
           transform="scale(0.9999796,1.0000204)"><tspan
             sodipodi:role="line"
             id="tspan4696"
             x="476.79504"
             y="30.828487"
             style="font-size:18.99799919px;line-height:1.25;stroke-width:0.71242499px">Optik- oder </tspan><tspan
             sodipodi:role="line"
             x="476.79504"
             y="54.575985"
             id="tspan4740"
             style="font-size:18.99799919px;line-height:1.25;stroke-width:0.71242499px">Ultraschallsensor</tspan></text>
        <text
           xml:space="preserve"
           style="color:#000000;font-style:normal;font-variant:normal;font-weight:normal;font-stretch:normal;font-size:18.99799919px;line-height:0%;font-family:'Roboto Slab';-inkscape-font-specification:'Roboto Slab';text-indent:0;text-align:start;text-decoration:none;text-decoration-line:none;letter-spacing:0px;word-spacing:0px;text-transform:none;writing-mode:lr-tb;direction:ltr;baseline-shift:baseline;text-anchor:start;display:inline;overflow:visible;visibility:visible;fill:#000000;fill-opacity:1;fill-rule:nonzero;stroke:none;stroke-width:0.71242499px;marker:none;enable-background:accumulate"
           x="-41.571079"
           y="97.31221"
           id="text4678"
           transform="scale(0.9999796,1.0000204)"><tspan
             sodipodi:role="line"
             id="tspan4680"
             x="-41.571079"
             y="97.31221"
             style="font-size:18.99799919px;line-height:1.25;stroke-width:0.71242499px">Durchflusssensoren</tspan><tspan
             sodipodi:role="line"
             x="-41.571079"
             y="121.05971"
             id="tspan4700"
             style="font-size:18.99799919px;line-height:1.25;stroke-width:0.71242499px">(z.B. modifizierte Venturikanal)</tspan></text>
        <text
           id="text6329"
           y="286.18021"
           x="493.68726"
           style="color:#000000;font-style:normal;font-variant:normal;font-weight:normal;font-stretch:normal;line-height:0%;font-family:'Roboto Slab';-inkscape-font-specification:'Roboto Slab';text-indent:0;text-align:start;text-decoration:none;text-decoration-line:none;letter-spacing:0px;word-spacing:0px;text-transform:none;writing-mode:lr-tb;direction:ltr;baseline-shift:baseline;text-anchor:start;display:inline;overflow:visible;visibility:visible;fill:#000000;fill-opacity:1;fill-rule:nonzero;stroke:none;stroke-width:0.71242499px;marker:none;enable-background:accumulate"
           xml:space="preserve"
           transform="scale(0.9999796,1.0000204)"><tspan
             y="286.18021"
             x="493.68726"
             id="tspan6331"
             sodipodi:role="line"
             style="font-size:16.01215172px;line-height:1.25;stroke-width:0.71242499px">A</tspan></text>
        <text
           id="text6333"
           y="29.276531"
           x="456.08264"
           style="color:#000000;font-style:normal;font-variant:normal;font-weight:normal;font-stretch:normal;line-height:0%;font-family:'Roboto Slab';-inkscape-font-specification:'Roboto Slab';text-indent:0;text-align:start;text-decoration:none;text-decoration-line:none;letter-spacing:0px;word-spacing:0px;text-transform:none;writing-mode:lr-tb;direction:ltr;baseline-shift:baseline;text-anchor:start;display:inline;overflow:visible;visibility:visible;fill:#000000;fill-opacity:1;fill-rule:nonzero;stroke:none;stroke-width:0.71242499px;marker:none;enable-background:accumulate"
           xml:space="preserve"
           transform="scale(0.9999796,1.0000204)"><tspan
             y="29.276531"
             x="456.08264"
             id="tspan6335"
             sodipodi:role="line"
             style="font-size:16.01215172px;line-height:1.25;stroke-width:0.71242499px">B</tspan></text>
        <text
           id="text6339"
           y="197.70139"
           x="214.87486"
           style="color:#000000;font-style:normal;font-variant:normal;font-weight:normal;font-stretch:normal;line-height:0%;font-family:'Roboto Slab';-inkscape-font-specification:'Roboto Slab';text-indent:0;text-align:start;text-decoration:none;text-decoration-line:none;letter-spacing:0px;word-spacing:0px;text-transform:none;writing-mode:lr-tb;direction:ltr;baseline-shift:baseline;text-anchor:start;display:inline;overflow:visible;visibility:visible;fill:#000000;fill-opacity:1;fill-rule:nonzero;stroke:none;stroke-width:0.71242499px;marker:none;enable-background:accumulate"
           xml:space="preserve"
           transform="scale(0.9999796,1.0000204)"><tspan
             y="197.70139"
             x="214.87486"
             id="tspan6341"
             sodipodi:role="line"
             style="font-size:16.01215172px;line-height:1.25;stroke-width:0.71242499px">C</tspan></text>
        <text
           xml:space="preserve"
           style="color:#000000;font-style:normal;font-variant:normal;font-weight:normal;font-stretch:normal;line-height:0%;font-family:'Roboto Slab';-inkscape-font-specification:'Roboto Slab';text-indent:0;text-align:start;text-decoration:none;text-decoration-line:none;letter-spacing:0px;word-spacing:0px;text-transform:none;writing-mode:lr-tb;direction:ltr;baseline-shift:baseline;text-anchor:start;display:inline;overflow:visible;visibility:visible;fill:#000000;fill-opacity:1;fill-rule:nonzero;stroke:none;stroke-width:0.71242499px;marker:none;enable-background:accumulate"
           x="28.780121"
           y="250.15434"
           id="text6325"
           transform="scale(0.9999796,1.0000204)"><tspan
             sodipodi:role="line"
             id="tspan6327"
             x="28.780121"
             y="250.15434"
             style="font-size:16.01215172px;line-height:1.25;stroke-width:0.71242499px">C (detailliert)</tspan></text>
        <rect
           style="display:inline;fill:#e6e6e6;stroke:#000000;stroke-width:1.42484999;stroke-linecap:round;stroke-miterlimit:4;stroke-dasharray:4.27454993, 4.27454993;stroke-dashoffset:0;stroke-opacity:1"
           id="rect6337"
           width="185.91379"
           height="185.92139"
           x="28.349617"
           y="253.46445" />
        <g
           style="display:inline;stroke-width:0.71242499"
           id="g6623"
           transform="matrix(0.78872517,0,0,0.78875738,24.253269,-132.26164)">
          <rect
             y="528.87738"
             x="115.57143"
             height="177.26541"
             width="17.142857"
             id="rect6621"
             style="fill:#999999;fill-opacity:1;stroke:#808080;stroke-width:2.70972896;stroke-linecap:round;stroke-miterlimit:4;stroke-dasharray:none;stroke-dashoffset:0;stroke-opacity:1" />
          <path
             inkscape:connector-curvature="0"
             id="path6616"
             d="M 5,528.36218 H 240.71429"
             style="fill:none;stroke:#000000;stroke-width:5.41945791;stroke-linecap:butt;stroke-linejoin:miter;stroke-miterlimit:4;stroke-dasharray:none;stroke-opacity:1" />
          <path
             sodipodi:nodetypes="ccccccc"
             inkscape:connector-curvature="0"
             id="rect6410"
             d="m 5,627.36218 h 96.42857 c 20.61571,0.30596 18.17721,33.60461 45.35714,40 h 94.64286 v 40 H 5 Z"
             style="opacity:0.8;fill:#d5f6ff;fill-opacity:1;stroke:#008080;stroke-width:0.90324295" />
          <path
             style="fill:none;stroke:#000000;stroke-width:5.41945791;stroke-linecap:butt;stroke-linejoin:miter;stroke-miterlimit:4;stroke-dasharray:none;stroke-opacity:1"
             d="M 5,706.21932 H 240.71429"
             id="path6408"
             inkscape:connector-curvature="0" />
          <path
             inkscape:connector-curvature="0"
             id="path6412"
             d="M 10,644.50504 H 65"
             style="fill:none;stroke:#000000;stroke-width:2.70972872;stroke-linecap:butt;stroke-linejoin:miter;stroke-miterlimit:4;stroke-dasharray:none;stroke-opacity:1;marker-end:url(#Arrow1Mend)" />
          <use
             style="stroke-width:0.71242499"
             height="1052.3622"
             width="744.09448"
             transform="translate(0,16)"
             id="use6414"
             xlink:href="#path6412"
             y="0"
             x="0" />
          <use
             style="stroke-width:0.71242499"
             height="1052.3622"
             width="744.09448"
             transform="translate(0,32)"
             id="use6416"
             xlink:href="#path6412"
             y="0"
             x="0" />
          <use
             style="stroke-width:0.71242499"
             height="1052.3622"
             width="744.09448"
             transform="translate(0,48)"
             id="use6418"
             xlink:href="#path6412"
             y="0"
             x="0" />
        </g>
        <text
           xml:space="preserve"
           style="color:#000000;font-style:normal;font-variant:normal;font-weight:normal;font-stretch:normal;font-size:18.99799919px;line-height:0%;font-family:'Roboto Slab';-inkscape-font-specification:'Roboto Slab';text-indent:0;text-align:start;text-decoration:none;text-decoration-line:none;letter-spacing:0px;word-spacing:0px;text-transform:none;writing-mode:lr-tb;direction:ltr;baseline-shift:baseline;text-anchor:start;display:inline;overflow:visible;visibility:visible;fill:#000000;fill-opacity:1;fill-rule:nonzero;stroke:none;stroke-width:0.71242499px;marker:none;enable-background:accumulate"
           x="-206.31721"
           y="452.409"
           id="text4694-0"
           transform="scale(0.9999796,1.0000204)"><tspan
             sodipodi:role="line"
             x="-206.31721"
             y="452.409"
             id="tspan4740-7"
             style="font-size:18.99799919px;line-height:1.25;stroke-width:0.71242499px">Optik- oder Ultraschallsensor. </tspan><tspan
             sodipodi:role="line"
             x="-206.31721"
             y="476.15649"
             id="tspan6661"
             style="font-size:18.99799919px;line-height:1.25;stroke-width:0.71242499px">Eventl. Füllstandsensor (SICK)</tspan></text>
        <rect
           style="display:inline;opacity:0.25;fill:#ffff00;fill-opacity:1;stroke:#000000;stroke-width:0.71242499"
           id="rect6797"
           width="10.87115"
           height="46.315922"
           x="82.309967"
           y="419.41943" />
        <rect
           y="264.41943"
           x="82.309967"
           height="46.315922"
           width="10.87115"
           id="rect4676-3"
           style="display:inline;opacity:0.25;fill:#ffff00;fill-opacity:1;stroke:#000000;stroke-width:0.71242499" />
        <flowRoot
           xml:space="preserve"
           id="flowRoot6699"
           style="color:#000000;font-style:normal;font-variant:normal;font-weight:normal;font-stretch:normal;line-height:0.01%;font-family:'Roboto Slab';-inkscape-font-specification:'Roboto Slab';text-indent:0;text-align:start;text-decoration:none;text-decoration-line:none;letter-spacing:0px;word-spacing:0px;text-transform:none;writing-mode:lr-tb;direction:ltr;baseline-shift:baseline;text-anchor:start;display:inline;overflow:visible;visibility:visible;fill:#000000;fill-opacity:1;fill-rule:nonzero;stroke:none;stroke-width:0.71242499px;marker:none;enable-background:accumulate"><flowRegion
             style="stroke-width:0.71242499px"
             id="flowRegion6701"><rect
               style="stroke-width:0.71242499px"
               id="rect6703"
               width="675.79205"
               height="634.37579"
               x="11.111678"
               y="110.90001" /></flowRegion><flowPara
             id="flowPara6705"
             style="font-size:14px;line-height:1.25;stroke-width:0.71242499px"> </flowPara></flowRoot>        <text
           xml:space="preserve"
           style="color:#000000;font-style:normal;font-variant:normal;font-weight:normal;font-stretch:normal;line-height:0%;font-family:'Roboto Slab';-inkscape-font-specification:'Roboto Slab';text-indent:0;text-align:start;text-decoration:none;text-decoration-line:none;letter-spacing:0px;word-spacing:0px;text-transform:none;writing-mode:lr-tb;direction:ltr;baseline-shift:baseline;text-anchor:start;display:inline;overflow:visible;visibility:visible;fill:#000000;fill-opacity:1;fill-rule:nonzero;stroke:none;stroke-width:0.71242499px;marker:none;enable-background:accumulate"
           x="-345.42923"
           y="125.1712"
           id="text4694-0-0"
           transform="matrix(0,-0.9999796,1.0000204,0,0,0)"><tspan
             sodipodi:role="line"
             x="-345.42923"
             y="125.1712"
             id="tspan6661-9"
             style="font-size:10px;line-height:1.25;stroke-width:0.71242499px">Säule</tspan></text>
        <path
           style="fill:none;stroke:#000000;stroke-width:1.42484999;stroke-linecap:butt;stroke-linejoin:miter;stroke-miterlimit:4;stroke-dasharray:4.27454993, 4.27454993;stroke-dashoffset:0;stroke-opacity:1"
           d="m 456.67682,299.81041 h 43.42194"
           id="path4743"
           inkscape:connector-curvature="0"
           sodipodi:nodetypes="cc" />
        <path
           inkscape:connector-curvature="0"
           id="path6321"
           d="M 461.53528,100.96613 V 226.10962"
           style="fill:none;stroke:#000000;stroke-width:2.13727498;stroke-linecap:butt;stroke-linejoin:miter;stroke-miterlimit:4;stroke-dasharray:none;stroke-opacity:1;marker-start:url(#Arrow1Mstart);marker-end:url(#Arrow1Mend)" />
        <path
           inkscape:connector-curvature="0"
           id="path6633"
           d="m 461.53528,228.44857 v 69.64048"
           style="fill:none;stroke:#000000;stroke-width:2.13727498;stroke-linecap:butt;stroke-linejoin:miter;stroke-miterlimit:4;stroke-dasharray:none;stroke-opacity:1;marker-start:url(#Arrow1Mstart);marker-end:url(#Arrow1Mend)" />
        <path
           sodipodi:nodetypes="cc"
           inkscape:connector-curvature="0"
           id="path6799"
           d="m 87.745542,363.82657 v 57.15174"
           style="fill:none;stroke:#000000;stroke-width:2.13727498;stroke-linecap:butt;stroke-linejoin:miter;stroke-miterlimit:4;stroke-dasharray:none;stroke-opacity:1;marker-start:url(#Arrow1Mstart);marker-end:url(#Arrow1Mend)" />
        <path
           style="fill:none;stroke:#000000;stroke-width:2.13727498;stroke-linecap:butt;stroke-linejoin:miter;stroke-miterlimit:4;stroke-dasharray:none;stroke-opacity:1;marker-start:url(#Arrow1Mstart);marker-end:url(#Arrow1Mend)"
           d="m 87.745542,311.5741 v 48.68992"
           id="path4773"
           inkscape:connector-curvature="0"
           sodipodi:nodetypes="cc" />
        <text
           id="text6751"
           y="164.27711"
           x="89.598434"
           style="color:#000000;font-style:normal;font-variant:normal;font-weight:normal;font-stretch:normal;font-size:18.99799919px;line-height:0%;font-family:'Roboto Slab';-inkscape-font-specification:'Roboto Slab';text-indent:0;text-align:start;text-decoration:none;text-decoration-line:none;letter-spacing:0px;word-spacing:0px;text-transform:none;writing-mode:lr-tb;direction:ltr;baseline-shift:baseline;text-anchor:start;display:inline;overflow:visible;visibility:visible;fill:#000000;fill-opacity:1;fill-rule:nonzero;stroke:none;stroke-width:0.71242499px;marker:none;enable-background:accumulate"
           xml:space="preserve"><tspan
             y="164.27711"
             x="89.598434"
             id="tspan6753"
             sodipodi:role="line"
             style="font-size:18.99799919px;line-height:1.25;stroke-width:0.71242499px">Zulauf</tspan></text>
        <text
           id="text6755"
           y="185.84811"
           x="558.3092"
           style="color:#000000;font-style:normal;font-variant:normal;font-weight:normal;font-stretch:normal;font-size:18.99799919px;line-height:0%;font-family:'Roboto Slab';-inkscape-font-specification:'Roboto Slab';text-indent:0;text-align:start;text-decoration:none;text-decoration-line:none;letter-spacing:0px;word-spacing:0px;text-transform:none;writing-mode:lr-tb;direction:ltr;baseline-shift:baseline;text-anchor:start;display:inline;overflow:visible;visibility:visible;fill:#000000;fill-opacity:1;fill-rule:nonzero;stroke:none;stroke-width:0.71242499px;marker:none;enable-background:accumulate"
           xml:space="preserve"><tspan
             y="185.84811"
             x="558.3092"
             id="tspan6757"
             sodipodi:role="line"
             style="font-size:18.99799919px;line-height:1.25;stroke-width:0.71242499px">Ablauf</tspan></text>
        <text
           xml:space="preserve"
           style="color:#000000;font-style:normal;font-variant:normal;font-weight:normal;font-stretch:normal;line-height:0%;font-family:'Roboto Slab';-inkscape-font-specification:'Roboto Slab';text-indent:0;text-align:start;text-decoration:none;text-decoration-line:none;letter-spacing:0px;word-spacing:0px;text-transform:none;writing-mode:lr-tb;direction:ltr;baseline-shift:baseline;text-anchor:start;display:inline;overflow:visible;visibility:visible;fill:#000000;fill-opacity:1;fill-rule:nonzero;stroke:none;stroke-width:0.71242499px;marker:none;enable-background:accumulate"
           x="296.67972"
           y="577.96826"
           id="text6726"><tspan
             sodipodi:role="line"
             id="tspan6728"
             x="296.67972"
             y="577.96826"
             style="font-size:14px;line-height:1.25;stroke-width:0.71242499px">Entleerung</tspan></text>
        <text
           id="text6755-7"
           y="435.98245"
           x="-199.49606"
           style="color:#000000;font-style:normal;font-variant:normal;font-weight:normal;font-stretch:normal;font-size:18.99799919px;line-height:0%;font-family:'Roboto Slab';-inkscape-font-specification:'Roboto Slab';text-indent:0;text-align:start;text-decoration:none;text-decoration-line:none;letter-spacing:0px;word-spacing:0px;text-transform:none;writing-mode:lr-tb;direction:ltr;baseline-shift:baseline;text-anchor:start;display:inline;overflow:visible;visibility:visible;fill:#000000;fill-opacity:1;fill-rule:nonzero;stroke:none;stroke-width:0.71242499px;marker:none;enable-background:accumulate"
           xml:space="preserve"
           transform="rotate(-90)"><tspan
             y="435.98245"
             x="-199.49606"
             id="tspan6757-5"
             sodipodi:role="line"
             style="font-size:18.99799919px;line-height:1.25;stroke-width:0.71242499px">Tauchwand</tspan></text>
        <text
           id="text6755-1"
           y="442.81131"
           x="329.84561"
           style="color:#000000;font-style:normal;font-variant:normal;font-weight:normal;font-stretch:normal;font-size:18.99799919px;line-height:0%;font-family:'Roboto Slab';-inkscape-font-specification:'Roboto Slab';text-indent:0;text-align:start;text-decoration:none;text-decoration-line:none;letter-spacing:0px;word-spacing:0px;text-transform:none;writing-mode:lr-tb;direction:ltr;baseline-shift:baseline;text-anchor:start;display:inline;overflow:visible;visibility:visible;fill:#000000;fill-opacity:1;fill-rule:nonzero;stroke:none;stroke-width:0.71242499px;marker:none;enable-background:accumulate"
           xml:space="preserve"><tspan
             y="442.81131"
             x="329.84561"
             id="tspan6757-8"
             sodipodi:role="line"
             style="font-size:18.99799919px;line-height:1.25;stroke-width:0.71242499px">Partikeln</tspan></text>
      </g>
      <image
         sodipodi:absref="/home/juanpi/Projects/HSR/WABEsense/wabesense/doc/img/flowsensor_doppler.png"
         xlink:href="flowsensor_doppler.png"
         y="319.84656"
         x="566.82043"
         id="image1400"
         preserveAspectRatio="none"
         height="113.81604"
         width="377.66232"
         style="stroke-width:3.86588717" />
      <image
         sodipodi:absref="/home/juanpi/Projects/HSR/WABEsense/wabesense/doc/img/pressuresensor_trafag.png"
         xlink:href="pressuresensor_trafag.png"
         y="25.681021"
         x="1291.6576"
         id="image2655"
         preserveAspectRatio="none"
         height="305.10867"
         width="305.10867"
         style="stroke-width:0.37757036" />
      <image
         sodipodi:absref="/home/juanpi/Projects/HSR/WABEsense/wabesense/doc/img/levelsensor_ultrasound.png"
         xlink:href="levelsensor_ultrasound.png"
         y="-392.01859"
         x="1568.1443"
         id="image2701"
         preserveAspectRatio="none"
         height="143.36"
         width="191.03999" />
    </g>
  </g>
</svg>
