(module PHOENIX_1935161 (layer F.Cu) (tedit 5F61ED66)
  (fp_text reference REF** (at 0 0) (layer F.SilkS)
    (effects (font (size 0.787402 0.787402) (thickness 0.015)))
  )
  (fp_text value PHOENIX_1935161 (at 0 0) (layer F.Fab)
    (effects (font (size 0.787402 0.787402) (thickness 0.015)))
  )
  (fp_line (start -5.25 4.55) (end -5.25 -4.25) (layer F.CrtYd) (width 0.05))
  (fp_line (start 5.25 4.55) (end -5.25 4.55) (layer F.CrtYd) (width 0.05))
  (fp_line (start 5.25 -4.25) (end 5.25 4.55) (layer F.CrtYd) (width 0.05))
  (fp_line (start -5.25 -4.25) (end 5.25 -4.25) (layer F.CrtYd) (width 0.05))
  (fp_circle (center -3.8 -1.5) (end -3.66 -1.5) (layer F.Fab) (width 0.28))
  (fp_circle (center -3.8 -1.5) (end -3.66 -1.5) (layer F.SilkS) (width 0.28))
  (fp_line (start 5 4.3) (end -5 4.3) (layer F.Fab) (width 0.127))
  (fp_line (start 5 -4) (end 5 4.3) (layer F.Fab) (width 0.127))
  (fp_line (start -5 -4) (end 5 -4) (layer F.Fab) (width 0.127))
  (fp_line (start -5 4.3) (end -5 -4) (layer F.Fab) (width 0.127))
  (fp_line (start -5 4.3) (end -5 -4) (layer F.SilkS) (width 0.127))
  (fp_line (start 5 4.3) (end -5 4.3) (layer F.SilkS) (width 0.127))
  (fp_line (start 5 -4) (end 5 4.3) (layer F.SilkS) (width 0.127))
  (fp_line (start -5 -4) (end 5 -4) (layer F.SilkS) (width 0.127))
  (fp_text user NAME (at -5.08705 -5.08705) (layer Dwgs.User)
    (effects (font (size 1.001394 1.001394) (thickness 0.015)))
  )
  (fp_text user VALUE (at -5.09283 6.36604) (layer F.Fab)
    (effects (font (size 1.002528 1.002528) (thickness 0.015)))
  )
  (pad 1 thru_hole rect (at -2.5 0) (size 1.95 1.95) (drill 1.3) (layers *.Cu *.Mask))
  (pad 2 thru_hole circle (at 2.5 0) (size 1.95 1.95) (drill 1.3) (layers *.Cu *.Mask))
  (model ${KIPRJMOD}/dataloggerFootprintLibrary.models/1935161--3DModel-STEP-56544.STEP
    (offset (xyz -2.5 2.5 6))
    (scale (xyz 1 1 1))
    (rotate (xyz -90 0 0))
  )
)
