(module CUI_UJ2-BH-1-TH (layer F.Cu) (tedit 5F9C7278)
  (fp_text reference REF** (at -4.19 -9.28) (layer F.SilkS)
    (effects (font (size 1 1) (thickness 0.15)))
  )
  (fp_text value CUI_UJ2-BH-1-TH (at 10.39 -4.63) (layer F.Fab)
    (effects (font (size 1.000575 1.000575) (thickness 0.015)))
  )
  (fp_line (start -6.1 -8.25) (end 6.1 -8.25) (layer F.Fab) (width 0.127))
  (fp_line (start 6.1 -8.25) (end 6.1 8.25) (layer F.Fab) (width 0.127))
  (fp_line (start 6.1 8.25) (end -6.1 8.25) (layer F.Fab) (width 0.127))
  (fp_line (start -6.1 8.25) (end -6.1 -8.25) (layer F.Fab) (width 0.127))
  (fp_circle (center 1.25 -6.62) (end 1.45 -6.62) (layer F.Fab) (width 0.4))
  (fp_line (start -6.1 -3.88) (end -6.1 -8.25) (layer F.SilkS) (width 0.127))
  (fp_line (start -6.1 -8.25) (end 6.1 -8.25) (layer F.SilkS) (width 0.127))
  (fp_line (start 6.1 -8.25) (end 6.1 -3.88) (layer F.SilkS) (width 0.127))
  (fp_line (start -6.1 -0.01) (end -6.1 8.25) (layer F.SilkS) (width 0.127))
  (fp_line (start -6.1 8.25) (end 6.1 8.25) (layer F.SilkS) (width 0.127))
  (fp_line (start 6.1 8.25) (end 6.1 -0.01) (layer F.SilkS) (width 0.127))
  (fp_circle (center 6.75 -6.62) (end 6.95 -6.62) (layer F.SilkS) (width 0.2))
  (fp_line (start -6.35 -8.5) (end 6.35 -8.5) (layer F.CrtYd) (width 0.05))
  (fp_line (start 6.35 -8.5) (end 6.35 -3.88) (layer F.CrtYd) (width 0.05))
  (fp_line (start 6.35 -3.88) (end 7.92 -3.88) (layer F.CrtYd) (width 0.05))
  (fp_line (start 7.92 -3.88) (end 7.92 0) (layer F.CrtYd) (width 0.05))
  (fp_line (start 7.92 0) (end 6.35 0) (layer F.CrtYd) (width 0.05))
  (fp_line (start 6.35 0) (end 6.35 8.5) (layer F.CrtYd) (width 0.05))
  (fp_line (start 6.35 8.5) (end -6.35 8.5) (layer F.CrtYd) (width 0.05))
  (fp_line (start -6.35 8.5) (end -6.35 -0.01) (layer F.CrtYd) (width 0.05))
  (fp_line (start -6.35 -0.01) (end -7.92 -0.01) (layer F.CrtYd) (width 0.05))
  (fp_line (start -7.92 -0.01) (end -7.92 -3.88) (layer F.CrtYd) (width 0.05))
  (fp_line (start -7.92 -3.88) (end -6.35 -3.88) (layer F.CrtYd) (width 0.05))
  (fp_line (start -6.35 -3.88) (end -6.35 -8.5) (layer F.CrtYd) (width 0.05))
  (fp_text user REF** (at 0 0) (layer F.Fab)
    (effects (font (size 1 1) (thickness 0.15)))
  )
  (pad 2 thru_hole circle (at -1.25 -6.62) (size 1.428 1.428) (drill 0.92) (layers *.Cu *.Mask))
  (pad 1 thru_hole rect (at 1.25 -6.62) (size 1.428 1.428) (drill 0.92) (layers *.Cu *.Mask))
  (pad 3 thru_hole circle (at -1.25 -4.62) (size 1.428 1.428) (drill 0.92) (layers *.Cu *.Mask))
  (pad 4 thru_hole circle (at 1.25 -4.62) (size 1.428 1.428) (drill 0.92) (layers *.Cu *.Mask))
  (pad SH1 thru_hole circle (at -6.02 -1.91) (size 3.316 3.316) (drill 2.3) (layers *.Cu *.Mask))
  (pad SH2 thru_hole circle (at 6.02 -1.91) (size 3.316 3.316) (drill 2.3) (layers *.Cu *.Mask))
  (model ${KIPRJMOD}/dataloggerFootprintLibrary.models/CUI_DEVICES_UJ2-BH-1-TH.step
    (offset (xyz -1.2 -14.5 0.4))
    (scale (xyz 1 1 1))
    (rotate (xyz 90 180 180))
  )
)
