(module SON50P300X200X80-11N (layer F.Cu) (tedit 610CE4FA)
  (fp_text reference REF** (at 0.032 -2.2964) (layer F.SilkS)
    (effects (font (size 0.64 0.64) (thickness 0.15)))
  )
  (fp_text value SON50P300X200X80-11N (at 6.128 2.2964) (layer F.Fab)
    (effects (font (size 0.64 0.64) (thickness 0.15)))
  )
  (fp_line (start 1.615 -1.75) (end 1.615 1.75) (layer F.CrtYd) (width 0.05))
  (fp_line (start -1.615 -1.75) (end -1.615 1.75) (layer F.CrtYd) (width 0.05))
  (fp_line (start -1.615 1.75) (end 1.615 1.75) (layer F.CrtYd) (width 0.05))
  (fp_line (start -1.615 -1.75) (end 1.615 -1.75) (layer F.CrtYd) (width 0.05))
  (fp_line (start 1.5 -1.5) (end 1.5 1.5) (layer F.Fab) (width 0.127))
  (fp_line (start -1.5 -1.5) (end -1.5 1.5) (layer F.Fab) (width 0.127))
  (fp_line (start -1.5 1.515) (end 1.5 1.515) (layer F.SilkS) (width 0.127))
  (fp_line (start -1.5 -1.515) (end 1.5 -1.515) (layer F.SilkS) (width 0.127))
  (fp_line (start -1.5 1.5) (end 1.5 1.5) (layer F.Fab) (width 0.127))
  (fp_line (start -1.5 -1.5) (end 1.5 -1.5) (layer F.Fab) (width 0.127))
  (fp_circle (center -1.83 -1.87) (end -1.75 -1.87) (layer F.Fab) (width 0.16))
  (fp_circle (center -1.83 -1.88) (end -1.75 -1.88) (layer F.SilkS) (width 0.16))
  (fp_poly (pts (xy -0.2 -0.76) (xy 0.2 -0.76) (xy 0.2 0.76) (xy -0.2 0.76)) (layer F.Paste) (width 0.01))
  (pad 1 smd rect (at -1.4 -1) (size 0.8 0.27) (layers F.Cu F.Paste F.Mask))
  (pad 2 smd rect (at -1.4 -0.5) (size 0.8 0.27) (layers F.Cu F.Paste F.Mask))
  (pad 3 smd rect (at -1.4 0) (size 0.8 0.27) (layers F.Cu F.Paste F.Mask))
  (pad 4 smd rect (at -1.4 0.5) (size 0.8 0.27) (layers F.Cu F.Paste F.Mask))
  (pad 5 smd rect (at -1.4 1) (size 0.8 0.27) (layers F.Cu F.Paste F.Mask))
  (pad 6 smd rect (at 1.4 1) (size 0.8 0.27) (layers F.Cu F.Paste F.Mask))
  (pad 7 smd rect (at 1.4 0.5) (size 0.8 0.27) (layers F.Cu F.Paste F.Mask))
  (pad 8 smd rect (at 1.4 0) (size 0.8 0.27) (layers F.Cu F.Paste F.Mask))
  (pad 9 smd rect (at 1.4 -0.5) (size 0.8 0.27) (layers F.Cu F.Paste F.Mask))
  (pad 10 smd rect (at 1.4 -1) (size 0.8 0.27) (layers F.Cu F.Paste F.Mask))
  (pad 11 smd rect (at 0 0) (size 1.65 2.4) (layers F.Cu F.Paste F.Mask))
  (model ${KISYS3DMOD}/Package_DFN_QFN.3dshapes/DFN-10-1EP_3x3mm_P0.5mm_EP1.55x2.48mm.step
    (at (xyz 0 0 0))
    (scale (xyz 1 1 1))
    (rotate (xyz 0 0 0))
  )
)
