(module SON50P200X300X80-13N100X265 (layer F.Cu) (tedit 5F578F5A)
  (fp_text reference REF** (at -0.38411 -2.003768) (layer F.SilkS)
    (effects (font (size 0.320091 0.320091) (thickness 0.015)))
  )
  (fp_text value SON50P200X300X80-13N100X265 (at 4.090007 2.098651) (layer F.Fab)
    (effects (font (size 0.320283 0.320283) (thickness 0.015)))
  )
  (fp_circle (center -1.251 -1.25) (end -1.201 -1.25) (layer F.Fab) (width 0.1))
  (fp_poly (pts (xy -0.475041 -1.27) (xy 0.475 -1.27) (xy 0.475 -0.100009) (xy -0.475041 -0.100009)) (layer F.Paste) (width 0.01))
  (fp_poly (pts (xy -0.475881 0.1) (xy 0.475 0.1) (xy 0.475 1.27236) (xy -0.475881 1.27236)) (layer F.Paste) (width 0.01))
  (fp_line (start 1.45 -1.75) (end 1.45 1.75) (layer F.CrtYd) (width 0.05))
  (fp_line (start -1.45 -1.75) (end -1.45 1.75) (layer F.CrtYd) (width 0.05))
  (fp_line (start -1.45 1.75) (end 1.45 1.75) (layer F.CrtYd) (width 0.05))
  (fp_line (start -1.45 -1.75) (end 1.45 -1.75) (layer F.CrtYd) (width 0.05))
  (fp_line (start 1 -1.5) (end 1 1.5) (layer F.Fab) (width 0.127))
  (fp_line (start -1 -1.5) (end -1 1.5) (layer F.Fab) (width 0.127))
  (fp_line (start -1 1.5) (end 1 1.5) (layer F.SilkS) (width 0.127))
  (fp_line (start -1 -1.5) (end 1 -1.5) (layer F.SilkS) (width 0.127))
  (fp_line (start -1 1.5) (end 1 1.5) (layer F.Fab) (width 0.127))
  (fp_line (start -1 -1.5) (end 1 -1.5) (layer F.Fab) (width 0.127))
  (fp_circle (center -1.651 -1.25) (end -1.601 -1.25) (layer F.SilkS) (width 0.1))
  (pad 1 smd rect (at -0.95 -1.25) (size 0.5 0.25) (layers F.Cu F.Paste F.Mask))
  (pad 2 smd rect (at -0.95 -0.75) (size 0.5 0.25) (layers F.Cu F.Paste F.Mask))
  (pad 3 smd rect (at -0.95 -0.25) (size 0.5 0.25) (layers F.Cu F.Paste F.Mask))
  (pad 4 smd rect (at -0.95 0.25) (size 0.5 0.25) (layers F.Cu F.Paste F.Mask))
  (pad 5 smd rect (at -0.95 0.75) (size 0.5 0.25) (layers F.Cu F.Paste F.Mask))
  (pad 6 smd rect (at -0.95 1.25) (size 0.5 0.25) (layers F.Cu F.Paste F.Mask))
  (pad 7 smd rect (at 0.95 1.25) (size 0.5 0.25) (layers F.Cu F.Paste F.Mask))
  (pad 8 smd rect (at 0.95 0.75) (size 0.5 0.25) (layers F.Cu F.Paste F.Mask))
  (pad 9 smd rect (at 0.95 0.25) (size 0.5 0.25) (layers F.Cu F.Paste F.Mask))
  (pad 10 smd rect (at 0.95 -0.25) (size 0.5 0.25) (layers F.Cu F.Paste F.Mask))
  (pad 11 smd rect (at 0.95 -0.75) (size 0.5 0.25) (layers F.Cu F.Paste F.Mask))
  (pad 12 smd rect (at 0.95 -1.25) (size 0.5 0.25) (layers F.Cu F.Paste F.Mask))
  (pad 13 smd rect (at 0 0) (size 1 2.65) (layers F.Cu F.Paste F.Mask))
)
