(module SOT-23-5 (layer F.Cu) (tedit 60EC1735)
  (descr "5-pin SOT23 package")
  (tags SOT-23-5)
  (attr smd)
  (fp_text reference REF** (at 0 -2.9) (layer F.SilkS)
    (effects (font (size 1 1) (thickness 0.15)))
  )
  (fp_text value SOT-23-5 (at 0 2.9) (layer F.Fab)
    (effects (font (size 1 1) (thickness 0.15)))
  )
  (fp_circle (center -1.54 -2.02) (end -1.39 -2.02) (layer F.SilkS) (width 0.3))
  (fp_line (start 0.9 -1.61) (end -0.18 -1.61) (layer F.SilkS) (width 0.12))
  (fp_line (start -1.9 -1.8) (end 1.9 -1.8) (layer F.CrtYd) (width 0.05))
  (fp_line (start 1.9 -1.8) (end 1.9 1.8) (layer F.CrtYd) (width 0.05))
  (fp_line (start 1.9 1.8) (end -1.9 1.8) (layer F.CrtYd) (width 0.05))
  (fp_line (start -1.9 1.8) (end -1.9 -1.8) (layer F.CrtYd) (width 0.05))
  (fp_line (start -0.9 -0.9) (end -0.25 -1.55) (layer F.Fab) (width 0.1))
  (fp_line (start 0.9 -1.55) (end -0.25 -1.55) (layer F.Fab) (width 0.1))
  (fp_line (start -0.9 -0.9) (end -0.9 1.55) (layer F.Fab) (width 0.1))
  (fp_line (start 0.9 1.55) (end -0.9 1.55) (layer F.Fab) (width 0.1))
  (fp_line (start 0.9 -1.55) (end 0.9 1.55) (layer F.Fab) (width 0.1))
  (fp_line (start -0.52 -1.28) (end -0.19 -1.61) (layer F.SilkS) (width 0.1))
  (fp_text user %R (at 0 0 180) (layer F.Fab)
    (effects (font (size 0.5 0.5) (thickness 0.075)))
  )
  (pad 1 smd rect (at -1.3 -0.95) (size 1.06 0.65) (layers F.Cu F.Paste F.Mask))
  (pad 2 smd rect (at -1.3 0) (size 1.06 0.65) (layers F.Cu F.Paste F.Mask))
  (pad 3 smd rect (at -1.3 0.95) (size 1.06 0.65) (layers F.Cu F.Paste F.Mask))
  (pad 4 smd rect (at 1.3 0.95) (size 1.06 0.65) (layers F.Cu F.Paste F.Mask))
  (pad 5 smd rect (at 1.3 -0.95) (size 1.06 0.65) (layers F.Cu F.Paste F.Mask))
  (model ${KISYS3DMOD}/Package_TO_SOT_SMD.3dshapes/SOT-23-5.wrl
    (at (xyz 0 0 0))
    (scale (xyz 1 1 1))
    (rotate (xyz 0 0 0))
  )
)
