(module BAT_HolderAA_Keystone_2915 (layer F.Cu) (tedit 5F84062F)
  (fp_text reference REF** (at 0 -3.25) (layer F.SilkS)
    (effects (font (size 1 1) (thickness 0.15)))
  )
  (fp_text value BAT_HolderAA_Keystone_2915 (at 0 3.25) (layer F.Fab)
    (effects (font (size 1 1) (thickness 0.15)))
  )
  (fp_line (start -4.81 7) (end -4.81 -7) (layer F.SilkS) (width 0.12))
  (fp_line (start -4.81 -7) (end 6 -7) (layer F.SilkS) (width 0.12))
  (fp_line (start 6 7) (end 6 -7) (layer F.SilkS) (width 0.12))
  (fp_line (start 6 7) (end -4.81 7) (layer F.SilkS) (width 0.12))
  (fp_line (start -4.81 -7) (end 6 -7) (layer F.CrtYd) (width 0.05))
  (fp_line (start 6 -7) (end 6 7) (layer F.CrtYd) (width 0.05))
  (fp_line (start 6 7) (end -4.81 7) (layer F.CrtYd) (width 0.05))
  (fp_line (start -4.81 7) (end -4.81 -7) (layer F.CrtYd) (width 0.05))
  (pad 1 thru_hole oval (at -3.81 0) (size 3.5 3.5) (drill 1.9) (layers *.Cu *.Mask))
  (pad 1 thru_hole oval (at 3.81 0) (size 3.5 3.5) (drill 1.9) (layers *.Cu *.Mask))
  (model ${KIPRJMOD}/dataloggerFootprintLibrary.models/Keystone_AA_batteryClip_2915.STEP
    (offset (xyz 2.5 0 9))
    (scale (xyz 1 1 1))
    (rotate (xyz -90 0 0))
  )
)
