(module SOT-23-6L (layer F.Cu) (tedit 5F993C7A)
  (descr "6-pin SOT-23 package")
  (tags SOT-23-6)
  (attr smd)
  (fp_text reference REF** (at 0 -2.9) (layer F.SilkS)
    (effects (font (size 1 1) (thickness 0.15)))
  )
  (fp_text value SOT-23-6L (at 0 2.9) (layer F.Fab)
    (effects (font (size 1 1) (thickness 0.15)))
  )
  (fp_line (start -0.51 -1.29) (end -0.19 -1.61) (layer F.SilkS) (width 0.1))
  (fp_line (start 0.9 -1.55) (end 0.9 1.55) (layer F.Fab) (width 0.1))
  (fp_line (start 0.9 1.55) (end -0.9 1.55) (layer F.Fab) (width 0.1))
  (fp_line (start -0.9 -0.9) (end -0.9 1.55) (layer F.Fab) (width 0.1))
  (fp_line (start 0.9 -1.55) (end -0.25 -1.55) (layer F.Fab) (width 0.1))
  (fp_line (start -0.9 -0.9) (end -0.25 -1.55) (layer F.Fab) (width 0.1))
  (fp_line (start -1.9 -1.8) (end -1.9 1.8) (layer F.CrtYd) (width 0.05))
  (fp_line (start -1.9 1.8) (end 1.9 1.8) (layer F.CrtYd) (width 0.05))
  (fp_line (start 1.9 1.8) (end 1.9 -1.8) (layer F.CrtYd) (width 0.05))
  (fp_line (start 1.9 -1.8) (end -1.9 -1.8) (layer F.CrtYd) (width 0.05))
  (fp_line (start 0.9 -1.61) (end -0.19 -1.61) (layer F.SilkS) (width 0.12))
  (fp_text user %R (at 0 0 180) (layer F.Fab)
    (effects (font (size 0.5 0.5) (thickness 0.075)))
  )
  (fp_circle (center -1.58 -1.97) (end -1.43 -1.97) (layer F.SilkS) (width 0.3))
  (pad 1 smd rect (at -1.15 -0.95) (size 1.2 0.65) (layers F.Cu F.Paste F.Mask))
  (pad 2 smd rect (at -1.15 0) (size 1.2 0.65) (layers F.Cu F.Paste F.Mask))
  (pad 3 smd rect (at -1.15 0.95) (size 1.2 0.65) (layers F.Cu F.Paste F.Mask))
  (pad 4 smd rect (at 1.15 0.95) (size 1.2 0.65) (layers F.Cu F.Paste F.Mask))
  (pad 6 smd rect (at 1.15 -0.95) (size 1.2 0.65) (layers F.Cu F.Paste F.Mask))
  (pad 5 smd rect (at 1.15 0) (size 1.2 0.65) (layers F.Cu F.Paste F.Mask))
  (model ${KISYS3DMOD}/Package_TO_SOT_SMD.3dshapes/SOT-23-6.wrl
    (at (xyz 0 0 0))
    (scale (xyz 1 1 1))
    (rotate (xyz 0 0 0))
  )
)
