<?xml version="1.0" encoding="UTF-8" standalone="no"?>
<svg
   xmlns:dc="http://purl.org/dc/elements/1.1/"
   xmlns:cc="http://creativecommons.org/ns#"
   xmlns:rdf="http://www.w3.org/1999/02/22-rdf-syntax-ns#"
   xmlns:svg="http://www.w3.org/2000/svg"
   xmlns="http://www.w3.org/2000/svg"
   xmlns:xlink="http://www.w3.org/1999/xlink"
   xmlns:sodipodi="http://sodipodi.sourceforge.net/DTD/sodipodi-0.dtd"
   xmlns:inkscape="http://www.inkscape.org/namespaces/inkscape"
   width="210mm"
   height="297mm"
   viewBox="0 0 210 297"
   version="1.1"
   id="svg1251"
   inkscape:version="1.0.2-2 (e86c870879, 2021-01-15)"
   sodipodi:docname="STM32CubeProgrammer_ErasingAndProgramming_Connect_annotated - Kopie.svg"
   inkscape:export-filename="STM32CubeProgrammer_ErasingAndProgramming_Connect_annotated.png"
   inkscape:export-xdpi="150"
   inkscape:export-ydpi="150">
  <defs
     id="defs1245">
    <rect
       x="71.690882"
       y="36.041318"
       width="24.288714"
       height="16.845398"
       id="rect1940" />
    <rect
       x="71.69088"
       y="36.041317"
       width="24.288713"
       height="16.845398"
       id="rect1940-5" />
    <rect
       x="71.69088"
       y="36.041317"
       width="24.288713"
       height="16.845398"
       id="rect1953" />
  </defs>
  <sodipodi:namedview
     id="base"
     pagecolor="#ffffff"
     bordercolor="#666666"
     borderopacity="1.0"
     inkscape:pageopacity="0.0"
     inkscape:pageshadow="2"
     inkscape:zoom="0.92154439"
     inkscape:cx="747.41197"
     inkscape:cy="333.90417"
     inkscape:document-units="mm"
     inkscape:current-layer="layer1"
     inkscape:document-rotation="0"
     showgrid="false"
     inkscape:window-width="1536"
     inkscape:window-height="801"
     inkscape:window-x="-8"
     inkscape:window-y="-8"
     inkscape:window-maximized="1" />
  <metadata
     id="metadata1248">
    <rdf:RDF>
      <cc:Work
         rdf:about="">
        <dc:format>image/svg+xml</dc:format>
        <dc:type
           rdf:resource="http://purl.org/dc/dcmitype/StillImage" />
        <dc:title />
      </cc:Work>
    </rdf:RDF>
  </metadata>
  <g
     inkscape:label="Ebene 1"
     inkscape:groupmode="layer"
     id="layer1">
    <image
       sodipodi:absref="C:\Daten\WABEsense\datalogger_firmware\doc\pictures\firmwareFlashing\STM32CubeProgrammer_ErasingAndProgramming_Connect.JPG"
       xlink:href="STM32CubeProgrammer_ErasingAndProgramming_Connect.JPG"
       width="385.68542"
       height="206.90416"
       preserveAspectRatio="none"
       id="image1824"
       x="-53.181255"
       y="44.714588" />
    <rect
       style="fill:none;stroke:#ff0000;stroke-width:1.26707;stroke-linejoin:round;stroke-miterlimit:4;stroke-dasharray:7.6024, 2.53413;stroke-dashoffset:0;stroke-opacity:1"
       id="rect1828"
       width="79.235191"
       height="9.5014029"
       x="253.7971"
       y="71.706009" />
    <text
       xml:space="preserve"
       id="text1938"
       style="font-style:normal;font-weight:normal;font-size:10.5833px;line-height:1.25;font-family:sans-serif;white-space:pre;shape-inside:url(#rect1940);fill:#000000;fill-opacity:1;stroke:none;"
       inkscape:transform-center-x="-76.45518"
       inkscape:transform-center-y="-58.726443"
       transform="translate(183.57957,34.994592)"><tspan
         x="71.691406"
         y="45.404755"><tspan
           style="fill:#ff0000;fill-opacity:1">2.</tspan></tspan></text>
  </g>
</svg>
