<?xml version="1.0" encoding="utf-8"?>
<!-- Generator: Adobe Illustrator 24.3.0, SVG Export Plug-In . SVG Version: 6.00 Build 0)  -->
<svg version="1.1" id="Layer_1" xmlns="http://www.w3.org/2000/svg" xmlns:xlink="http://www.w3.org/1999/xlink" x="0px" y="0px"
	 viewBox="0 0 455.17 425.38" style="enable-background:new 0 0 455.17 425.38;" xml:space="preserve">
<style type="text/css">
	.st0{opacity:0.2;fill:#F58220;}
	.st1{fill:none;stroke:#000000;stroke-miterlimit:10;}
	.st2{fill:#00E7F0;}
	.st3{fill:#00B6BD;}
	.st4{fill:#57A4FF;}
	.st5{clip-path:url(#SVGID_2_);}
	.st6{fill:#F58220;}
	.st7{fill:#5C5D60;}
	.st8{fill:none;}
	.st9{fill:#CE174C;}
	.st10{clip-path:url(#SVGID_4_);}
	.st11{fill:#231F20;}
	.st12{fill:#221F1F;}
	.st13{fill:#202020;}
	.st14{fill:#FCFCFC;}
	.st15{fill:#FFFFFF;}
</style>
<circle class="st0" cx="226.16" cy="205.39" r="168.21"/>
<g>
	<g>
		<rect x="29.65" y="219.81" class="st6" width="4.96" height="5.45"/>
		<rect x="29.65" y="256.27" class="st6" width="4.96" height="5.45"/>
		
			<rect x="43.54" y="249.75" transform="matrix(-0.6367 0.7711 -0.7711 -0.6367 269.7598 377.2405)" class="st6" width="4.96" height="4.84"/>
		
			<rect x="15.93" y="226.87" transform="matrix(-0.6367 0.7711 -0.7711 -0.6367 206.9417 361.088)" class="st6" width="4.96" height="4.84"/>
		
			<rect x="43.41" y="226.74" transform="matrix(0.6376 0.7703 -0.7703 0.6376 193.2276 47.7177)" class="st6" width="4.96" height="5.01"/>
		
			<rect x="15.76" y="249.62" transform="matrix(0.6376 0.7703 -0.7703 0.6376 200.8239 77.3101)" class="st6" width="4.96" height="5.01"/>
		
			<rect x="11.55" y="238.2" transform="matrix(-5.826341e-03 -1 1 -5.826341e-03 -226.6304 256.1409)" class="st6" width="4.92" height="5.06"/>
		
			<rect x="47.7" y="237.99" transform="matrix(-5.826341e-03 -1 1 -5.826341e-03 -190.0577 292.0771)" class="st6" width="4.92" height="5.06"/>
	</g>
	<g>
		<rect x="300.12" y="71.84" class="st7" width="1.87" height="15.77"/>
		<rect x="300.12" y="85.56" class="st7" width="1.87" height="2.05"/>
		
			<rect x="305.34" y="83.1" transform="matrix(-0.6367 0.7711 -0.7711 -0.6367 566.0662 -98.6657)" class="st7" width="1.87" height="1.82"/>
		
			<rect x="300.16" y="72.04" transform="matrix(-0.6367 0.7711 -0.7711 -0.6367 554.2515 -101.726)" class="st7" width="1.87" height="15.31"/>
		
			<rect x="300.08" y="71.99" transform="matrix(0.6377 0.7703 -0.7703 0.6377 170.4714 -203.0003)" class="st7" width="1.87" height="15.42"/>
		
			<rect x="294.89" y="83.05" transform="matrix(0.6376 0.7703 -0.7703 0.6376 171.8961 -197.4431)" class="st7" width="1.87" height="1.89"/>
		
			<rect x="300.07" y="71.95" transform="matrix(-5.828872e-03 -1 1 -5.828872e-03 223.0813 381.123)" class="st7" width="1.85" height="15.43"/>
		
			<rect x="306.91" y="78.68" transform="matrix(-5.826341e-03 -1 1 -5.826341e-03 230.002 387.9233)" class="st7" width="1.85" height="1.9"/>
	</g>
	<g>
		<path class="st6" d="M284.45,227.85c0,34.34-27.84,62.18-62.18,62.18s-62.18-27.84-62.18-62.18s27.84-62.18,62.18-62.18
			c16.49,0,32.31,6.55,43.97,18.21C277.9,195.55,284.45,211.36,284.45,227.85L284.45,227.85z M284.45,227.85"/>
		<path class="st6" d="M334.2,215.42c6.87,0,12.44,5.57,12.44,12.44c0,6.87-5.57,12.44-12.44,12.44c-1.67,0.02-3.32-0.32-4.85-1
			c-4.58-1.95-7.56-6.46-7.56-11.44s2.98-9.49,7.56-11.44C330.87,215.74,332.53,215.4,334.2,215.42L334.2,215.42z M334.2,215.42"/>
		<path class="st7" d="M292.25,157.88c-2.34-2.33-3.65-5.49-3.65-8.79c-0.02-1.67,0.32-3.32,1-4.85c2.13-5.04,7.31-8.09,12.74-7.52
			c5.44,0.57,9.87,4.63,10.91,9.99c1.04,5.37-1.54,10.79-6.37,13.36C302.05,162.64,296.11,161.75,292.25,157.88L292.25,157.88z
			 M292.25,157.88"/>
		<path class="st6" d="M292.25,297.82c3.86-3.87,9.8-4.76,14.63-2.19c4.83,2.57,7.42,7.99,6.37,13.36
			c-1.04,5.37-5.47,9.42-10.91,9.99c-5.44,0.57-10.61-2.48-12.74-7.52c-0.67-1.53-1.01-3.18-1-4.85
			C288.6,303.31,289.91,300.15,292.25,297.82L292.25,297.82z M292.25,297.82"/>
		<path class="st7" d="M234.71,115.93c0,2.48-0.74,4.9-2.11,6.96c-2.55,3.78-6.97,5.86-11.51,5.42c-4.54-0.44-8.47-3.33-10.25-7.53
			c-0.67-1.53-1.01-3.18-1-4.85c0-6.87,5.57-12.44,12.44-12.44C229.14,103.5,234.71,109.07,234.71,115.93L234.71,115.93z
			 M234.71,115.93"/>
		<path class="st6" d="M232.6,332.81c1.38,2.06,2.11,4.48,2.11,6.96c0,6.87-5.57,12.44-12.44,12.44c-6.87,0-12.44-5.57-12.44-12.44
			c-0.02-1.67,0.32-3.32,1-4.85c1.78-4.2,5.71-7.09,10.25-7.53C225.63,326.94,230.05,329.03,232.6,332.81L232.6,332.81z
			 M232.6,332.81"/>
		<path class="st7" d="M152.31,157.88c-2.33,2.34-5.49,3.65-8.79,3.65c-1.67,0.02-3.32-0.32-4.85-1c-3.61-1.53-6.28-4.68-7.21-8.49
			c-0.93-3.81-0.01-7.84,2.49-10.86c2.49-3.03,6.27-4.7,10.19-4.51c3.92,0.19,7.52,2.21,9.71,5.46c1.38,2.06,2.11,4.48,2.11,6.96
			C155.95,152.39,154.64,155.56,152.31,157.88L152.31,157.88z M152.31,157.88"/>
		<path class="st6" d="M152.31,297.82c2.34,2.33,3.65,5.49,3.65,8.79c0,2.48-0.74,4.9-2.11,6.96c-2.2,3.25-5.8,5.28-9.71,5.46
			c-3.92,0.19-7.69-1.48-10.19-4.51c-2.5-3.03-3.42-7.05-2.49-10.86c0.93-3.81,3.61-6.96,7.21-8.49c1.53-0.67,3.18-1.01,4.85-1
			C146.82,294.17,149.98,295.49,152.31,297.82L152.31,297.82z M152.31,297.82"/>
		<path class="st6" d="M122.79,227.85c0,6.87-5.57,12.44-12.44,12.44c-6.87,0-12.44-5.57-12.44-12.44c0-6.87,5.57-12.44,12.44-12.44
			C117.23,215.42,122.79,220.98,122.79,227.85L122.79,227.85z M122.79,227.85"/>
		<path class="st8" d="M227.32,173.39v20.89c5.15-0.46,10.18-1.64,14.99-3.5C238.25,181.79,232.99,175.69,227.32,173.39z"/>
		<path class="st8" d="M227.32,204.36v18.45h22.09c-0.33-7.63-1.56-15.21-3.66-22.55C239.83,202.52,233.64,203.89,227.32,204.36z"/>
		<path class="st8" d="M181.47,190.26c-8.26,8.95-13.37,20.43-14.46,32.55h18.05c0.32-9.17,1.83-18.25,4.49-27.02
			C186.73,194.16,184.02,192.3,181.47,190.26z"/>
		<path class="st8" d="M227.32,232.89v18.45c6.33,0.47,12.52,1.84,18.44,4.1c2.1-7.34,3.33-14.92,3.66-22.55H227.32z"/>
		<path class="st8" d="M255.51,183.42c-2.72-2.05-5.63-3.84-8.67-5.35c1.72,2.6,3.24,5.33,4.53,8.17
			C252.79,185.36,254.17,184.42,255.51,183.42z"/>
		<path class="st8" d="M242.31,264.94c-4.81-1.87-9.85-3.04-14.99-3.5v20.88C232.99,280.02,238.25,273.92,242.31,264.94z"/>
		<path class="st8" d="M217.24,222.81v-18.45c-6.33-0.47-12.52-1.84-18.44-4.1c-2.1,7.34-3.33,14.92-3.66,22.55H217.24z"/>
		<path class="st8" d="M189.04,272.29c2.73,2.05,5.63,3.85,8.68,5.36c-1.73-2.6-3.25-5.34-4.54-8.18
			C191.77,270.34,190.38,271.29,189.04,272.29z"/>
		<path class="st8" d="M217.24,282.32v-20.88c-5.15,0.46-10.18,1.63-14.99,3.49C206.3,273.92,211.56,280.01,217.24,282.32z"/>
		<path class="st8" d="M277.54,222.81c-1.09-12.12-6.2-23.61-14.46-32.55c-2.55,2.04-5.26,3.9-8.09,5.53
			c2.66,8.77,4.17,17.85,4.49,27.02H277.54z"/>
		<path class="st8" d="M217.24,194.26v-20.88c-5.67,2.3-10.93,8.39-14.99,17.38C207.06,192.63,212.09,193.8,217.24,194.26z"/>
		<path class="st8" d="M167.01,232.89c1.1,12.13,6.21,23.62,14.48,32.55c2.55-2.04,5.26-3.9,8.09-5.53
			c-2.67-8.77-4.19-17.85-4.51-27.02H167.01z"/>
		<path class="st8" d="M217.24,251.34v-18.45h-22.09c0.33,7.63,1.56,15.21,3.66,22.55C204.73,253.19,210.92,251.81,217.24,251.34z"
			/>
		<path class="st8" d="M255.51,272.29c-1.34-1-2.73-1.95-4.15-2.82c-1.29,2.85-2.81,5.59-4.54,8.19
			C249.88,276.14,252.79,274.34,255.51,272.29z"/>
		<path class="st8" d="M263.08,265.44c8.26-8.95,13.37-20.43,14.46-32.55h-18.05c-0.32,9.17-1.83,18.25-4.49,27.02
			C257.82,261.55,260.53,263.4,263.08,265.44z"/>
		<path class="st8" d="M189.04,183.42c1.34,1,2.73,1.95,4.14,2.83c1.3-2.85,2.82-5.59,4.54-8.19
			C194.67,179.56,191.76,181.36,189.04,183.42z"/>
		<path d="M222.28,164.22c-25.83,0-48.9,15.42-58.79,39.28c-9.88,23.86-4.47,51.08,13.79,69.35s45.48,23.68,69.35,13.79
			c23.86-9.88,39.28-32.96,39.28-58.79C285.87,192.81,257.32,164.26,222.28,164.22z M186.78,182.63c4.12-3.26,8.68-5.94,13.53-7.96
			l3.43-1.43l-2.25,2.96c-2.77,3.65-5.11,7.65-6.93,11.88l-0.45,1.04l-0.98-0.58c-2.2-1.29-4.33-2.76-6.35-4.34l-1-0.78
			L186.78,182.63z M164.93,223.74c0.94-13.28,6.52-25.9,15.73-35.54l0.64-0.67l0.72,0.59c2.87,2.37,5.97,4.5,9.22,6.33l0.71,0.4
			l-0.24,0.77c-2.85,9.14-4.42,18.64-4.67,28.22l-0.03,0.97h-22.15L164.93,223.74z M181.32,268.17l-0.64-0.67
			c-9.21-9.62-14.8-22.24-15.75-35.54l-0.08-1.07h22.15l0.03,0.97c0.25,9.58,1.83,19.07,4.69,28.22l0.24,0.77l-0.71,0.4
			c-3.25,1.83-6.35,3.95-9.22,6.33L181.32,268.17z M200.31,281.03c-4.85-2.02-9.4-4.7-13.53-7.95l-1-0.79l1-0.78
			c2.02-1.58,4.16-3.04,6.35-4.33l0.98-0.57l0.45,1.04c1.82,4.22,4.15,8.21,6.93,11.87l2.25,2.96L200.31,281.03z M219.24,285.08
			l-1.29-0.39c-6.93-2.09-13.31-9.16-17.96-19.91l-0.41-0.94l0.95-0.39c5.63-2.3,11.56-3.67,17.63-4.1l1.07-0.07V285.08z
			 M219.24,253.22l-0.94,0.06c-6.8,0.41-13.45,1.89-19.77,4.42l-1.02,0.41l-0.31-1.05c-2.43-8.16-3.81-16.62-4.08-25.13l-0.03-1.03
			h26.16V253.22z M219.24,224.81h-26.17l0.03-1.03c0.28-8.52,1.65-16.97,4.08-25.13l0.31-1.05l1.02,0.41
			c6.32,2.53,12.97,4.02,19.78,4.42l0.94,0.06V224.81z M219.24,196.42l-1.07-0.08c-6.07-0.43-12-1.81-17.63-4.11l-0.94-0.39
			l0.41-0.94c4.65-10.74,11.03-17.8,17.96-19.89l1.29-0.39V196.42z M263.25,187.53l0.64,0.67c9.21,9.63,14.79,22.25,15.73,35.54
			l0.08,1.07h-22.15l-0.03-0.97c-0.25-9.58-1.82-19.08-4.67-28.22l-0.24-0.77l0.71-0.4c3.25-1.83,6.35-3.95,9.22-6.33L263.25,187.53
			z M242.86,172.63l1.64,2.16c4.75,2,9.22,4.64,13.27,7.84l1,0.79l-1,0.79c-2.02,1.58-4.16,3.04-6.35,4.33l-0.98,0.57l-0.45-1.04
			c-1.78-4.13-4.06-8.05-6.76-11.64l-0.37-0.16V172.63z M225.32,170.63l1.29,0.39c6.93,2.09,13.31,9.16,17.96,19.91l0.4,0.94
			l-0.94,0.39c-5.62,2.3-11.56,3.68-17.63,4.11l-1.07,0.08V170.63z M225.32,202.48l0.94-0.06c6.8-0.41,13.45-1.89,19.77-4.42
			l1.02-0.41l0.31,1.05c2.43,8.16,3.81,16.62,4.08,25.13l0.03,1.03h-26.16V202.48z M225.32,230.89h26.17l-0.03,1.03
			c-0.28,8.52-1.65,16.97-4.08,25.13l-0.31,1.05l-1.02-0.41c-6.32-2.53-12.97-4.02-19.78-4.42l-0.94-0.06V230.89z M226.61,284.69
			l-0.29-0.95h-1v-24.46l1.07,0.08c6.07,0.43,12,1.81,17.63,4.11l0.94,0.39l-0.41,0.94C239.91,275.54,233.53,282.6,226.61,284.69z
			 M257.78,273.07c-4.12,3.26-8.68,5.94-13.53,7.96l-3.43,1.43l2.25-2.96c2.77-3.65,5.11-7.65,6.93-11.88l1.92-4.45v4.28
			c2.02,1.22,3.99,2.57,5.86,4.04l1,0.78L257.78,273.07z M279.62,231.96c-0.94,13.28-6.52,25.9-15.73,35.54l-0.64,0.67l-0.72-0.59
			c-2.87-2.37-5.97-4.5-9.22-6.33l-0.71-0.4l0.24-0.77c2.85-9.14,4.42-18.64,4.67-28.22l0.03-0.97h22.15L279.62,231.96z"/>
		<polygon class="st9" points="243.86,175.6 243.86,175.61 243.87,175.61 		"/>
		<path d="M218.13,131.93v21.31h8.29v-21.31c8.09-2.09,13.36-9.86,12.3-18.14c-1.05-8.28-8.1-14.49-16.45-14.49
			c-8.35,0-15.4,6.21-16.45,14.49C204.78,122.07,210.05,129.84,218.13,131.93L218.13,131.93z M222.28,107.64
			c3.35,0,6.38,2.02,7.66,5.12c1.28,3.1,0.57,6.67-1.8,9.04c-2.37,2.37-5.94,3.08-9.04,1.8c-3.1-1.28-5.12-4.3-5.12-7.66
			C213.99,111.35,217.7,107.64,222.28,107.64L222.28,107.64z M222.28,107.64"/>
		<path d="M126.35,232h21.31v-8.29h-21.31c-2.09-8.09-9.86-13.36-18.14-12.3c-8.28,1.05-14.49,8.1-14.49,16.45
			s6.21,15.4,14.49,16.45C116.49,245.35,124.26,240.08,126.35,232L126.35,232z M110.36,236.14c-3.35,0-6.38-2.02-7.66-5.12
			c-1.28-3.1-0.57-6.67,1.8-9.04c2.37-2.37,5.94-3.08,9.04-1.8c3.1,1.28,5.12,4.3,5.12,7.66
			C118.65,232.43,114.94,236.14,110.36,236.14L110.36,236.14z M110.36,236.14"/>
		<g>
			<defs>
				<rect id="SVGID_3_" x="93.09" y="98.66" width="257.69" height="258.38"/>
			</defs>
			<clipPath id="SVGID_2_">
				<use xlink:href="#SVGID_3_"  style="overflow:visible;"/>
			</clipPath>
			<path class="st5" d="M226.42,323.78v-21.31h-8.29v21.31c-8.09,2.09-13.36,9.86-12.3,18.14c1.05,8.28,8.1,14.49,16.45,14.49
				c8.35,0,15.4-6.21,16.45-14.49C239.78,333.64,234.51,325.87,226.42,323.78L226.42,323.78z M222.28,348.06
				c-3.35,0-6.38-2.02-7.66-5.12c-1.28-3.1-0.57-6.67,1.8-9.04c2.37-2.37,5.94-3.08,9.04-1.8c3.1,1.28,5.12,4.3,5.12,7.66
				C230.57,344.35,226.86,348.06,222.28,348.06L222.28,348.06z M222.28,348.06"/>
			<path class="st5" d="M334.2,211.27c-7.54,0.03-14.11,5.14-15.99,12.44h-21.31V232h21.31c1.59,6.11,6.52,10.78,12.71,12.04
				c6.19,1.26,12.55-1.11,16.41-6.11c3.86-5,4.53-11.76,1.74-17.42C346.28,214.85,340.51,211.26,334.2,211.27L334.2,211.27z
				 M334.2,236.14c-3.35,0-6.38-2.02-7.66-5.12c-1.28-3.1-0.57-6.67,1.8-9.04c2.37-2.37,5.94-3.08,9.04-1.8
				c3.1,1.28,5.12,4.3,5.12,7.66C342.49,232.43,338.78,236.14,334.2,236.14L334.2,236.14z M334.2,236.14"/>
		</g>
		<path d="M242.88,129.15l3.22-7.63l6.91,2.92l-3.22,7.63L242.88,129.15z M242.88,129.15"/>
		<path d="M256.64,134.83l3.22-7.64l6.92,2.91l-3.22,7.64L256.64,134.83z M256.64,134.83"/>
		<path d="M270.4,140.82l3.22-7.63l6.91,2.91l-3.22,7.63L270.4,140.82z M270.4,140.82"/>
		<path d="M306.52,282.9l2.91-6.92l7.65,3.22l-2.91,6.92L306.52,282.9z M306.52,282.9"/>
		<path d="M317.94,255.36l2.91-6.91l7.64,3.22l-2.91,6.91L317.94,255.36z M317.94,255.36"/>
		<path d="M312.28,269.26l2.92-6.91l7.63,3.22l-2.92,6.91L312.28,269.26z M312.28,269.26"/>
		<path d="M191.42,331.29l3.22-7.63l6.91,2.91l-3.22,7.63L191.42,331.29z M191.42,331.29"/>
		<path d="M163.86,319.78l3.22-7.64l6.91,2.92l-3.22,7.63L163.86,319.78z M163.86,319.78"/>
		<path d="M177.82,325.42l3.22-7.65l6.92,2.91l-3.22,7.64L177.82,325.42z M177.82,325.42"/>
		<path d="M115.91,204.05l2.91-6.92l7.65,3.22l-2.91,6.92L115.91,204.05z M115.91,204.05"/>
		<path d="M121.68,190.26l2.92-6.91l7.63,3.22l-2.92,6.91L121.68,190.26z M121.68,190.26"/>
		<path d="M127.48,176.39l2.91-6.91l7.64,3.22l-2.91,6.91L127.48,176.39z M127.48,176.39"/>
		<path d="M121.72,265.41l7.63-3.22l2.92,6.91l-7.63,3.22L121.72,265.41z M121.72,265.41"/>
		<path d="M127.43,279.23l7.64-3.22l2.91,6.91l-7.64,3.22L127.43,279.23z M127.43,279.23"/>
		<path d="M115.87,251.7l7.65-3.22l2.91,6.92l-7.65,3.22L115.87,251.7z M115.87,251.7"/>
		<path d="M270.5,314.81l6.91-2.92l3.22,7.64l-6.91,2.92L270.5,314.81z M270.5,314.81"/>
		<path d="M256.68,320.65l6.91-2.92l3.22,7.63l-6.91,2.92L256.68,320.65z M256.68,320.65"/>
		<path d="M242.85,326.48l6.91-2.92l3.22,7.63l-6.91,2.92L242.85,326.48z M242.85,326.48"/>
		<path d="M312.24,186.48l7.63-3.22l2.92,6.91l-7.63,3.22L312.24,186.48z M312.24,186.48"/>
		<path d="M317.97,200.44l7.64-3.22l2.91,6.91l-7.64,3.22L317.97,200.44z M317.97,200.44"/>
		<path d="M306.55,172.83l7.65-3.22l2.91,6.92l-7.65,3.22L306.55,172.83z M306.55,172.83"/>
		<path d="M163.9,135.98l6.91-2.92l3.22,7.64l-6.91,2.92L163.9,135.98z M163.9,135.98"/>
		<path d="M177.72,130.16l6.91-2.92l3.22,7.63l-6.91,2.92L177.72,130.16z M177.72,130.16"/>
		<path d="M191.54,124.32l6.91-2.92l3.22,7.64l-6.91,2.92L191.54,124.32z M191.54,124.32"/>
		<path d="M172.45,283.54l-5.86-5.86l-14.7,14.7c-2.53-1.52-5.42-2.34-8.37-2.35c-6.71,0-12.75,4.04-15.32,10.24
			c-2.57,6.2-1.15,13.33,3.59,18.07c4.74,4.74,11.87,6.16,18.07,3.59c6.2-2.57,10.24-8.61,10.24-15.32
			c-0.01-2.95-0.83-5.84-2.35-8.37L172.45,283.54z M143.52,314.9c-3.35,0-6.38-2.02-7.66-5.12c-1.28-3.1-0.57-6.67,1.8-9.04
			c2.37-2.37,5.94-3.08,9.04-1.8c3.1,1.28,5.12,4.3,5.12,7.66C151.81,311.19,148.1,314.9,143.52,314.9L143.52,314.9z M143.52,314.9"
			/>
		<path d="M272.1,172.16l5.86,5.86l14.7-14.7c2.53,1.52,5.42,2.34,8.37,2.35c6.71,0,12.75-4.04,15.32-10.24
			c2.57-6.2,1.15-13.33-3.59-18.07c-4.74-4.74-11.87-6.16-18.07-3.59c-6.2,2.57-10.24,8.61-10.24,15.32
			c0.01,2.95,0.83,5.84,2.35,8.37L272.1,172.16z M301.03,140.8c3.35,0,6.38,2.02,7.66,5.12c1.28,3.1,0.57,6.67-1.8,9.04
			c-2.37,2.37-5.94,3.08-9.04,1.8c-3.1-1.28-5.12-4.3-5.12-7.66C292.74,144.52,296.45,140.8,301.03,140.8L301.03,140.8z
			 M301.03,140.8"/>
		<path d="M143.52,165.68c2.95-0.01,5.84-0.83,8.37-2.35l14.7,14.7l5.86-5.86l-14.7-14.7c1.52-2.53,2.34-5.42,2.35-8.37
			c0-6.71-4.04-12.75-10.24-15.32c-6.2-2.57-13.33-1.15-18.07,3.59c-4.74,4.74-6.16,11.87-3.59,18.07
			C130.77,161.64,136.81,165.68,143.52,165.68L143.52,165.68z M143.52,140.8c3.35,0,6.38,2.02,7.66,5.12
			c1.28,3.1,0.57,6.67-1.8,9.04c-2.37,2.37-5.94,3.08-9.04,1.8c-3.1-1.28-5.12-4.3-5.12-7.66
			C135.23,144.52,138.94,140.8,143.52,140.8L143.52,140.8z M143.52,140.8"/>
		<path d="M301.03,290.03c-2.95,0.01-5.84,0.83-8.37,2.35l-14.7-14.7l-5.86,5.86l14.7,14.7c-1.52,2.53-2.34,5.42-2.35,8.37
			c0,6.71,4.04,12.75,10.24,15.32c6.2,2.57,13.33,1.15,18.07-3.59c4.74-4.74,6.16-11.87,3.59-18.07
			C313.79,294.07,307.74,290.03,301.03,290.03L301.03,290.03z M301.03,314.9c-3.35,0-6.38-2.02-7.66-5.12
			c-1.28-3.1-0.57-6.67,1.8-9.04c2.37-2.37,5.94-3.08,9.04-1.8c3.1,1.28,5.12,4.3,5.12,7.66
			C309.32,311.19,305.61,314.9,301.03,314.9L301.03,314.9z M301.03,314.9"/>
	</g>
	<path class="st7" d="M82.87,322.71H46.93c-0.65,0-1.17-0.52-1.17-1.17v-3.52c0-0.65,0.52-1.17,1.17-1.17h35.93
		c0.65,0,1.17,0.52,1.17,1.17v3.52C84.04,322.18,83.51,322.71,82.87,322.71z"/>
	<path class="st7" d="M422.62,303.37H361c-0.65,0-1.17-0.52-1.17-1.17v-3.52c0-0.65,0.52-1.17,1.17-1.17h61.62
		c0.65,0,1.17,0.52,1.17,1.17v3.52C423.79,302.84,423.27,303.37,422.62,303.37z"/>
	<path class="st7" d="M439.69,315.07h-49.21c-0.65,0-1.17-0.52-1.17-1.17v-3.52c0-0.65,0.52-1.17,1.17-1.17h49.21
		c0.65,0,1.17,0.52,1.17,1.17v3.52C440.86,314.55,440.33,315.07,439.69,315.07z"/>
	<path class="st7" d="M36.31,322.71H23.14c-0.65,0-1.17-0.52-1.17-1.17v-3.52c0-0.65,0.52-1.17,1.17-1.17h13.17
		c0.65,0,1.17,0.52,1.17,1.17v3.52C37.49,322.18,36.96,322.71,36.31,322.71z"/>
	<path class="st6" d="M396.05,208.44c-7.68,0-13.93-6.25-13.93-13.93s6.25-13.93,13.93-13.93s13.93,6.25,13.93,13.93
		S403.74,208.44,396.05,208.44z M396.05,182.58c-6.58,0-11.93,5.35-11.93,11.93c0,6.58,5.35,11.93,11.93,11.93
		c6.58,0,11.93-5.35,11.93-11.93C407.99,187.93,402.63,182.58,396.05,182.58z"/>
	<circle class="st6" cx="79.21" cy="115.94" r="12.93"/>
</g>
</svg>
