<?xml version="1.0" encoding="utf-8"?>
<!-- Generator: Adobe Illustrator 24.3.0, SVG Export Plug-In . SVG Version: 6.00 Build 0)  -->
<svg version="1.1" id="Layer_1" xmlns="http://www.w3.org/2000/svg" xmlns:xlink="http://www.w3.org/1999/xlink" x="0px" y="0px"
	 viewBox="0 0 455.17 425.38" style="enable-background:new 0 0 455.17 425.38;" xml:space="preserve">
<style type="text/css">
	.st0{opacity:0.2;fill:#F58220;}
	.st1{fill:none;stroke:#000000;stroke-miterlimit:10;}
	.st2{fill:#00E7F0;}
	.st3{fill:#00B6BD;}
	.st4{fill:#57A4FF;}
	.st5{clip-path:url(#SVGID_2_);}
	.st6{fill:#F58220;}
	.st7{fill:#5C5D60;}
	.st8{fill:none;}
	.st9{fill:#CE174C;}
	.st10{clip-path:url(#SVGID_4_);}
	.st11{fill:#231F20;}
	.st12{fill:#221F1F;}
	.st13{stroke:#000000;stroke-miterlimit:10;}
	.st14{fill:#202020;}
	.st15{fill:#FFFFFF;}
	.st16{fill:#FCFCFC;}
	.st17{fill:#070707;}
</style>
<circle class="st0" cx="226.48" cy="224.53" r="168.21"/>
<g>
	<rect x="53.31" y="272.82" class="st6" width="4.96" height="5.45"/>
	<rect x="53.31" y="309.28" class="st6" width="4.96" height="5.45"/>
	
		<rect x="67.2" y="302.76" transform="matrix(-0.6367 0.7711 -0.7711 -0.6367 349.3646 445.7573)" class="st6" width="4.96" height="4.84"/>
	
		<rect x="39.59" y="279.88" transform="matrix(-0.6367 0.7711 -0.7711 -0.6367 286.5464 429.6048)" class="st6" width="4.96" height="4.84"/>
	
		<rect x="67.08" y="279.76" transform="matrix(0.6376 0.7703 -0.7703 0.6376 242.6371 48.6986)" class="st6" width="4.96" height="5.01"/>
	
		<rect x="39.42" y="302.63" transform="matrix(0.6376 0.7703 -0.7703 0.6376 250.2334 78.291)" class="st6" width="4.96" height="5.01"/>
	
		<rect x="35.21" y="291.21" transform="matrix(-5.826341e-03 -1 1 -5.826341e-03 -255.8401 333.1221)" class="st6" width="4.92" height="5.06"/>
	
		<rect x="71.36" y="291" transform="matrix(-5.826341e-03 -1 1 -5.826341e-03 -219.2674 369.0583)" class="st6" width="4.92" height="5.06"/>
</g>
<g>
	<rect x="290.34" y="90.98" class="st7" width="1.87" height="15.77"/>
	<rect x="290.34" y="104.7" class="st7" width="1.87" height="2.05"/>
	
		<rect x="295.56" y="102.24" transform="matrix(-0.6367 0.7711 -0.7711 -0.6367 564.8149 -59.7957)" class="st7" width="1.87" height="1.82"/>
	
		<rect x="290.37" y="91.19" transform="matrix(-0.6367 0.7711 -0.7711 -0.6367 553.0004 -62.856)" class="st7" width="1.87" height="15.31"/>
	
		<rect x="290.3" y="91.14" transform="matrix(0.6377 0.7703 -0.7703 0.6377 181.6711 -188.5295)" class="st7" width="1.87" height="15.42"/>
	
		<rect x="285.11" y="102.19" transform="matrix(0.6376 0.7703 -0.7703 0.6376 183.0959 -182.9722)" class="st7" width="1.87" height="1.89"/>
	
		<rect x="290.29" y="91.1" transform="matrix(-5.828872e-03 -1 1 -5.828872e-03 194.1022 390.593)" class="st7" width="1.85" height="15.43"/>
	
		<rect x="297.13" y="97.82" transform="matrix(-5.826341e-03 -1 1 -5.826341e-03 201.0229 397.3932)" class="st7" width="1.85" height="1.9"/>
</g>
<path class="st7" d="M174.59,143.26h-35.93c-0.65,0-1.17-0.52-1.17-1.17v-3.52c0-0.65,0.52-1.17,1.17-1.17h35.93
	c0.65,0,1.17,0.52,1.17,1.17v3.52C175.76,142.74,175.24,143.26,174.59,143.26z"/>
<path class="st7" d="M401.8,337.16h-61.62c-0.65,0-1.17-0.52-1.17-1.17v-3.52c0-0.65,0.52-1.17,1.17-1.17h61.62
	c0.65,0,1.17,0.52,1.17,1.17v3.52C402.97,336.63,402.45,337.16,401.8,337.16z"/>
<path class="st7" d="M418.87,348.86h-49.21c-0.65,0-1.17-0.52-1.17-1.17v-3.52c0-0.65,0.52-1.17,1.17-1.17h49.21
	c0.65,0,1.17,0.52,1.17,1.17v3.52C420.04,348.34,419.52,348.86,418.87,348.86z"/>
<path class="st7" d="M128.04,143.26h-13.17c-0.65,0-1.17-0.52-1.17-1.17v-3.52c0-0.65,0.52-1.17,1.17-1.17h13.17
	c0.65,0,1.17,0.52,1.17,1.17v3.52C129.21,142.74,128.68,143.26,128.04,143.26z"/>
<path class="st6" d="M386.27,262.78c-7.68,0-13.93-6.25-13.93-13.93c0-7.68,6.25-13.93,13.93-13.93s13.93,6.25,13.93,13.93
	C400.2,256.53,393.95,262.78,386.27,262.78z M386.27,236.91c-6.58,0-11.93,5.35-11.93,11.93c0,6.58,5.35,11.93,11.93,11.93
	c6.58,0,11.93-5.35,11.93-11.93C398.2,242.27,392.85,236.91,386.27,236.91z"/>
<circle class="st6" cx="87.71" cy="360.48" r="12.93"/>
<path class="st7" d="M327.35,205.11c-2.57-2.55-4.01-6.03-4.01-9.65c-0.02-1.83,0.36-3.65,1.09-5.32c2.34-5.53,8.02-8.88,13.99-8.25
	c5.97,0.62,10.83,5.08,11.98,10.97c1.15,5.89-1.69,11.84-6.99,14.66C338.11,210.33,331.59,209.35,327.35,205.11L327.35,205.11z
	 M327.35,205.11"/>
<path class="st6" d="M236.28,143.26c0,2.72-0.81,5.38-2.32,7.64c-2.8,4.15-7.65,6.44-12.64,5.95c-4.98-0.48-9.3-3.66-11.25-8.27
	c-0.74-1.68-1.11-3.49-1.09-5.32c0-7.54,6.11-13.65,13.65-13.65C230.17,129.61,236.28,135.72,236.28,143.26L236.28,143.26z
	 M236.28,143.26"/>
<path class="st14" d="M218.08,160.82v23.4h9.1v-23.4c8.88-2.29,14.66-10.82,13.51-19.92c-1.16-9.09-8.89-15.91-18.06-15.91
	c-9.17,0-16.9,6.82-18.06,15.91C203.42,149.99,209.2,158.52,218.08,160.82L218.08,160.82z M222.63,134.16c3.68,0,7,2.22,8.41,5.62
	c1.41,3.4,0.63,7.32-1.97,9.92c-2.6,2.6-6.52,3.38-9.92,1.97c-3.4-1.41-5.62-4.73-5.62-8.41
	C213.53,138.23,217.6,134.16,222.63,134.16L222.63,134.16z M222.63,134.16"/>
<path class="st14" d="M305.24,220.78l6.43,6.43l16.14-16.14c2.77,1.67,5.95,2.56,9.19,2.58c7.36,0,14-4.44,16.82-11.24
	c2.82-6.8,1.26-14.63-3.95-19.83c-5.21-5.21-13.03-6.76-19.83-3.95c-6.8,2.82-11.24,9.45-11.24,16.82c0.02,3.24,0.91,6.41,2.58,9.19
	L305.24,220.78z M337,186.36c3.68,0,7,2.22,8.41,5.62c1.41,3.4,0.63,7.32-1.97,9.92c-2.6,2.6-6.52,3.38-9.92,1.97
	c-3.4-1.41-5.62-4.73-5.62-8.41C327.9,190.43,331.97,186.36,337,186.36L337,186.36z M337,186.36"/>
<path class="st7" d="M116.88,205.11c-4.24,4.25-10.76,5.23-16.06,2.41c-5.3-2.82-8.14-8.77-6.99-14.66
	c1.15-5.89,6.01-10.34,11.98-10.97c5.97-0.63,11.65,2.72,13.99,8.25c0.74,1.68,1.11,3.49,1.09,5.32
	C120.88,199.08,119.44,202.55,116.88,205.11L116.88,205.11z M116.88,205.11"/>
<path class="st14" d="M122.85,204.65c1.67-2.77,2.56-5.95,2.58-9.19c0-7.36-4.44-14-11.24-16.82c-6.8-2.82-14.63-1.26-19.83,3.95
	c-5.21,5.21-6.76,13.03-3.95,19.83c2.82,6.8,9.45,11.24,16.82,11.24c3.24-0.02,6.41-0.91,9.19-2.58l16.14,16.14l6.43-6.43
	L122.85,204.65z M107.23,186.36c5.03,0,9.1,4.07,9.1,9.1c0,3.68-2.22,7-5.62,8.41c-3.4,1.41-7.32,0.63-9.92-1.97
	c-2.6-2.6-3.38-6.52-1.97-9.92C100.23,188.58,103.55,186.36,107.23,186.36L107.23,186.36z M107.23,186.36"/>
<path class="st16" d="M90.15,367.26c-5.5-0.07-10.13-4.75-9.96-10.07c0.17-5.43,4.79-9.7,10.43-9.65c5.48,0.05,10.11,4.75,9.96,10.1
	C100.43,363.04,95.77,367.33,90.15,367.26z"/>
<path class="st6" d="M226.66,330.65c-6.15-3.09-12.01-3.65-17.78-4.58c-5.24-0.85-10.62-1.38-15.64-2.98
	c-5.78-1.84-9.88-6.22-8.83-12.58c1.07-6.43,6.71-7.97,12.33-7.4c21.25,2.17,42.31,1.47,63.47-1.72
	c18.66-2.81,33.75,5.08,46.31,18.49c9.62,10.26,17.75,21.58,24.94,33.67c1.98,3.32,2.02,5.26-0.86,7.78
	c-7.6,6.64-15.41,12.98-23.65,18.81c-3.59,2.54-5.95,1.78-8.33-1.56c-11.98-16.78-28.07-22.41-47.78-16.73
	c-26.12,7.52-51.15,1.27-75.46-7.01c-16-5.45-26.45-19.04-35.5-33.06c-1.82-2.82-1.73-5.97,0.61-8.54c2.64-2.89,5.88-2.69,9.21-1.16
	c6.74,3.1,11.75,8.4,17.06,13.33C180.62,338.33,212.46,341.37,226.66,330.65z"/>
<path class="st11" d="M321.84,371.44c-4.05,3.42-7.99,6.56-11.87,9.47c-3.29,2.46-8.18,4.13-12.77-1.96
	c-11.7-15.48-26.34-20.17-44.75-14.32c-26.76,8.5-53.07,2.65-77.51-4.94c-17.02-5.28-28.34-19.13-38.05-33.31
	c-2.76-4.02-2.53-8.77,0.59-12.39c2.22-2.57,6.24-5.06,12.8-2.25c6.33,2.71,11.24,7.11,15.98,11.37c0.76,0.68,1.51,1.36,2.27,2.03
	c6.2,5.46,16.76,9.16,28.24,9.88c8.48,0.53,16.35-0.63,22.27-3.18c-2.81-0.69-5.61-1.04-8.5-1.4c-0.8-0.1-1.59-0.2-2.39-0.31
	c-1.21-0.16-2.46-0.31-3.67-0.46c-4.12-0.49-8.37-1-12.49-2.19c-8.07-2.33-12.44-8.38-11.42-15.79c0.99-7.19,6.78-11.09,15.48-10.44
	c20.67,1.54,41.15,0.43,62.61-3.4c17.86-3.19,34.54,2.9,49.59,18.1c9.47,9.57,18.07,20.53,26.28,33.51
	c2.12,3.35,3.63,7.36-1.17,11.8C329.38,364.92,325.56,368.3,321.84,371.44z M142.82,317.52c-0.21,0.18-0.4,0.38-0.58,0.58
	c-1.27,1.48-1.32,3.02-0.16,4.71c9.07,13.24,19.55,26.14,34.72,30.85c27.12,8.42,50.03,12.48,73.73,4.95
	c10.37-3.29,20.02-3.56,28.7-0.78c8.67,2.77,16.41,8.6,22.99,17.31c1.09,1.44,1.7,1.65,1.86,1.69c0.4,0.08,1.19-0.29,2.1-0.98
	c7.27-5.44,14.75-11.74,22.88-19.24c1.41-1.3,1.59-1.47,0.12-3.8c-7.96-12.59-16.28-23.2-25.43-32.44
	c-13.69-13.83-28.08-19.17-44-16.33c-21.99,3.93-42.98,5.07-64.18,3.48c-5.3-0.4-8.25,1.29-8.76,5.02
	c-0.82,5.97,4.56,8.19,6.92,8.87c3.63,1.05,7.45,1.5,11.49,1.98c1.23,0.15,2.51,0.3,3.77,0.47c0.78,0.1,1.55,0.2,2.33,0.3
	c5.23,0.66,10.64,1.33,16.48,4.07l4.6,2.15l-3.97,3.17c-14.98,11.96-48.51,10.02-64.08-3.69c-0.77-0.68-1.54-1.37-2.31-2.06
	c-4.56-4.1-8.88-7.96-14.25-10.27C145.05,316.36,143.71,316.77,142.82,317.52z"/>
<path class="st14" d="M254.9,242.53c0.33,3.01,0.53,6.03,1.04,9.01c0.3,1.72,1.11,3.35,1.66,5.03c0.78,2.4-0.27,3.83-2.85,3.84
	c-5.43,0.02-10.85,0.04-16.28-0.02c-1.23-0.01-2.19,0.2-2.84,1.33c-0.21,0.36-0.52,0.72-0.88,0.93c-3.84,2.27-2.29,6-2.48,9.24
	c-0.02,0.37,0.57,0.86,0.97,1.16c2.51,1.93,5.07,3.81,7.58,5.73c2.26,1.73,2.15,3.44-0.31,4.85c-5.54,3.18-11.1,6.32-16.62,9.53
	c-1.3,0.76-2.41,0.81-3.73,0.04c-5.57-3.24-11.18-6.4-16.76-9.61c-2.4-1.38-2.5-3.07-0.29-4.76c2.52-1.93,5.05-3.84,7.61-5.69
	c0.83-0.6,1.26-1.27,1.1-2.29c-0.03-0.21,0-0.43,0-0.64c0-5.71,0.01-5.72-4.21-9.39c-0.38-0.33-1.08-0.4-1.63-0.4
	c-5.32-0.03-10.64-0.02-15.96-0.02c-3.65,0-4.66-1.24-3.28-4.64c1.62-4.02,2.06-8.17,2.2-12.42c0.01-0.29-0.05-0.59-0.44-1.02
	c-0.19,0.34-0.47,0.66-0.55,1.02c-0.97,4.36-3.16,7.93-6.67,10.71c-0.36,0.28-0.45,0.89-0.66,1.36c-0.04,0.09-0.01,0.21-0.01,0.32
	c0.03,2.04-0.53,4.36,0.27,6.03c0.76,1.6,2.92,2.55,4.49,3.77c1.4,1.09,2.85,2.11,4.23,3.22c1.76,1.42,1.69,3.17-0.24,4.29
	c-5.8,3.37-11.65,6.67-17.46,10.01c-0.98,0.56-1.87,0.62-2.87,0.05c-5.86-3.37-11.76-6.69-17.6-10.09c-1.94-1.13-2-2.86-0.17-4.28
	c2.62-2.05,5.34-3.98,7.94-6.06c0.53-0.42,0.73-1.28,1.02-1.97c0.1-0.23-0.01-0.53,0.02-0.8c0.42-3.29-0.19-5.99-3.07-8.27
	c-2.37-1.88-3.51-4.84-4.11-7.85c-0.21-1.05-0.63-1.49-1.81-1.48c-3.91,0.03-5.84-1.23-6.34-4.29c-0.58-3.57-0.13-6.89,3.61-8.12
	c0.08-0.03,0.13-0.16,0.34-0.44c-0.94-0.95-2.03-1.83-2.83-2.93c-0.62-0.85-1.2-1.97-1.22-2.98c-0.2-9.84,5.11-17.02,14.08-19.12
	c1.4-0.33,2.86-0.48,4.3-0.49c4.83-0.06,9.67-0.03,14.51-0.02c8.81,0.02,15.98,5.67,17.88,14.25c0.42,1.91,0.47,3.94,0.44,5.91
	c-0.01,0.8-0.56,1.73-1.13,2.37c-0.92,1.02-2.06,1.85-3.15,2.8c1.68,1.27,1.68,1.27,2.63-0.13c5.6-8.23,13.36-13.27,23.17-14.47
	c13.4-1.63,24.14,3.36,32.04,14.34c0.64,0.88,1.13,1.75,2.51,0.53c-1-1.01-2.09-1.89-2.89-2.98c-0.62-0.85-1.21-1.97-1.23-2.97
	c-0.2-9.84,5.11-17.02,14.07-19.13c1.4-0.33,2.86-0.48,4.3-0.5c4.83-0.06,9.67-0.03,14.51-0.02c8.81,0.02,15.98,5.67,17.89,14.25
	c0.43,1.91,0.47,3.94,0.44,5.91c-0.01,0.81-0.54,1.75-1.12,2.37c-0.94,1.01-2.1,1.81-3.17,2.7c0.13,0.13,0.27,0.27,0.4,0.4
	c0.04,0.1,0.04,0.24,0.11,0.28c3.62,1.84,5.01,5.72,3.34,9.48c-1,2.24-2.91,3.16-5.22,3c-1.74-0.12-2.34,0.48-2.73,2.15
	c-0.88,3.77-3.03,6.82-5.98,9.34c-0.52,0.45-0.87,1.27-1.01,1.98c-0.86,4.42,0.57,7.72,4.72,9.83c1.55,0.79,2.88,2.06,4.26,3.17
	c1.75,1.42,1.66,3.16-0.28,4.29c-5.8,3.37-11.65,6.66-17.46,10.01c-0.98,0.57-1.88,0.59-2.86,0.02c-5.86-3.37-11.76-6.69-17.6-10.09
	c-1.87-1.09-1.97-2.83-0.25-4.18c2.62-2.06,5.29-4.05,7.98-6c0.83-0.6,1.26-1.27,1.1-2.29c-0.02-0.16-0.02-0.32,0-0.48
	c0.35-3.31-0.11-6.12-3.08-8.43c-2.3-1.78-3.35-4.67-4.06-7.54c-0.15-0.6-0.42-1.17-0.63-1.76
	C255.4,242.41,255.15,242.47,254.9,242.53z M183.62,234.21c-0.05,0-0.1-0.01-0.15-0.01c0-2.31-0.06-4.62,0.02-6.92
	c0.04-1.08-0.36-1.65-1.32-2.09c-1.85-0.85-3.61-1.91-5.49-2.68c-0.86-0.36-1.97-0.51-2.87-0.31c-3.91,0.87-7.8,1.89-11.68,2.88
	c-1.5,0.38-3.56,0.41-4.3,1.39c-0.79,1.05-0.39,3.05-0.39,4.64c-0.01,3.65-0.29,7.33,0.14,10.93c0.7,5.86,6.11,10.66,11.65,10.88
	c6.97,0.27,12.54-3.54,13.85-9.92C183.65,240.16,183.46,237.15,183.62,234.21z M260.58,234.11c0.04,0,0.09,0,0.13,0
	c0,2.73-0.35,5.52,0.07,8.19c0.99,6.23,6.69,11.05,13.79,10.68c6.12-0.32,11.96-5.97,12.04-12.1c0.06-4.4-0.01-8.8,0.04-13.2
	c0.01-1.05-0.33-1.52-1.36-1.76c-3.18-0.73-6.46-1.25-9.48-2.41c-4.95-1.9-9.42-1.51-13.69,1.58c-0.13,0.09-0.28,0.17-0.43,0.22
	c-0.89,0.32-1.15,0.95-1.12,1.87C260.62,229.49,260.58,231.8,260.58,234.11z M209,244.49c0.05,0,0.1,0,0.15,0
	c0,2.73-0.34,5.52,0.07,8.19c0.93,5.97,6.48,11.02,13.83,10.61c6.07-0.34,11.86-5.93,11.97-12c0.08-4.45-0.01-8.91,0.04-13.36
	c0.01-0.98-0.3-1.44-1.26-1.67c-5.15-1.25-10.27-2.58-15.42-3.82c-0.67-0.16-1.51-0.11-2.13,0.17c-2.1,0.94-4.18,1.96-6.18,3.1
	c-0.51,0.29-0.99,1.11-1.02,1.7C208.93,239.76,209,242.13,209,244.49z M204.52,255.36c0.15-2.46-0.01-2.62-2.42-2.64
	c-2.78-0.02-4.77-1.19-5.42-3.44c-0.75-2.59-0.76-6.65,1.57-8.03c1.22-0.73,2.77-1.06,4.21-1.18c1.26-0.11,1.73-0.45,1.62-1.7
	c-0.08-0.96,0.02-1.93-0.02-2.9c-0.07-1.53,0.61-2.53,1.97-3.19c3.09-1.5,6.12-3.13,9.24-4.55c0.84-0.38,1.99-0.49,2.89-0.28
	c5.48,1.28,10.93,2.73,16.4,4.05c5.63,1.37,5.53,1.1,5.39,6.72c-0.04,1.43,0.43,1.9,1.83,1.8c2.18-0.15,4.18,0.49,5.15,2.55
	c0.58,1.25,0.72,2.78,0.75,4.2c0.08,3.94-1.96,5.91-5.93,5.94c-2.21,0.02-2.34,0.16-2.3,2.6c4.12,0,8.25,0,12.22,0
	c-0.41-2.56-1.07-4.96-1.14-7.38c-0.1-3.64-0.68-7.14-1.96-10.54c-3.97-10.51-14.91-19.24-28.86-18.16
	c-11.95,0.93-21.99,9.34-25.22,20.98c-1.37,4.93-0.36,10.18-2.31,15.14C196.33,255.36,200.43,255.36,204.52,255.36z M188.36,225.83
	c0.23,0.02,0.45,0.05,0.68,0.07c0.71-1.06,1.91-2.07,2.04-3.2c0.8-7.08-5.22-13.74-12.35-13.82c-5.47-0.06-10.95-0.05-16.42,0
	c-6.86,0.06-12.44,5.82-12.64,12.71c-0.06,2.15,1.15,3.11,2.83,4.4c-0.4-3.19,1.47-3.89,3.78-4.43c5.79-1.35,11.56-2.8,17.31-4.34
	c1.62-0.43,2.99-0.29,4.44,0.51c2.35,1.28,4.76,2.47,7.19,3.61C187.11,222.22,188.84,223.14,188.36,225.83z M254.98,225.51
	c0.87-1.24,1.41-2.74,2.46-3.36c3.14-1.84,6.46-3.37,9.75-4.94c0.58-0.28,1.38-0.38,2-0.23c6.72,1.63,13.42,3.31,20.13,4.99
	c1.43,0.36,2.17,1.28,2.24,2.76c0.02,0.33,0.12,0.66,0.18,0.99c0.16,0.07,0.32,0.13,0.48,0.2c0.7-1.12,1.92-2.2,2.01-3.37
	c0.59-7.33-5.34-13.63-12.67-13.67c-5.31-0.03-10.62-0.03-15.93,0c-6.33,0.04-11.77,4.84-12.68,11.1
	C252.61,222.35,252.85,224.47,254.98,225.51z M156.86,270.6c4.58,2.61,8.74,5.03,12.97,7.34c0.42,0.23,1.25,0.03,1.75-0.25
	c3.75-2.09,7.46-4.23,11.17-6.38c0.34-0.2,0.62-0.5,1.08-0.87c-2.25-1.69-4.33-3.3-6.45-4.83c-1.19-0.86-1.77-1.91-1.7-3.41
	c0.08-1.63,0.02-3.27,0.02-4.64c-3.61,0-6.95,0-10.51,0c0,1.21-0.1,2.65,0.03,4.07c0.18,1.94-0.57,3.25-2.15,4.32
	C161.05,267.34,159.14,268.88,156.86,270.6z M260.32,270.38c0.22,0.33,0.26,0.46,0.34,0.5c4.08,2.36,8.16,4.74,12.27,7.05
	c0.37,0.21,1.08,0.17,1.47-0.05c4.02-2.25,8.01-4.56,12-6.87c0.16-0.09,0.26-0.3,0.53-0.61c-2.21-1.66-4.32-3.28-6.47-4.85
	c-1.14-0.83-1.68-1.86-1.62-3.29c0.07-1.64,0.02-3.29,0.02-4.7c-3.61,0-6.98,0-10.51,0c0,1.3-0.1,2.75,0.02,4.18
	c0.16,1.87-0.58,3.14-2.1,4.19C264.25,267.32,262.34,268.86,260.32,270.38z M208.67,280.75c0.31,0.34,0.39,0.5,0.52,0.57
	c4,2.3,7.98,4.63,12.02,6.85c0.47,0.26,1.37,0.15,1.89-0.14c3.76-2.07,7.47-4.22,11.19-6.36c0.35-0.2,0.64-0.49,1.15-0.89
	c-2.24-1.68-4.31-3.28-6.43-4.81c-1.24-0.89-1.84-2-1.75-3.55c0.09-1.59,0.02-3.18,0.02-4.54c-3.61,0-6.98,0-10.5,0
	c0,1.31-0.1,2.76,0.02,4.19c0.16,1.88-0.6,3.14-2.12,4.18C212.65,277.64,210.74,279.18,208.67,280.75z M152.41,237.36
	c0-0.91,0-1.73,0-2.64c-0.91,0-1.72,0-2.64,0c0,0.91,0,1.73,0,2.64c0.5,0.04,0.91,0.09,1.32,0.09
	C151.5,237.45,151.91,237.4,152.41,237.36z M294.26,234.84c-2.79-0.53-3.05-0.27-2.52,2.52c0.8,0,1.61,0,2.52,0
	C294.26,236.45,294.26,235.64,294.26,234.84z M201.36,247.68c0.91,0,1.73,0,2.64,0c0-0.91,0-1.73,0-2.64c-0.91,0-1.73,0-2.64,0
	C201.36,245.96,201.36,246.77,201.36,247.68z M240.05,245.04c0,0.91,0,1.73,0,2.64c0.91,0,1.72,0,2.64,0c0-0.91,0-1.73,0-2.64
	C241.77,245.04,240.96,245.04,240.05,245.04z M191.07,234.74c-0.93,0-1.74,0-2.6,0c0,0.93,0,1.75,0,2.55
	C190.44,237.57,190.6,237.42,191.07,234.74z M255.58,237.26c0-0.81,0-1.63,0-2.51c-0.91,0-1.73,0-2.55,0
	C253.43,237.4,253.62,237.59,255.58,237.26z"/>
<path class="st6" d="M183.62,234.21c-0.16,2.94,0.04,5.95-0.55,8.79c-1.32,6.38-6.89,10.19-13.85,9.92
	c-5.54-0.22-10.94-5.02-11.65-10.88c-0.43-3.6-0.15-7.29-0.14-10.93c0.01-1.59-0.4-3.58,0.39-4.64c0.74-0.99,2.8-1.01,4.3-1.39
	c3.89-0.99,7.77-2.01,11.68-2.88c0.9-0.2,2.01-0.04,2.87,0.31c1.88,0.78,3.64,1.83,5.49,2.68c0.96,0.44,1.36,1,1.32,2.09
	c-0.08,2.3-0.02,4.61-0.02,6.92C183.51,234.21,183.56,234.21,183.62,234.21z"/>
<path class="st6" d="M260.58,234.11c0-2.31,0.04-4.62-0.02-6.92c-0.02-0.93,0.23-1.55,1.12-1.87c0.15-0.05,0.3-0.13,0.43-0.22
	c4.27-3.09,8.74-3.49,13.69-1.58c3.02,1.16,6.3,1.68,9.48,2.41c1.03,0.24,1.38,0.71,1.36,1.76c-0.05,4.4,0.02,8.8-0.04,13.2
	c-0.09,6.13-5.92,11.78-12.04,12.1c-7.1,0.37-12.79-4.44-13.79-10.68c-0.42-2.67-0.07-5.45-0.07-8.19
	C260.66,234.11,260.62,234.11,260.58,234.11z"/>
<path class="st6" d="M209,244.49c0-2.36-0.07-4.73,0.05-7.08c0.03-0.6,0.51-1.41,1.02-1.7c2-1.14,4.08-2.16,6.18-3.1
	c0.62-0.28,1.46-0.33,2.13-0.17c5.15,1.23,10.28,2.56,15.42,3.82c0.96,0.23,1.27,0.7,1.26,1.67c-0.05,4.45,0.04,8.91-0.04,13.36
	c-0.11,6.07-5.91,11.66-11.97,12c-7.35,0.41-12.91-4.64-13.83-10.61c-0.41-2.67-0.07-5.45-0.07-8.19
	C209.09,244.49,209.05,244.49,209,244.49z"/>
<path class="st7" d="M204.52,255.36c-4.09,0-8.18,0-12.33,0c1.95-4.95,0.94-10.21,2.31-15.14c3.23-11.64,13.27-20.06,25.22-20.98
	c13.95-1.08,24.89,7.65,28.86,18.16c1.29,3.4,1.86,6.89,1.96,10.54c0.07,2.42,0.72,4.83,1.14,7.38c-3.97,0-8.1,0-12.22,0
	c-0.04-2.44,0.09-2.58,2.3-2.6c3.97-0.03,6.01-2,5.93-5.94c-0.03-1.41-0.17-2.95-0.75-4.2c-0.96-2.07-2.96-2.71-5.15-2.55
	c-1.41,0.1-1.87-0.37-1.83-1.8c0.14-5.62,0.24-5.36-5.39-6.72c-5.47-1.33-10.92-2.77-16.4-4.05c-0.9-0.21-2.05-0.11-2.89,0.28
	c-3.12,1.42-6.16,3.05-9.24,4.55c-1.36,0.66-2.04,1.66-1.97,3.19c0.04,0.96-0.06,1.94,0.02,2.9c0.11,1.25-0.36,1.59-1.62,1.7
	c-1.44,0.13-3,0.45-4.21,1.18c-2.32,1.39-2.32,5.45-1.57,8.03c0.65,2.24,2.64,3.42,5.42,3.44
	C204.51,252.74,204.66,252.9,204.52,255.36z"/>
<path class="st7" d="M188.36,225.83c0.48-2.69-1.25-3.61-3.14-4.49c-2.43-1.13-4.84-2.32-7.19-3.61c-1.46-0.79-2.82-0.94-4.44-0.51
	c-5.75,1.53-11.52,2.99-17.31,4.34c-2.31,0.54-4.18,1.23-3.78,4.43c-1.68-1.29-2.89-2.25-2.83-4.4c0.2-6.89,5.78-12.64,12.64-12.71
	c5.47-0.05,10.95-0.06,16.42,0c7.13,0.08,13.15,6.74,12.35,13.82c-0.13,1.13-1.33,2.14-2.04,3.2
	C188.81,225.88,188.59,225.85,188.36,225.83z"/>
<path class="st7" d="M254.98,225.51c-2.13-1.03-2.38-3.15-2.03-5.53c0.91-6.26,6.36-11.06,12.68-11.1c5.31-0.04,10.62-0.03,15.93,0
	c7.33,0.04,13.26,6.34,12.67,13.67c-0.09,1.17-1.31,2.25-2.01,3.37c-0.16-0.07-0.32-0.13-0.48-0.2c-0.06-0.33-0.17-0.66-0.18-0.99
	c-0.07-1.48-0.82-2.41-2.24-2.76c-6.71-1.68-13.41-3.37-20.13-4.99c-0.62-0.15-1.42-0.05-2,0.23c-3.29,1.57-6.62,3.1-9.75,4.94
	C256.39,222.77,255.85,224.27,254.98,225.51z"/>
<path class="st14" d="M156.86,270.6c2.28-1.72,4.19-3.26,6.21-4.64c1.57-1.08,2.32-2.39,2.15-4.32c-0.13-1.42-0.03-2.86-0.03-4.07
	c3.56,0,6.89,0,10.51,0c0,1.37,0.06,3.01-0.02,4.64c-0.07,1.49,0.51,2.55,1.7,3.41c2.12,1.53,4.19,3.14,6.45,4.83
	c-0.46,0.38-0.74,0.68-1.08,0.87c-3.71,2.14-7.43,4.29-11.17,6.38c-0.49,0.27-1.33,0.48-1.75,0.25
	C165.6,275.63,161.43,273.21,156.86,270.6z"/>
<path class="st14" d="M260.32,270.38c2.02-1.52,3.93-3.07,5.95-4.46c1.52-1.05,2.26-2.31,2.1-4.19c-0.12-1.43-0.02-2.87-0.02-4.18
	c3.53,0,6.9,0,10.51,0c0,1.41,0.05,3.06-0.02,4.7c-0.06,1.42,0.48,2.46,1.62,3.29c2.15,1.57,4.26,3.19,6.47,4.85
	c-0.26,0.31-0.36,0.51-0.53,0.61c-3.99,2.31-7.98,4.62-12,6.87c-0.39,0.22-1.1,0.26-1.47,0.05c-4.11-2.31-8.19-4.69-12.27-7.05
	C260.58,270.84,260.54,270.72,260.32,270.38z"/>
<path class="st14" d="M208.67,280.75c2.07-1.56,3.99-3.1,6.01-4.49c1.52-1.04,2.27-2.3,2.12-4.18c-0.12-1.43-0.02-2.88-0.02-4.19
	c3.52,0,6.89,0,10.5,0c0,1.36,0.07,2.95-0.02,4.54c-0.08,1.56,0.51,2.66,1.75,3.55c2.12,1.53,4.19,3.12,6.43,4.81
	c-0.51,0.4-0.81,0.69-1.15,0.89c-3.72,2.14-7.43,4.29-11.19,6.36c-0.51,0.28-1.41,0.4-1.89,0.14c-4.04-2.22-8.02-4.55-12.02-6.85
	C209.06,281.24,208.97,281.09,208.67,280.75z"/>
<path class="st15" d="M152.41,237.36c-0.5,0.04-0.91,0.09-1.32,0.09c-0.41,0-0.82-0.05-1.32-0.09c0-0.91,0-1.73,0-2.64
	c0.91,0,1.73,0,2.64,0C152.41,235.64,152.41,236.45,152.41,237.36z"/>
<path class="st15" d="M294.26,234.84c0,0.8,0,1.61,0,2.52c-0.91,0-1.73,0-2.52,0C291.21,234.57,291.47,234.31,294.26,234.84z"/>
<path class="st15" d="M201.36,247.68c0-0.91,0-1.73,0-2.64c0.91,0,1.73,0,2.64,0c0,0.91,0,1.73,0,2.64
	C203.08,247.68,202.27,247.68,201.36,247.68z"/>
<path class="st15" d="M240.05,245.04c0.91,0,1.73,0,2.64,0c0,0.91,0,1.73,0,2.64c-0.91,0-1.73,0-2.64,0
	C240.05,246.77,240.05,245.96,240.05,245.04z"/>
<path class="st15" d="M191.07,234.74c-0.47,2.67-0.63,2.83-2.6,2.55c0-0.8,0-1.62,0-2.55C189.33,234.74,190.14,234.74,191.07,234.74
	z"/>
<path class="st15" d="M255.58,237.26c-1.95,0.33-2.14,0.14-2.55-2.51c0.83,0,1.64,0,2.55,0
	C255.58,235.63,255.58,236.45,255.58,237.26z"/>
</svg>
