<?xml version="1.0" encoding="UTF-8" standalone="no"?>
<svg xmlns:rdf="http://www.w3.org/1999/02/22-rdf-syntax-ns#" xmlns="http://www.w3.org/2000/svg" version="1.1" xmlns:cc="http://creativecommons.org/ns#" xmlns:xlink="http://www.w3.org/1999/xlink" viewBox="0 0 24.022644 24.013225" xmlns:dc="http://purl.org/dc/elements/1.1/">
<metadata>
<rdf:RDF>
<cc:Work rdf:about="">
<dc:format>image/svg+xml</dc:format>
<dc:type rdf:resource="http://purl.org/dc/dcmitype/StillImage"/>
</cc:Work>
</rdf:RDF>
</metadata>
<defs>
<linearGradient id="c" y2="169.5792" xlink:href="#b" gradientUnits="userSpaceOnUse" x2="21.9317" gradientTransform="translate(1,-1.24044)" y1="167.0667" x1="19.57576"/>
<linearGradient id="e" y2="178.0223" xlink:href="#b" gradientUnits="userSpaceOnUse" x2="15.84741" gradientTransform="matrix(1 0 0 .973548 1.5 3.761392)" y1="174.9419" x1="14.01976"/>
<linearGradient id="d" y2="175.9469" xlink:href="#a" gradientUnits="userSpaceOnUse" x2="13.84897" gradientTransform="matrix(1 0 0 .973548 1.5 3.761392)" y1="177.4415" x1="15"/>
<linearGradient id="g" y2="164.9546" xlink:href="#a" gradientUnits="userSpaceOnUse" x2="23.61528" gradientTransform="translate(1.863401,-1.999999)" y1="170.3782" x1="22.45293"/>
<linearGradient id="b">
<stop stop-color="#5a5a5a" offset="0"/>
<stop offset="1"/>
</linearGradient>
<linearGradient id="a">
<stop stop-color="#8ab3df" offset="0"/>
<stop stop-color="#fff" offset="1"/>
</linearGradient>
<linearGradient id="f" y2="335.0308" gradientUnits="userSpaceOnUse" x2="-10.52821" gradientTransform="translate(41.8634,-175.7596)" y1="332.0769" x1="-13.05958">
<stop stop-color="#fff" offset="0"/>
<stop stop-color="#fff" stop-opacity="0" offset="1"/>
</linearGradient>
</defs>
<g transform="translate(-11,-155)">
<path stroke-linejoin="round" d="m28.8634 163-7.8634 8-3 2-1-1 2-3 7.8634-8 2 2z" fill-rule="evenodd" stroke="url(#c)" stroke-linecap="round" stroke-width="1px" fill="url(#g)"/>
<rect style="color:#000000" height="24" width="24" y="155" x="11" fill="none"/>
<path stroke-linejoin="round" d="m17.15103 173.5s-2.15103 1.6058-2.15103 3.5529 3 1.9471 3 0-0.84897-3.5529-0.84897-3.5529z" fill-rule="evenodd" stroke="url(#e)" stroke-linecap="round" stroke-width="1.0000001px" fill="url(#d)"/>
<path d="m20 169 7-7" stroke="#fff" stroke-linecap="round" stroke-width=".6" fill="none"/>
<path stroke-linejoin="round" d="m25 160 5 5 1-1-1.5-1.5c3.5-0.5 6.3634-4.2596 4.3634-6.2596s-5.8634 0.7596-6.3634 4.2596l-1.5-1.5-1 1z" fill-rule="evenodd" stroke="#000" stroke-linecap="round" stroke-width="1px"/>
<path fill-rule="evenodd" fill="url(#f)" d="m28 160c-0.40639-0.2032 0.15657-1.7676 1.5-3 1.83949-1.6846 3.33144-1.1712 3.3634-0.7596 0.1366 1.7596-2.8634 4.7596-4.8634 3.7596z"/>
</g>
</svg>
