<?xml version="1.0" encoding="UTF-8" standalone="no"?>
<!-- Created with Inkscape (http://www.inkscape.org/) -->

<svg
   width="196.41168"
   height="86.986862"
   viewBox="0 0 51.967258 23.015274"
   version="1.1"
   id="svg26702"
   xmlns="http://www.w3.org/2000/svg"
   xmlns:svg="http://www.w3.org/2000/svg">
  <defs
     id="defs26699">
    <rect
       x="138.64851"
       y="642.58252"
       width="183.97591"
       height="85.322159"
       id="rect64203" />
    <rect
       x="139.98167"
       y="213.3054"
       width="359.95288"
       height="237.30226"
       id="rect62767" />
    <rect
       x="142.64799"
       y="235.9691"
       width="159.97905"
       height="49.326874"
       id="rect61969" />
    <rect
       x="214.63857"
       y="446.60818"
       width="179.97644"
       height="71.99057"
       id="rect33300" />
    <rect
       x="211.97224"
       y="425.27765"
       width="207.97276"
       height="162.64537"
       id="rect31424" />
    <rect
       x="178.64328"
       y="462.60608"
       width="171.97748"
       height="113.3185"
       id="rect29592" />
  </defs>
  <g
     id="layer1"
     transform="translate(-25.07849,-106.68022)">
    <text
       xml:space="preserve"
       transform="scale(0.26458333)"
       id="text29590"
       style="font-style:normal;font-variant:normal;font-weight:normal;font-stretch:normal;font-size:16px;line-height:1.25;font-family:Lato;-inkscape-font-specification:Lato;text-align:center;white-space:pre;shape-inside:url(#rect29592)" />
    <text
       xml:space="preserve"
       transform="scale(0.26458333)"
       id="text31422"
       style="font-size:16px;line-height:1.25;font-family:'Noto Sans';-inkscape-font-specification:'Noto Sans';text-align:center;white-space:pre;shape-inside:url(#rect31424)" />
    <text
       xml:space="preserve"
       transform="scale(0.26458333)"
       id="text33298"
       style="font-size:18.6667px;line-height:0;font-family:'Noto Sans';-inkscape-font-specification:'Noto Sans';text-align:center;white-space:pre;shape-inside:url(#rect33300)" />
    <text
       xml:space="preserve"
       style="font-size:4.23333px;line-height:1.25;font-family:Lato;-inkscape-font-specification:Lato;text-align:center;text-anchor:middle;stroke-width:0.264583"
       x="44.796909"
       y="84.655579"
       id="text61501"><tspan
         id="tspan61499"
         style="stroke-width:0.264583"
         x="44.796909"
         y="84.655579" /><tspan
         style="stroke-width:0.264583"
         id="tspan61503"
         x="44.796909"
         y="89.947243" /></text>
    <text
       xml:space="preserve"
       transform="scale(0.26458333)"
       id="text61967"
       style="font-size:16px;line-height:1.25;font-family:Lato;-inkscape-font-specification:Lato;text-align:center;white-space:pre;shape-inside:url(#rect61969)" />
    <text
       xml:space="preserve"
       transform="scale(0.26458333)"
       id="text62765"
       style="font-size:16px;line-height:1.25;font-family:Lato;-inkscape-font-specification:Lato;text-align:center;white-space:pre;shape-inside:url(#rect62767)" />
    <text
       xml:space="preserve"
       transform="scale(0.26458333)"
       id="text64201"
       style="font-size:18.6667px;line-height:1.25;font-family:Lato;-inkscape-font-specification:Lato;text-align:center;white-space:pre;shape-inside:url(#rect64203)" />
    <text
       xml:space="preserve"
       style="font-size:4.23333px;line-height:1.25;font-family:Lato;-inkscape-font-specification:Lato;text-align:center;text-anchor:middle;stroke-width:0.264583"
       x="80.775536"
       y="78.306412"
       id="text86689"><tspan
         id="tspan86687"
         style="stroke-width:0.264583"
         x="80.775536"
         y="78.306412" /></text>
    <text
       xml:space="preserve"
       style="font-size:4.93889px;line-height:1.25;font-family:Lato;-inkscape-font-specification:Lato;text-align:center;text-anchor:middle;stroke-width:0.264583"
       x="51.146076"
       y="113.22684"
       id="text89225"><tspan
         id="tspan89223"
         style="font-size:4.93889px;stroke-width:0.264583"
         x="51.146076"
         y="113.22684"
         dx="0 0 0 0 0 0 0 0 0 0 0 0 0 0 0 0"
         dy="0 0 0 0 0 0 0 0 0 0 0 0 0 0 0 0.91000003 -0.91000003">Adjusting the h<tspan
   style="fill:#ff1313;fill-opacity:1"
   id="tspan100456">e</tspan>ight</tspan><tspan
         style="font-size:4.93889px;stroke-width:0.264583"
         x="51.146076"
         y="119.40045"
         id="tspan90715">to <tspan
   style="letter-spacing:0.502708px"
   id="tspan4092">achiev</tspan>e</tspan><tspan
         style="font-size:4.93889px;stroke-width:0.264583"
         x="51.146076"
         y="125.57406"
         id="tspan90717"
         dy="0 0 0 -0.9600001 0.9600001 -0.77999997 0.77999997 -0.85000008 0.85000008 -0.54000002 0.54000002 -0.87 0.87 0 0 -0.85000008 0 0 0 0.85000008"
         rotate="0 8.6000805 0 0 0 353.29999 0 351.29999 0 5.5 0">t<tspan
   style="fill:#ff1313;fill-opacity:1"
   id="tspan107150">y</tspan>p<tspan
   style="fill:#ff1313;fill-opacity:1"
   id="tspan111404">o</tspan>g<tspan
   style="fill:#ff1313;fill-opacity:1"
   id="tspan108746">r</tspan>a<tspan
   style="fill:#ff1313;fill-opacity:1"
   id="tspan118642">p</tspan>hic<tspan
   style="fill:#ff1313;fill-opacity:1"
   id="tspan115432">a</tspan>l e<tspan
   style="fill:#ff1313;fill-opacity:1"
   id="tspan104768"
   dx="0 -0.91000003">ffec</tspan>ts.</tspan></text>
  </g>
</svg>
