<?xml version="1.0" encoding="UTF-8" standalone="no"?>
<svg xmlns:rdf="http://www.w3.org/1999/02/22-rdf-syntax-ns#" xmlns="http://www.w3.org/2000/svg" version="1.1" xmlns:cc="http://creativecommons.org/ns#" xmlns:xlink="http://www.w3.org/1999/xlink" viewBox="0 0 16.018635 16.011559" xmlns:dc="http://purl.org/dc/elements/1.1/">
<metadata>
<rdf:RDF>
<cc:Work rdf:about="">
<dc:format>image/svg+xml</dc:format>
<dc:type rdf:resource="http://purl.org/dc/dcmitype/StillImage"/>
</cc:Work>
</rdf:RDF>
</metadata>
<defs>
<linearGradient id="d" y2="103.556" xlink:href="#a" gradientUnits="userSpaceOnUse" x2="275.4545" y1="95.67754" x1="270.1718"/>
<linearGradient id="a">
<stop stop-color="#5a5a5a" offset="0"/>
<stop offset="1"/>
</linearGradient>
<linearGradient id="e" y2="103.556" gradientUnits="userSpaceOnUse" x2="275.4545" y1="95.67754" x1="270.1718">
<stop stop-color="#f3ff49" offset="0"/>
<stop stop-color="#ffa01e" offset="1"/>
</linearGradient>
<linearGradient id="c" y2="93.16346" xlink:href="#a" gradientUnits="userSpaceOnUse" x2="276.8255" gradientTransform="matrix(1 0 0 .940296 0 5.373155)" y1="90" x1="271.2126"/>
<radialGradient id="b" cx="269.9677" gradientUnits="userSpaceOnUse" cy="95.72343" r="7.520315" gradientTransform="matrix(1,0,0,1.033243,0,-3.241221)">
<stop stop-color="#d7d7d7" offset="0"/>
<stop offset="1"/>
</radialGradient>
</defs>
<g transform="translate(-265,-89.969918)">
<path d="m268.5 100c-1 0-3 0.3049-3-2 0-3 3.6283-2.5 6-2.5 3 0 3-2.5 3-2.5" stroke="#000" stroke-width="1px" fill="none"/>
<ellipse stroke-linejoin="round" style="color:#000000" stroke-linecap="round" fill-rule="evenodd" rx="6.25" transform="matrix(.119829 0 0 .105878 237.4457 94.48869)" stroke="#000" ry="6.5" cy="97.5" cx="273.75" stroke-width="8.8780499" fill="#fff"/>
<path stroke-linejoin="round" style="color:#000000" d="m270 98.98237c7.036-3.93642 9.5 0.5 9.5 0.5v5.00003l-11 0.0176s-3-3 1.5-5.51763z" fill-rule="evenodd" stroke="url(#d)" stroke-linecap="round" fill="url(#e)"/>
<ellipse stroke-linejoin="round" style="color:#000000" stroke-linecap="round" fill-rule="evenodd" rx="6.25" transform="matrix(.401393 0 0 .385965 168.1187 65.35082)" stroke="#000" ry="6.5" cy="97.5" cx="273.75" stroke-width="2.5406296" fill="url(#b)"/>
<rect stroke-linejoin="round" style="color:#000000" fill-rule="evenodd" height="2.034293" width="8.089884" stroke="url(#c)" stroke-linecap="round" y="90.46992" x="270.455" stroke-width=".9999993" fill="#646464"/>
<path d="m273.459 91.43079h2" stroke="#000" stroke-linecap="square" stroke-width="1px" fill="none"/>
</g>
</svg>
