<?xml version="1.0" encoding="UTF-8" standalone="no"?>
<svg xmlns:rdf="http://www.w3.org/1999/02/22-rdf-syntax-ns#" xmlns="http://www.w3.org/2000/svg" version="1.1" xmlns:cc="http://creativecommons.org/ns#" xmlns:xlink="http://www.w3.org/1999/xlink" viewBox="0 0 15 16" xmlns:dc="http://purl.org/dc/elements/1.1/">
<metadata>
<rdf:RDF>
<cc:Work rdf:about="">
<dc:format>image/svg+xml</dc:format>
<dc:type rdf:resource="http://purl.org/dc/dcmitype/StillImage"/>
</cc:Work>
</rdf:RDF>
</metadata>
<defs>
<linearGradient id="a" y2="312.9608" gradientUnits="userSpaceOnUse" x2="102.0417" y1="308.2066" x1="94.93215">
<stop stop-color="#fffdf8" offset="0"/>
<stop stop-color="#cdccc7" offset="1"/>
</linearGradient>
<linearGradient id="b" y2="46.33896" gradientUnits="userSpaceOnUse" x2="414.6234" gradientTransform="matrix(.539989 0 0 .883257 -125.2513 264.0607)" y1="46.33899" x1="404.6787">
<stop stop-color="#fff" offset="0"/>
<stop stop-color="#98b6d3" offset="1"/>
</linearGradient>
</defs>
<g transform="translate(-90,-300)" fill-rule="evenodd">
<rect stroke-linejoin="round" style="color:#000000" height="5.971639" width="8.082604" stroke="#000" stroke-linecap="round" y="306.4892" x="93.45912" stroke-width=".9999995" fill="url(#a)"/>
<rect stroke-linejoin="round" style="color:#000000" height="2.934225" width="8.084316" stroke="#000" stroke-linecap="round" y="303.5228" x="93.45915" stroke-width="1.0000008" fill="url(#b)"/>
<path d="m90 307.5 2-1.5v3l-2-1.5zm9-5.5h-3l1.5-2 1.5 2zm6 5.5-2-1.5v3l2-1.5zm-6 6.5h-3l1.5 2 1.5-2z"/>
</g>
</svg>
