<?xml version="1.0" encoding="UTF-8"?>
<!-- Created with Inkscape (http://www.inkscape.org/) -->
<svg width="672" height="220" version="1.1" viewBox="0 0 672 220" xmlns="http://www.w3.org/2000/svg" xmlns:xlink="http://www.w3.org/1999/xlink">
 <image x="6" y="5.9311" width="208" height="208" image-rendering="optimizeQuality" preserveAspectRatio="none" xlink:href="data:image/png;base64,iVBORw0KGgoAAAANSUhEUgAAAJwAAACcCAYAAACKuMJNAAAACXBIWXMAAAsSAAALEgHS3X78AAAA GXRFWHRTb2Z0d2FyZQB3d3cuaW5rc2NhcGUub3Jnm+48GgAAGe1JREFUeJztnXt8nFWd/9/f55lc 55mkQJHV5aa0ogXaTGLRuirFhQV2wRW1gKAIgiCyLG0zaakL7CiuSJO0IF6QXUrZ1w+qlhcLKjfx grjKj0syaaUiUH5QBAW52GZm0jQzz/n+/phJMpPmnrk0yXn/9Zznec453ySffM/lOed7BMusYGHN qoNd1/wC2OEkvH/uINpTDjucclRqKT2u438FmA+coMH4xeWywwpuFtAwZ/kcRM7qTytyVLlssYKb BTgp93ygtj+twv5ls6VcFVtKh4pcmJsWxC2XLVZwM5xF3qrjgQW590TVCs5SHBz0CwAoyf576mAF Zyk8x4bWHAB6OoAIdww8UKRcNlnBzWD6TN9ngGrgr8D3cx5ZD2cpPCJyPoCid4gz2KRSxr+7FdwM JRyKLAEWAYhxN/ppNTmPreAsBcZwQeZCt8V61j7p4vj9jxQC5TLLCm4GctSBX/JUOANA1dkIkMbX /ueCWMFZCkdVb83ZAiEg7WrqdgBXBj0colZwlsJhjHweQFUf6Oi5/s8AaWGwD6dUlMk0K7iZxiJv 9VEivB9AJNOcArjkDhqsh7MUCEfM+dnLN+OJ3p/03/fFHWxSEevhLFNnKdEAqudkUnrHdm7c0/9M SA8MGtQOGiyFYGcofirwNwBiuC33mSuDTaqg1sNZpo6ocz6AwFOdPe0duc/c3EGDnYezTJWjg5cf BHoKgCq3Dn2e3pMzLYIdpVqmSMCpOJeMkNIB5I69nkvepy0rOMvUEOW87NV9TyRbXx36vC93WkRt k2qZAo11Kz9AdlWviG4c7p08DyfWw1mmgDFu/9zbG3vi3r3DvZNyArl9OOvhLJNjCStqBD0DQJDb txHtG+69aqnIFZwD0bL87a3gpjm9QedTwBwAo2wc6b0+d3eu4JjHm2VpVq3gpjkiZJtT+V1XsrVr pPdSFX3p3HTtQVVlaVat4KYxC+sj71TkOABR3TDauwe+/rY8wTl70tbDWSaG63M+mb9huo/UptHe jfOnvCbV9V3r4SwTIeoAnwNQ+PFTyRteG+3tDm7O83DGdyuLaNyIWMFNUxpDyX8EDgVQlZvGkUWB AS/naHlWjFjBTVNU9V+yl9u3JIM/G2e2AcH5Faaq8FaNjRXcNKSpvuUI4EQAUf0ORM0YWfoZaFZd P11dDNvGwgpuGuIbLiXzt9u9xzW3jfV+DgOCM1phPZxlbJawokZUPweA6qZt3evfmkD2wT6c61sP Zxmb3SHnHMgGFFT3uxPMPujhjFjBWcZGkC8CoPp4rGftkxPMPiA4cazgLGPQEFr5QZQmAHWciXo3 yGlSVbF9OMvoiDqXZi//6saDP5xwAarpwUtjPZxlZJpql78d+BQAIhsmdc6CiG1SLePDdwKXApWA GvybJ1lMjodT26RahiezyJL+wzx+uiW+7tnJlaQDfThR6+EsI7DHc88F5gJg9IbJlzTYpKqjVnCW YRGFy7OXv4v1tD8w+ZJypkXUsU2qZW/Ctc0nA+8FQE0rmVUfk8NozrSIHaVahsNxVmSvXu5Lhn4w pbJyRqmOWA9nGcIib/VRoCcAiOq6kXZkTYDBPhy2D2cZgqP+CkCAvyZr3P+aanmSM0pFsIKzDBKu XfUOhEysN+WmZ95YG596qZIauFTr4Sw5iKOryJwis8fR9I2FKFNl8FuqYPtwliyLgy1/o/2HssHG /sDQU8bk9OHEejhLlpTDKjIH6hrBmcJEbz4iMtiH0/L04coW1MQyPEcHLz9IVC8GULgnllj7dKHK VjRnq6D9tGUBKp2KCNnjwh3HrC1w8QPTKoL9eD/rCXtrDlTDJdnkLzq71/3fglYgpHJSNtTDbEe1 L4IQzKa+UujyRcmdOLaCm80cG1pzACJZ7yY/jyXaHylCNQMezpTpcBAruH2ElOmLZA9kA8xXi1GH ye/DWcHNVo4NrTlARbL7FeShInk3UM1pUsUGs5mt9GlqRb93E+GaolUkOZ+2rIebnRwbWnOAwGUA Aj/tjLf+ulh1CYMeTu2gYXaSMn0RoA5ARIvn3QDN8XBiBTf7CHtrDhzouwkPdMTb/7eY9YlROy0y m1FSXx7su5mCz7vtRV4fDrccofOt4MpEU+3ytw9s/RPuL/hXhWHJ83BlCZ1vP95nOXLuqlBNj/8e hHeLEEKkHgCVHlXT7eC85gbSzx6+6+Udm9nsj1HcmKgTuBKoATDiRKda3rgQpw8d3IPjzq2p5A32 jJKj4MxawS1jmfts8PC/d0T/CTiFXjMfRwZfyD0/WQRFSfsu273D9oQl8pQqv0b0Vykxj0wwRhsN c644XNPpCwEQ7tvSvfbxwvxUoyNG+zTnRwz0payHKzZHzl0Vqt1tvrAdvcwRPXwSRVShNAk0obK8 Ut102Is8DHIXBO6MJa59fawCJJW6CslMvKqv0UnYMDkk71sq4hsruGLS4LUsk16zHuFvM3tT9sIA ryL8GSVOZpdTEOEdKAfBsIsWA8AJmd1Vqesbvcg9vsp/bUm2PsQwe0gb6lrmY/RcAFHujfW0P1Gw H3AshFSuRY6psoIrBkfOXRWq7TW3gn5yyCMDPCSqD4o6v+rtCT412la8pprVh2rAX6Sqi8BZCvoh yIuzVqmwzBFd1uhFnlKVVie5a1MHNw+MDh3Dv2vm966qJeq7ZTFCn+T+C1SaCnaX0oIR/s1nEgtr Vh3suuZBsueJZulFuUErAjd17fzGi5Mtu4lorV+XOF6UZap8YvDjex7PqrCqK952zyJv9VEO/hbA VdWfdCXbT5ts3ZOhIdh8ooj8tD9txBw5+cA4k2NGe7hw7ap34JhfAPNzbv/GF+eCrYm1z0y1/A6i PXRzL3DvElZc0ht0Pp5dYvThnNfeLcrdjV7kp4pfBbgAjqv/MdX6J0z+PBxohW1SC8U8LqtSMXdJ vtjuchLdZ8VymrhC8Sjrd5NkE7ApXLvqfeLockXPJPs7VviHgZeFjtLMuw1BTB86OPUqWvpBw4yd +K0LVX1NhPfn3HrQSXSf1VEEsQ0l1rP2yc5E62fUkQUgm8j0FQdR6hqDkYXFtmMo4gfy+qfqln6J 0owUXNhrXqDaH+IKgG7fdy4shdhy6epufS6WaD0b5GtDHs1X4bFGr+XSYTMWC0nn/fyipV+iNCMF pyJryPs4ra1bd699uRy2LGOZC7osmzQoyex1taLfavAiPzhy7qrhBhsFRyTfw2EFN3XC3poDRTkj 55YJ+DqR44EKynPBQz9DNr6bqrb5xnkPwn39zwXOCPaaJxq9Ve8tti3iqhVcoRFNnUQm+HL2Bp1P 7F73x3LY0kS0VkT617g9n0j2Xb1199qXY/G2U8l44TSAwpGK+c0ib9XxxbTH6fPzBWf7cFNHJXMk 9+ANtpfJFIyXuAI4BECEFdu5sf9Ducbird9AzcnAX7P39nMwD4SDLecWy57djm89XOHR+XkpeLUc Viysj7wTaAEyy4/ibT8e+k4sue7nvjhLYOCfohLRjY1e5F+GvlsIAhWSvzJEHSu4AnBQbkJU68ph hOPTTjbclsEsH+m9rfG1z1RIxQeAh7O3ROHGhlCkpdA2uTvnWA9XBPJ+JoW3ldqAxmDzSQKnZwzQ 9WN9Pno8fu2bfQnvJJRb+u+JsrYx1LKqkHaFyF8tgmP7cIUgkZsQkSWZqYnSsIQVNSry7WzyZd/b aw5uWLYR7Ysl2y4Eru6/p6rfaPQiF4+SbUI8TDRN3iS09XAFQIbOtx3w/+oOe1+pat/jOVcCRwAI Etn6WltyjCx5xBJt16hKf3MqCt8Je5GzCmjioJcrYZPaVNvS2BiMLJxxghM0NvSeb+Tzpah7kbf6 KEUiWTt+2ZlonVSY+65kaxsDh4HgALeFveaPFMjMHMEVf+fWomDLP4S9lnvU0XmdybatM05wwF5h EgQ9b3H9incVuV4R/JvIzAGmfQKXTaWwWKLtmyr6b9lkJchdDXUt80fNND4GBVekPlwTF1U0BCNn h71IzBH9T2P8aGei7YcwA5vUuoT3CMhrQ25Xpn13YzH7cg2h5gsEPgSgIjduSVy3bapldsXbvy5K azZ5gBj9ScOc5XOmWGzO1Ehhm9T3739ZXTjY3Gy8uudFuB2I+7B4S8+6gVZnxgnuYaJp1Nw6zKMP P+cdVpS9nwu9yNtE5bps8qVUdfLqUTNMgM5k22pBbs8m3y3pituYysLZ3BhxWpiQXU01qw8Nh1ra +vqq/ohIG3CwCG31Ce+jWxNtf8l9d8YJDgCpXMeQ0SqAwL+FveYvFro6R2gH9gdQI5dse/07e9U9 BbQuEbwQeDSb/FhDKHLFZAsTKVxQwsba5qawF7nduP52VJvJhKzYpaKf6Iy3tWRHxXnMSMHFEte+ riojeDP5VmMocn6h6goHV/69KJ/JJr/f1dN636gZJsHDRHtTmjodeAlAlGsavMjSyZSlyIDgHGXC fbgmorUNoZbzwl7Lo+rIk8DZDAq3y3GlqSvefvdI+Wek4ADmJ19cr8pjwzxyVbklHGqZtJfoZynR asT5bjb5pk/eGryC8lTyhtcQziITxdIVuG1S/TnJiaAkjDuwdNhrXhD2IjcYL/GKqN4K+oG8F5Rb qhP+Bzt2tT4/WjkzVnCb2exXGLMM+MswjwXVa8OhyMYmorWTrWOXl/gy2SXsKhIZ2l8pNLF426Oo rskmD5V04NujZhgOzRk0qHqjvbqUaHVDsPmcsBd5BGQb8K/AUJH/WUVPjyXbLnyU9WPuAZuxggN4 Yve6PyJ8PGfRYz7K54yXeHQya9GaQs3vAVZnUvLzrnhrSdbcxZLt6wT6d16d3ehFzhg1w9709l+o yHCCk7DX/JEGr+V7u7zEn0Tk/5C/KWggO6obNJBeMFoTOpQZLTjIeAVFTyfnFz2EhYrpDIdarlhK dFybipaxzDUqt5CZc+txXC5mKgfnTgzVtF6kEAdQ5JvH1F+x33gziw7uRBVhYGFD2GteEA5Gvh4O RV4A+ZWgFwEjldspIsfFku0XdO28fudEjJ/xggPoSrY/BHIysGuEV6pRvXaXl3ii0Yt8dKzyngsd thL4IICIfGWsfkuhifW27xAk6131oIDvj/sAEZWcfzxlQTgYWdnoRTpBtiGsQTlslOyvInJBLOEt nmykzhm/ETqXcHDlIpC7ETl81BeF+xxfruroae3cqwyveQFIB1CN8GR93Fsy3PC/BEjYi/wSOA5Q kONjidZfjZUp7EU2ARP9NvsXVWk1nn53ot+GhzKrBAfQFGqea1Q2ASeM4/VfqMO6+d07HtjMZr+J aK3xEr8GGoE+URZ3Jtu2FtfikWmsWzFPjfsUmXATz1Yn/IahHfcmLqpIe3M+5Ko5RYVTye6vGCev qkp7IYTWz6wTHGT6YNu9Q9eAXAXjmov6i8CdmlkFchKAwFc6E23RYto5HsKhSDvKSgBBbuhMtC7P xEBJn2xUTgZOGCEExSjI70R0fXd8zx05y+ILwqwUXD8LvcjRrrABZfEEs/aIyMlHxF/8bSGCE06F o+pW7F9p3Ofpn65QXkB45ySKMqLcb9AbupLtP6NIg6BZLbgMUSccjJ+DyNeAQyeSUyHuwKMGfivK b/pcv3OiwQknQhMXVRAKHaHKAoMcI0oTwvuAt0+h2DdUdYMJyE1bd7W9UChbR8IKLstSotW7gvFL EWlmSn9AeQ10G/B74DkRXsCwww34CWOc7j6nwgeQPhOsqkxVAvT5lTWuSVfjSD0qlUYIOWL2MzBX kAOyI8cFwDwKG318e3XCXzieCdtCYQU3hHlcVlXnVZ2nmR1XR5TbngKiCE+iVAELAQRinYm2xlIa MSvm4SbCdm7c05lo+968xI4jVQbOnZ+upDJfJeRLxvcPicXbjgXuzHluw3XtK2xmsx/W5sGpE+G/ UeqBjzDyDPw+gyqPUZE+OTbkS4AKvf1RMDUbRb2UWMGNQIPX/CWQMwEUru+Kt63IPIk6TbXJBhX9 iBE+IvB3lGErYpZXgKcRtmJki6p52nFkg8LRIoRTqb2PGReV3pwB6KQXLkwWK7hhaKxtblJkXTb5 iJvoztkfGjUdPXQCncD1AItCK9/tqtOgSgMOi1DmA4cxvjm+sXgdeEVVXxbHeUYxfxBkm7rpp4f7 jtkYbGlB9H6gslIqLgTyIm2qaG9OnN+SC84OGoZwTP0V+7m+/6Sg7wJ5zTGpcEfP9X+eeElRZ3FN 99+mA87BKuwvvhwg6P7qZNagiWaaMxV2qxHfcUy3MZJwkLeMmjeprHh9zs7qVx8mOtKigxEJe5Eu YBHwcn3Ce2fup7dwsPmziPx3NpmKJdpKuhnaerh8pML3Nyj6LsComs9OTmwAUfPEbv4ITC5yU8/k agVQ1fUishE4eJcX/ziJwYGCiOzJmdGtWEo0UMpvwXaUmkPYi1yp6MezyWhmlcn0w03G7yDTvwMk LzCOisnzmLv3f7OkzaoVXJaGYPOJwL9nkw/GEl7po4wXiGxo2e9lk8c1BVcc0/9MjeRN8po91VZw pWZxzcpDROQOMiHtX4aKz0LUjJVvX8b4/gbAB/AlMODlHMfJ7xMG0lZwpWQel1WlHGczMBfodRw+ NZ7zsvZ1tuxe/4ooD2RS+uklrKgB8CU/Rtwe37WCKyVesOq7/eH1VeSSju624XZ6TU9ENwAIhPZ4 7mkAAT+V16QGHDPqRppCM6sF1xBsvlyE8yGzlqwr3rqxzCYVlLpE6EcMRACVTwOom3+6lvoES2nT rBVcoxf5qGTCEiDoL+sSwUi5bSo0DxNNq8gmAEVPOab+iv00XZE34aKOYz1csQlXNx+m8H0ggLBD qTyzTPsSio4r2h8yrMo1qU+mK5z8pUjGeriictSBX/IIyI+AAxXiYvjYTBgkjERHd9vjqL4I4Chn 796VzPNwjjP6ZuhCM6sEt4xlbmVP7R1k1oOlxeiZ5dwEUyJUkM0AihwXrAnMzXtoht0MXTRmleCe 9w5vRzgNQJDlsZ72+8ttUylQdX6YvXTcQOCcvIdiPVxRaPRaLlX0cgAVWd+ZaJ14XI5pSqxn7ZNk v+lqdodXP6q2D1dwGoMtJyt6PWTOmZ8ff7HgZyDs6wgDk8AHDXlgBVdIwsGVi4zoD4GAKo+lPc4s 99a+8qAPDHdXREpykmE/M1pwi2tWHoI4P85uBN5uhI8Vagf5dKOisu9nZGLL5WOb1MLQFGqe67vO Q2QOV/uTBgInFjt+277MY2/d2A3sdez5xHflT40ZKbgmorVG5R6FI4FuVfmnrp3feLHcdpUbgQeH 3lMp7YagGSe4Ji6qMKHEnWTCafWCntaVbO0qt137BGaYfpxmgmGXihkmuKjjh+o2oJwCpFX007FE +14HhcxWjuh5qQvoHnLberhJImEv+e1sRHGjyucmEgp0NrCZzb7s3Y+bA9GS6WDGCK4xGLkO9IuA iuglXcm2O8pt076Ior8Zcss5pr63vlT1zwjBNXrN/6GSPX1ZtaUz3n5zmU3aZxHkf4feq8QvWT9u 2gsu7DVfqciXARCuiCXb28ts0j5NOshjQN5SLD9lrODGQ9hrvhrkmkxKr4rF264bPYclO/Gdd0K1 ilOygcO0FVyjF4nCwPFGV8cS7eM6edkCwB9yE45oyTzctNx5H/ZarlH0SgCBKzsTbdN2D2k5UHha 8tJWcCMhDaGWdlQzkYxUI522zzZxlN/nRpVxkJI1qdNGcEuJBrqD8f9U1fPIxJtaHku2f7PMZk1L VM3TIoO9KZXSfW2YFoKbx2VVu7zE7SCfBHyEi2PxtlvKbdd0pcqteimlgwtH1JTua8M+P2homLN8 Tsiregj4JLBH0DOs2KbG4/Fr34LBg3qlhB5unxbc4pqVh0i64hEyp9ntFJETOxPtd5XbrhmAAq/l pK2Ha6htXpx2ncdAjwH+pCrHT/ZAMcswSP+OfBBmuYdr9Jo/IY48TOa8hK2O7y6xS4wKjBkUnM5i wUlDKLJGkTuBWpAf9dX0/F3H7uteKrdhMw2FN3KSEz/KfJLsM6PUplDzXN9wqyinZm99c17ixZWb E7Nxw0vxEckc8Julhky856IfMrxPeLiw13KcUekSkVNRkqieG0u0XT47d1eVCsldiClLie4VYr8Y lNXDLSVa3e3Fr1J0NeCCbhNxl3Um1j5dTrtmAyLENcef7Zyzs5qdIx7TXjDKJrjGUMuHd2nieyDv BVSRm02QlVtfWzsrt/GVGtW8JpWKVEV1KeotueCOqb9iv0A63aqqnwcE5QUVPt+VaH2YRKmtmb2o mm6RwQ+qewJakmOQSia4Ji6qMF79F/HTVyEcCKRQ1jlJ76sdRKdwKoFlMoijcXRQcAHfmTEeThq8 lk8Z9Oug87K3fg7mX2PJ9t+XoH7LMKg63blLlIzufS5XMQg0hCItNXH/W4U/pDXqNIQSp2FYI+j7 szd/rw6rurpb7y1sXZaJ4hrpNs7gqMFBS3JMgGOU+3u9wD0NoZUfLESBTURrw17LJWEv8QdR7s5G CH9WVc+rT3iLurrbrNj2AZyKdN7BcOJo30jvFhKBTMxbAs73EX0LX78V6wk9OJGDMZr2W12vKXOy oh8D/pH+mWuhQw3r5id3/MDOqe1bHBtac0BKUwNfG3yXd5X0zPsmLqrwg/WXi+hVQA+q9yGyRYUd 6puXcEm6voSMq1WIsx++vBd0gTgcjdLA4OnCu4H/UTHf7oqv+22xfwDLZIk6YS+RBKoBjO8fvGX3 +leKXetex1c27be63k+lzxHkC0DDOMvZqfBLUf2fnhr37mfeWBsfO4ul3IS9lq3Z1Tg9fTU9B217 /TtFn5ga9bzUpprVh6rrfwBhscJBolQragTnVVRfxGGHMfLC/OSLv7NN5vSjMdh8kopsEuWrncm2 60tR5/8HGGeEQZTKUJcAAAAASUVORK5CYII= "/>
 <path d="m622.51 8.3144c0.0262 0.59776-0.0682 2.351-0.73792 2.9971-1.2259 1.1821-1.4851 0.69184-2.2918 2.1366-0.4256 0.76288-1.0448 2.4928-1.4502 3.5062-1.2291 3.0736-2.3645 6.1642-3.503 9.28-6.7997 18.608-14.092 36.947-22.978 54.72-2.5187 5.0371-5.0947 10.038-7.6765 15.04-0.77376 1.4992-2.1766 4.4512-2.8973 5.76-0.60704 1.103-1.5674 1.5674-1.3718 2.7712 0.10688 0.65536 1.3325 1.191 1.9469 1.5533 1.535 0.90528 4.2454 2.9526 5.7597 4.192 1.7034 1.3942 3.5402 3.1056 5.12 4.575 1.0221 0.9504 1.8598 1.5651 2.8675 2.5933 3.3094 3.3763 6.7293 7.5562 9.3981 11.515 1.3251 1.9654 3.9216 5.7002 4.7168 7.68 1.1107 2.7651 0.68288 3.3603 2.5392 4.0106 1.0864 0.38048 2.9286-0.32512 4.1584-0.67584 3.176-0.90528 5.3181-0.86304 7.6797-1.8608 0.53856-0.22752 1.672-1.0221 1.9072-1.5296 0.912-1.9693-0.27136-1.6746-0.30816-4.7443-0.0141-1.1888-0.20352-1.937-0.29024-3.2-0.0659-0.9664-0.0285-1.5926-0.0285-2.56v-8.64c0-2.0938-0.20512-3.1008-0.30752-5.44-0.0717-1.639-0.0125-2.3699-0.0125-3.84v-5.76c0-1.6054 0.0771-2.5376-0.13568-4.16-0.51328-3.9075-0.18432-6.8579-0.18432-10.88 0-1.8637 0.0624-2.9222-0.18432-4.8-0.1776-1.3536-0.13568-3.1741-0.13568-4.48v-3.84c0-2.689 0.0736-4.4794-0.22848-7.04-0.20992-1.7766-0.0915-2.7747-0.0915-4.48 0-6.1965-0.64-12.656-0.64-18.88v-21.44c0-2.151 4e-3 -5.7472 0-7.68-5e-3 -2.4579-0.49632-2.8752-0.96-3.52m-42.88 93.76c-0.33536 0.43488-0.6384 0.76704-1.3779 2.2406-0.74848 1.4909-2.9987 5.328-3.9722 7.0394-3.033 5.3315-6.4093 10.574-9.7965 15.68-1.0938 1.649-3.2646 4.8394-4.135 6.4-1.2515 2.2442-0.92192 3.8906-3.7584 3.5898-1.4669-0.15552-6.0707-2.0326-7.68-2.8797-4.6938-2.4707-8.4957-5.3664-12.16-9.0304-1.9693-1.9693-3.7786-4.1971-4.9638-6.7197-2.2416-4.7718-1.9974-11.317 0.45184-15.68 0.67392-1.2003 1.4182-2.1344 2.3642-3.1952 1.8544-2.0794 4.6304-3.7827 7.2675-4.7837 7.8573-2.9824 16.565-1.7818 24.32 0.5296 2.6893 0.80128 5.8237 2.2221 8.32 3.5392 0.8736 0.4608 2.0154 1.1443 2.8794 1.4966 1.1766 0.48 1.7142 0.78144 2.2406 1.1334m86.4 12.48c-2.864 2.0358-4.8544 3.1219-7.36 4.6832-5.5168 3.4371-11.03 6.72-17.6 9.5315-4.8736 2.0858-11.341 4.5968-14.4 4.9853m-2.24 2.24c0.27552 0.32576 0.6048 0.60224 0.81792 1.0112 0.13728 0.26336 0.27936 0.46976 0.36192 0.9104 0.26656 1.425 0.42016 5.1389 0.42016 8.3184 0 0.9808-0.0474 1.8112 0.0544 2.88 0.0912 0.95744 0.23552 1.52 0.2608 2.56 0.0509 2.0682-0.0397 4.0774 0.01 6.08 0.0358 1.4634 0.31296 3.008 0.3152 4.48 4e-3 2.735-0.7424 3.8819-0.67456 6.4 0.049 1.8211 0.44864 2.7174 0.62016 4.16 0.30912 2.5974 0.79584 6.4752 1.1974 9.28 0.72224 5.0435 0.19584 22.15 1.417 27.28m-71.68-71.44c2.2224 1.6048 5.2586 1.8342 8 2.5194 11.234 2.808 23.188 2.3824 34.56 0.81632 3.8342-0.52832 8.8864-0.61984 12.16-2.3757m-55.04-0.64c-0.83712 0.84704-1.399 1.4266-2.7357 3.84-0.90592 1.6355-3.0822 4.4112-4.3459 6.08-3.4678 4.5805-7.1293 9.032-10.813 13.44-9.3238 11.158-19.412 21.589-30.426 30.799-4.9034 4.1005-10.053 7.6525-15.68 10.564-1.0422 0.53952-1.8429 1.0621-2.88 1.553-6.4995 3.0765-13.015 4.6173-20.16 4.4445-4.4186-0.10688-11.048-2.5946-12.48-6.72m154.24-63.04c0.93664 0.94784 1.6048 1.2973 2.5267 3.84 0.37344 1.0301 1.457 3.256 1.9981 4.48 1.6976 3.84 3.3155 7.8269 4.5248 11.84 0.40576 1.3462 1.1251 4.1062 1.553 5.1187 0.9472 2.2397 1.5875 1.9894 3.1574 3.2013" fill="none" stroke="#310c74"/>
 <path d="m244.8 213.36c-2.5989-0.37063-4.3699-0.9154-6.9395-2.1347-2.4974-1.185-5.8605-4.0033-5.8605-4.9112 0-0.44552 0.24227-0.3372 1.1405 0.50993 1.4968 1.4116 5.1638 3.13 8.0427 3.7689 5.0476 1.1201 12.056 0.38575 18.013-1.8873 6.1664-2.3532 15.396-7.7847 21.124-12.432 14.106-11.444 29.138-27.599 44.103-47.4l3.6228-4.7936-1.3828-0.61966c-7.0532-3.1608-10.778-5.3964-14.984-8.9931-6.6133-5.6559-9.7905-11.215-10.152-17.763-0.37455-6.7768 2.7246-12.859 8.7398-17.151 7.2799-5.1949 17.575-6.2769 28.831-3.0302 4.8617 1.4024 10.017 3.5974 13.266 5.6485l1.1871 0.74936 0.70471-1.1884c1.3397-2.2593 12.751-24.887 15.204-30.148 2.6821-5.7531 8.1888-18.551 10.562-24.548 1.5679-3.9611 3.7502-9.6789 8.4628-22.172 1.5601-4.136 3.5102-9.104 4.3336-11.04 0.82339-1.936 1.7512-4.2189 2.0618-5.0732 0.79548-2.1877 1.654-2.9829 2.7937-2.5876 0.5187 0.17991 1.1192 0.77119 1.4464 1.4242 0.50407 1.0059 0.56006 2.3688 0.56514 13.757 3e-3 6.952 0.21649 19.048 0.47422 26.88 0.87314 26.534 1.0978 35.318 1.4366 56.16 0.37115 22.834 0.58231 29.28 0.95911 29.28 0.30262 0 5.245-1.774 10.245-3.6776 7.053-2.6849 13.327-5.3625 20.24-8.6383 3.828-1.8139 6.96-3.2584 6.96-3.2101 0 0.22233-11.001 8.892-13.28 10.465-5.6472 3.8993-11.102 6.819-18.88 10.106-2.464 1.0413-4.7255 1.981-5.0255 2.0883-0.47184 0.16877-0.52516 0.55387-0.39477 2.8507 0.0829 1.4606 0.2919 6.9036 0.46442 12.096 0.3644 10.967 0.81995 18.58 2.4092 40.264 0.37227 5.0792 0.41098 15.095 0.15136 15.881-0.83758 2.5379-2.8119 2.7444-3.8472 0.40238-0.45855-1.0373-0.71624-11.082-1.1178-16.868-0.70052-10.095-1.9277-16.291-5.7997-29.28-2.2296-7.4795-7.3916-20-8.2457-20-0.23447 0-2.1381 0.34727-4.2303 0.77171-2.0922 0.42445-5.604 1.0007-7.804 1.2806-15.201 1.934-26.185 1.4259-38.306-1.7719-2.0759-0.5477-4.0624-1.0505-4.4144-1.1174-0.4996-0.0949-1.1651 0.59782-3.0337 3.1577-13.008 17.821-32.043 38.273-46.144 49.581-8.7067 6.9823-20.605 13.192-28.348 14.795-2.853 0.59061-7.1713 0.83013-9.3541 0.51884zm153.63-56.089c-0.19041-4.3522-0.3462-9.4436-0.3462-11.314 0-2.9114-0.07-3.3744-0.48627-3.2146-0.26745 0.10263-2.0314 0.64916-3.92 1.2145s-3.4922 1.0712-3.5636 1.1242c-0.0714 0.0529 0.53151 1.5024 1.3399 3.221 1.93 4.1031 3.9981 9.4606 5.7182 14.813 1.7038 5.3021 1.7386 5.1404 1.258-5.8442zm-26.586-16.066c3.602-0.47911 10.929-1.7688 11.153-1.9634 0.19087-0.16521-3.1359-5.5521-5.5101-8.9221-3.2419-4.6018-7.3784-9.268-11.831-13.346-3.8417-3.5187-10.31-8.5952-10.932-8.5793-0.176 4e-3 -1.6409 2.344-3.2554 5.199-3.228 5.7083-7.3801 12.427-12.442 20.134l-3.2996 5.0235 1.6586 0.47176c2.6903 0.76521 7.527 1.72 10.619 2.0961 1.584 0.1927 3.312 0.40929 3.84 0.48132 2.149 0.29313 16.542-0.135 20-0.59491zm18.56-3.8702c1.672-0.45851 4.0279-1.1309 5.2354-1.4943l2.1954-0.66065-0.2029-5.9581c-0.11159-3.277-0.34497-13.014-0.51862-21.638-0.17365-8.624-0.47382-22.16-0.66706-30.08-0.19323-7.92-0.44377-25.272-0.55675-38.56l-0.20541-24.16-1.2326 3.04c-0.67792 1.672-2.3547 6.136-3.7262 9.92-10.006 27.608-17.334 44.375-30.195 69.094-2.2361 4.2979-3.9533 7.9094-3.816 8.0255 0.13732 0.11618 1.3297 0.98045 2.6497 1.9206 9.1613 6.5252 18.414 16.877 25.086 28.065 1.2222 2.0494 2.3042 3.5283 2.5258 3.4524 0.21327-0.0731 1.7558-0.50801 3.4278-0.96652zm-53.675-5.9911c6.8354-10.587 14.005-22.504 14.79-24.582 0.1464-0.38802-0.6811-0.91904-3.6326-2.3311-11.181-5.3493-21.523-6.8027-29.8-4.188-8.8526 2.7965-12.805 10.669-9.5969 19.113 2.2364 5.8858 11.049 13.228 20.422 17.016 1.5252 0.6163 3.0134 1.1233 3.307 1.1267 0.34524 4e-3 1.9394-2.1707 4.5113-6.1539z" stroke-width=".32"/>
</svg>
