<?xml version="1.0" encoding="UTF-8" standalone="no"?>
<svg xmlns:rdf="http://www.w3.org/1999/02/22-rdf-syntax-ns#" xmlns="http://www.w3.org/2000/svg" version="1.1" xmlns:cc="http://creativecommons.org/ns#" xmlns:xlink="http://www.w3.org/1999/xlink" viewBox="0 0 24 24" xmlns:dc="http://purl.org/dc/elements/1.1/">
<metadata>
<rdf:RDF>
<cc:Work rdf:about="">
<dc:format>image/svg+xml</dc:format>
<dc:type rdf:resource="http://purl.org/dc/dcmitype/StillImage"/>
</cc:Work>
</rdf:RDF>
</metadata>
<defs>
<linearGradient id="h" y2="214.25" xlink:href="#b" gradientUnits="userSpaceOnUse" x2="783" y1="200.25" x1="770.5"/>
<radialGradient id="d" cx="777" xlink:href="#c" gradientUnits="userSpaceOnUse" cy="209.35" r="11.5" gradientTransform="matrix(1.434932 0 0 .608696 -337.9418 82.56952)"/>
<radialGradient id="e" cx="778" xlink:href="#c" gradientUnits="userSpaceOnUse" cy="216.4737" r="11.5" gradientTransform="matrix(1 0 0 .826087 0 38.17391)"/>
<radialGradient id="f" fx="842.7534" cx="842.25" xlink:href="#b" gradientUnits="userSpaceOnUse" cy="222.75" r=".75" gradientTransform="matrix(1,0,0,1.666667,0,-148.5)"/>
<linearGradient id="c">
<stop stop-color="#fffdf8" offset="0"/>
<stop stop-color="#fcfaf5" offset=".43478271"/>
<stop stop-color="#cdccc7" offset="1"/>
</linearGradient>
<linearGradient id="b">
<stop stop-color="#d7d7d7" offset="0"/>
<stop offset="1"/>
</linearGradient>
<linearGradient id="g" y2="218.25" xlink:href="#b" gradientUnits="userSpaceOnUse" x2="782" y1="216.875" x1="763"/>
</defs>
<g transform="translate(-777.85358,-208)">
<rect height="24" width="24" y="208" x="777.8536" stroke-width="1.0000001" fill="none"/>
<g transform="translate(5.853577,2.75)">
<path stroke-linejoin="round" d="m773 210.5v12.5l11 5.5 11-5.5v-12.5l-11 4.5-11-4.5z" stroke="url(#g)" fill="url(#e)"/>
<path stroke-linejoin="round" d="m784 206 11 4.5-11 4.5-11-4.5 11-4.5z" stroke="url(#h)" stroke-width="1px" fill="url(#d)"/>
<path d="m848 219v13.417" transform="translate(-64,-4)" stroke="#000" stroke-width="1px" fill="none"/>
<g transform="translate(-64,-4)">
<ellipse id="a" rx=".75" transform="matrix(1.795342,0,0,1.795342,-669.664,-176.9133)" ry="1.25" cy="222.75" cx="842.25" stroke-width="1.3484024" fill="url(#f)"/>
<use xlink:href="#a" transform="translate(9.037201,-1.473703)" height="1250" width="1250" y="0" x="0"/>
<use xlink:href="#a" transform="translate(9.037201,3.880038)" height="1250" width="1250" y="0" x="0"/>
<use xlink:href="#a" transform="translate(13.22746,-3.462058)" height="1250" width="1250" y="0" x="0"/>
<use xlink:href="#a" transform="translate(13.22746,1.844619)" height="1250" width="1250" y="0" x="0"/>
<use xlink:href="#a" transform="rotate(90,847.9046,219.8453)" height="1250" width="1250" y="0" x="0"/>
<use xlink:href="#a" transform="rotate(90,851.3872,223.3559)" height="1250" width="1250" y="0" x="0"/>
</g>
</g>
</g>
</svg>
