<?xml version="1.0" encoding="UTF-8" standalone="no"?>
<svg xmlns:rdf="http://www.w3.org/1999/02/22-rdf-syntax-ns#" xmlns="http://www.w3.org/2000/svg" version="1.1" xmlns:cc="http://creativecommons.org/ns#" viewBox="0 0 12.9533 14.23832" xmlns:dc="http://purl.org/dc/elements/1.1/">
<metadata>
<rdf:RDF>
<cc:Work rdf:about="">
<dc:format>image/svg+xml</dc:format>
<dc:type rdf:resource="http://purl.org/dc/dcmitype/StillImage"/>
</cc:Work>
</rdf:RDF>
</metadata>
<g stroke-linejoin="round" stroke-linecap="round" stroke-miterlimit="0" transform="translate(-672.121,-87.91118)" fill="none">
<path d="m683.5954 101.6495-10.9744-13.23832" stroke-opacity=".72727266" stroke="#da0000"/>
<path d="m677.4691 101.0666-2.6405-10.1315 9.7457 4.74274" stroke="#5a5a5a"/>
</g>
</svg>
