<?xml version="1.0" encoding="UTF-8"?>
<!-- Created with Inkscape (http://www.inkscape.org/) -->
<svg width="150.97mm" height="155.44mm" version="1.1" viewBox="0 0 150.97 155.44" xmlns="http://www.w3.org/2000/svg">
 <defs>
  <marker id="EmptyTriangleOutL" overflow="visible" orient="auto">
   <path transform="matrix(.8 0 0 .8 -4.8 0)" d="m5.77 0-8.65 5v-10z" fill="context-fill" fill-rule="evenodd" stroke="context-stroke" stroke-width="1pt"/>
  </marker>
  <marker id="Tail" overflow="visible" orient="auto">
   <g transform="scale(-1.2)">
    <path d="m-3.8049-3.9585 4.3484 3.9585" fill="none" stroke="context-stroke" stroke-linecap="round" stroke-width=".8"/>
    <path d="m-1.2867-3.9585 4.3484 3.9585" fill="none" stroke="context-stroke" stroke-linecap="round" stroke-width=".8"/>
    <path d="m1.3054-3.9585 4.3484 3.9585" fill="none" stroke="context-stroke" stroke-linecap="round" stroke-width=".8"/>
    <path d="m-3.8049 4.1776 4.3484-3.9578" fill="none" stroke="context-stroke" stroke-linecap="round" stroke-width=".8"/>
    <path d="m-1.2867 4.1776 4.3484-3.9578" fill="none" stroke="context-stroke" stroke-linecap="round" stroke-width=".8"/>
    <path d="m1.3054 4.1776 4.3484-3.9578" fill="none" stroke="context-stroke" stroke-linecap="round" stroke-width=".8"/>
   </g>
  </marker>
  <marker id="EmptyDiamondMend" overflow="visible" orient="auto">
   <path transform="matrix(.4 0 0 .4 -2.6 0)" d="m0-7.0711-7.0711 7.0711 7.0711 7.0711 7.071-7.0711z" fill="context-fill" fill-rule="evenodd" stroke="context-stroke" stroke-width="1pt"/>
  </marker>
 </defs>
 <g transform="translate(-6.2961 -44.128)">
  <path transform="matrix(.55383 0 0 .55383 -50.027 -91.88)" d="m346.91 486.85-86.947-29.636-73.705 54.824 1.317-91.849-74.917-53.156 87.761-27.13 27.404-87.676 52.922 75.082 91.853-1.031-55.053 73.534z" fill="#fee100" fill-rule="evenodd" marker-end="url(#Tail)" marker-mid="url(#EmptyTriangleOutL)" marker-start="url(#EmptyDiamondMend)" stroke="#1967ba" stroke-dasharray="5.41679, 5.41679" stroke-linejoin="round" stroke-width="1.8056"/>
 </g>
</svg>
