<?xml version="1.0" encoding="UTF-8" standalone="no"?>
<svg xmlns:rdf="http://www.w3.org/1999/02/22-rdf-syntax-ns#" xmlns="http://www.w3.org/2000/svg" version="1.1" xmlns:cc="http://creativecommons.org/ns#" viewBox="0 0 12 12.000037" xmlns:dc="http://purl.org/dc/elements/1.1/">
<metadata>
<rdf:RDF>
<cc:Work rdf:about="">
<dc:format>image/svg+xml</dc:format>
<dc:type rdf:resource="http://purl.org/dc/dcmitype/StillImage"/>
</cc:Work>
</rdf:RDF>
</metadata>
<g transform="translate(-670.5213 -244.99996)">
<rect opacity="0" style="color:#000000" transform="translate(-64.4787,188)" height="12" width="12" y="57" x="735" stroke-width=".8"/>
<path stroke-linejoin="round" style="color:#000000" d="m682.0213 245.5c-3.5 0.5-8.5 4-8.5 8" stroke="#909090" stroke-linecap="round" stroke-miterlimit="0" stroke-width="1.0000004" fill="none"/>
<path stroke-linejoin="round" style="color:#000000" d="m673.0213 247.5v6" stroke="#646464" stroke-linecap="round" stroke-miterlimit="0" stroke-width="1.0000004" fill="none"/>
<rect stroke-linejoin="round" style="color:#000000" stroke-width="1.0000007" fill-rule="evenodd" fill-opacity=".3921569" rx="1.011026" transform="translate(703.5311 60.30166)" ry="1.011026" width="2.022052" stroke="#00f" stroke-linecap="round" stroke-miterlimit="0" y="185.1983" x="-31.53185" height="2.026662" fill="#fff"/>
<rect stroke-linejoin="round" style="color:#000000" fill-rule="evenodd" fill-opacity=".3921569" transform="translate(710.5213 66)" height="3.970665" width="3.957493" stroke="#00f" stroke-linecap="round" stroke-miterlimit="0" y="186.5" x="-39.45749" stroke-width="1.0000004" fill="#6464ff"/>
</g>
</svg>
