<?xml version="1.0" encoding="UTF-8" standalone="no"?>
<svg xmlns:rdf="http://www.w3.org/1999/02/22-rdf-syntax-ns#" xmlns="http://www.w3.org/2000/svg" version="1.1" xmlns:cc="http://creativecommons.org/ns#" xmlns:xlink="http://www.w3.org/1999/xlink" viewBox="0 0 11.243656 10.883223" xmlns:dc="http://purl.org/dc/elements/1.1/">
<metadata>
<rdf:RDF>
<cc:Work rdf:about="">
<dc:format>image/svg+xml</dc:format>
<dc:type rdf:resource="http://purl.org/dc/dcmitype/StillImage"/>
</cc:Work>
</rdf:RDF>
</metadata>
<defs>
<linearGradient id="a" y2="214.7789" xlink:href="#b" gradientUnits="userSpaceOnUse" x2="13.52223" y1="209.9819" x1="5.644915"/>
<linearGradient id="b">
<stop stop-color="#d7d7d7" offset="0"/>
<stop offset="1"/>
</linearGradient>
</defs>
<g transform="translate(-491.91695 -360.04858)">
<g transform="matrix(.625904 0 0 .672041 489.1682 222.3273)" stroke="url(#a)">
<rect stroke-linejoin="round" height="2.959625" width="7.99868" stroke="url(#a)" stroke-miterlimit="0" y="211.5502" x="8.5083" stroke-width="1.5418689" fill="none"/>
</g>
<path d="m494.5 361.4977 6 8" stroke-opacity=".8469945" stroke="#3c3c3c" stroke-linecap="round" stroke-width="1.0000002px" fill="none"/>
<g transform="matrix(.689556 0 0 .507098 484.5653 256.2643)" stroke="#000">
<rect stroke-linejoin="round" height="2.011886" width="4.508889" stroke-miterlimit="0" y="205.5087" x="11.50698" stroke-width="1.691099" fill="none"/>
</g>
<g transform="matrix(.68797140 0 0 .51671613 491.56044 263.26565)" stroke="#000">
<rect stroke-linejoin="round" height="2.011886" width="4.508889" stroke-miterlimit="0" y="205.5087" x="11.50698" stroke-width="1.691099" fill="none"/>
</g>
</g>
</svg>
