<?xml version="1.0" encoding="UTF-8" standalone="no"?>
<svg xmlns:rdf="http://www.w3.org/1999/02/22-rdf-syntax-ns#" xmlns="http://www.w3.org/2000/svg" version="1.1" xmlns:cc="http://creativecommons.org/ns#" xmlns:xlink="http://www.w3.org/1999/xlink" viewBox="0 0 24 24" xmlns:dc="http://purl.org/dc/elements/1.1/">
<metadata>
<rdf:RDF>
<cc:Work rdf:about="">
<dc:format>image/svg+xml</dc:format>
<dc:type rdf:resource="http://purl.org/dc/dcmitype/StillImage"/>
</cc:Work>
</rdf:RDF>
</metadata>
<defs>
<linearGradient id="a" y2="109.6067" gradientUnits="userSpaceOnUse" x2="-.9575" y1="94.60669" x1="-15.4575">
<stop stop-color="#8ab3df" offset="0"/>
<stop stop-color="#5eba69" offset="1"/>
</linearGradient>
</defs>
<g transform="translate(19.9575,-90.10669)">
<rect style="color:#000000" height="24" width="24" y="90.10669" x="-19.9575" fill="none"/>
<path stroke-linejoin="round" d="m-0.4575 109.6067c-3.5-7.5 4.5-7.5 0-15.00001-7.5 4.5-7.5-3.5-15 0 4.5 7.50001-3.5 7.50001 0 15.00001 7.5-3.5 7.5 4.5 15 0z" stroke="#3c3c3c" stroke-linecap="round" stroke-width="1px" fill="url(#a)"/>
<rect height="4" width="4" stroke="#000" y="92.60669" x="-17.4575" fill="#fff"/>
<rect stroke-linejoin="round" style="color:#000000" fill-rule="evenodd" transform="matrix(1 0 0 .99644 13.7166 13.06755)" height="4.01786" width="4.0099" stroke="#000" stroke-linecap="round" stroke-miterlimit="0" y="94.8769" x="-16.184" fill="#fff"/>
<rect stroke-linejoin="round" style="color:#000000" fill-rule="evenodd" transform="matrix(1 0 0 .99644 13.7265 -1.932448)" height="4.01786" width="4.0099" stroke="#000" stroke-linecap="round" stroke-miterlimit="0" y="94.8769" x="-16.184" fill="#fff"/>
<rect stroke-linejoin="round" style="color:#000000" fill-rule="evenodd" transform="matrix(1 0 0 .99644 -1.2735 13.06755)" height="4.01786" width="4.0099" stroke="#000" stroke-linecap="round" stroke-miterlimit="0" y="94.8769" x="-16.184" fill="#fff"/>
</g>
</svg>
