482230 632940 509
37856 3797 324
750947 52539 509
262983 604607 470
936218 740558 525
850817 604658 525
322854 632549 509
243411 1671 443
543397 77920 470
554997 103966 470
731556 422877 509
509856 620193 470
873987 65900 525
287965 821737 509
703880 952620 525
485695 604722 470
334062 429129 449
672571 671550 367
431192 40357 449
330763 764937 509
492949 995591 525
399672 303057 441
395095 432960 449
480894 130982 449
436260 897327 525
106606 610687 470
405509 831223 509
13172 503404 449
870864 901333 445
286004 783566 509
543839 25025 470
73310 632112 509
702596 357926 509
333537 174924 443
578943 488771 470
552952 605634 434
960436 850021 507
720595 869756 525
357850 894035 525
283851 815302 509
404292 924933 525
612040 120925 470
932452 25795 525
986721 833837 525
61541 266064 443
242886 990836 525
435677 452448 400
832840 70437 509
777958 29657 509
939350 554482 525
723968 531478 509
103149 183932 383
871004 836692 525
661400 870846 525
868052 496716 525
355899 120033 443
282613 965559 525
185078 542776 470
865286 500331 525
402273 765171 509
984354 914178 507
438859 723297 509
903957 852325 445
562466 972986 525
629035 599174 509
858922 406105 525
937342 901858 476
811608 166346 509
371196 856887 525
650950 690668 442
486914 566679 470
619073 286635 470
598365 507699 470
64796 138895 354
319437 565065 470
395066 901194 525
226117 696997 509
309809 937918 525
635306 828790 504
73839 416422 449
140505 458235 449
945590 60154 525
115394 572110 470
448393 450691 387
145813 990018 525
657647 892584 525
133999 657984 509
345166 933912 525
92678 305688 443
616355 226808 470
179952 491843 449
617679 334793 470
455339 814843 509
727085 424092 509
411820 654287 509
447831 893535 525
100480 119961 354
112774 534812 470
944140 449765 525
964468 534042 525
733906 217268 509
385258 97338 443
107487 104169 354
322892 12846 443
569671 975785 525
302084 765944 509
925863 617291 525
137177 550008 470
934109 396147 525
957849 862996 507
871125 290571 525
977234 110152 525
138368 28466 354
449638 48141 449
13239 949540 525
235643 881796 525
202714 34503 383
116840 362795 443
958415 389944 525
478128 594354 470
236264 524035 470
377446 918098 525
199829 260620 443
878205 385549 525
393997 96538 443
96419 50957 351
919451 746325 525
956766 634206 525
273207 907505 525
881308 516624 525
166000 8188 383
304923 817756 509
407355 173493 443
221639 697916 509
94462 20602 351
623639 941963 525
394286 114588 443
244953 950409 525
584978 986874 525
218341 256570 443
308156 231746 407
330232 341141 366
19461 645227 509
845206 140745 525
6017 680161 509
853268 582523 525
226026 247867 443
273595 718873 509
99493 680182 509
979564 577476 525
461656 736050 509
533981 605364 452
38544 504712 449
730516 938707 525
632815 293852 509
721574 227852 509
369820 587630 470
420891 955605 525
994396 202038 525
94111 741079 509
132601 268425 443
930200 479357 525
334157 207597 443
294052 310022 371
929292 822364 525
924337 393973 525
41489 485510 449
627419 138822 509
339632 654061 509
967918 353442 525
44941 999937 525
167997 590171 470
678231 964005 525
815141 688959 504
670983 418501 509
495977 614529 470
349729 636480 509
865767 833772 525
644672 495866 509
347341 589921 470
384253 97425 443
933044 993346 507
374131 256430 441
804382 18300 509
852289 400899 525
835043 815864 450
263507 689874 509
163358 248882 443
688977 210060 509
71064 62616 330
738490 50408 509
373882 684603 509
784048 246293 509
54985 911666 525
562488 721547 509
549473 973097 525
949538 678977 525
42759 116429 354
492587 755974 509
287274 910866 525
706851 335778 509
789230 387493 509
562834 455382 470
171716 443422 449
415327 909745 525
225451 633695 509
182425 452286 449
667038 744263 504
242728 813936 509
910433 499460 525
912609 335578 525
966528 658599 525
77857 544313 470
368876 618456 470
849072 963620 507
247627 403040 441
838777 545202 525
22346 807787 509
114506 403134 443
943180 487296 525
365772 66713 443
408810 73899 443
910508 455084 525
815216 373585 509
898676 97170 525
655076 702351 442
710925 273145 509
296140 311555 371
455243 745577 509
465852 559395 470
655567 676746 442
410563 473362 444
850568 579789 525
615302 552064 447
430599 13937 449
514077 786873 509
776974 26741 509
431062 503576 444
354757 704786 509
591536 952001 525
353521 638539 509
634053 309805 509
59837 345463 443
922298 392268 525
628458 794149 504
470264 795232 509
1 1 1
7 2 17
19 19 21
3 4 8
4 3 8
