869565 764263
499249 588048
743346 447419
560570 894707
998808 306891
565933 540134
792188 740046
913538 469751
28723 522982
72464 565910
867791 365759
427966 221746
921090 308025
91159 714812
71662 312016
110942 643411
494243 624717
12824 148220
775177 692099
837188 997659
389830 722242
358488 129666
874571 226758
924955 680187
695904 338463
293732 926684
498015 179652
424979 382893
100110 716543
375397 859933
520717 224491
279827 9
150090 507398
417140 545233
801025 914982
765647 460024
955704 117110
234613 750428
835026 198994
966441 352058
522147 600536
410292 663135
140722 561245
619535 819509
462931 638791
946894 308860
314013 168442
598141 969458
915356 572858
565564 245563
427623 673700
802874 831402
783201 323271
910867 501127
105441 261691
38283 834614
758592 384810
188403 230368
266630 871590
515187 31046
621759 911557
816028 49939
472258 578822
215736 246473
437330 133060
40791 321388
131282 439332
143448 746910
716665 462487
863989 176127
233728 767892
326643 51125
574488 885548
742633 220609
715148 611914
831661 593340
430535 672643
479960 592000
17035 138263
84155 932423
387548 139154
364392 188253
555037 282060
39441 97376
749369 871581
374524 357636
72670 836954
799018 891088
744866 428976
602257 343841
812663 509754
967206 820275
638526 746442
41021 943948
206128 836963
105276 98022
732866 170101
662596 187173
561623 344995
243940 18269
7807 855180
320932 464824
722177 916734
675175 604457
926170 626659
788839 67799
693250 89901
56755 343266
913778 486463
69289 864001
103895 8935
947473 928578
972107 555183
674419 271995
284351 702967
292868 847715
210326 30317
401913 418963
619147 592202
195631 344046
206094 369522
831180 863878
651190 354185
102516 255211
171387 374525
537785 674330
462322 839434
904843 742260
250900 393184
229636 123252
124788 805135
917999 408132
290081 958088
516930 774216
617361 604940
475068 645390
222712 781577
56918 62086
703511 804954
288996 457342
811729 993081
488768 716908
456176 198434
189911 332677
630947 160
608748 450046
917562 366742
418731 764865
913616 892653
816939 677521
336095 695314
316669 963472
476626 915831
854603 524983
35724 309418
571838 138711
919346 146942
875742 794299
83773 464840
567918 571255
96861 920714
91210 692943
294161 378926
709537 756476
375149 657623
774725 748162
667811 22690
30741 863428
628220 454802
656590 428314
996937 375789
13112 701617
371770 540255
335270 596670
663883 223420
869761 158988
415398 936017
273341 630367
986533 110753
141102 819401
626769 648367
908444 921767
166508 87008
590384 92016
905534 892597
782778 268874
613700 571220
114983 382919
730143 514613
287075 767079
520682 219848
61249 649811
586533 608756
17122 169729
133743 142255
2669 913411
506045 855570
181731 772902
519500 475879
29059 820373
745327 743489
457631 237237
260168 234668
676094 274405
808024 580135
750874 341443
583414 896275
679917 838361
620555 195509
165515 521926
887306 112256
647803 771266
468152 812056
