906376 656524 525
540438 815444 509
511558 582512 470
838226 407520 525
234832 710164 509
741119 734764 424
745369 621576 509
263645 994427 525
160629 171301 352
463760 695585 509
467770 923268 525
613166 745766 509
561387 55917 470
560490 517959 452
245256 281253 407
182896 798952 509
855832 333451 525
914673 630613 525
192504 709724 509
386108 679974 509
267020 262033 407
42437 251696 443
581081 745617 509
961720 731804 525
251946 649524 509
881829 571882 525
87654 193268 383
336965 250221 407
22078 620657 470
934010 763322 525
408468 258270 441
279298 371353 441
831581 218320 509
492020 675707 509
147612 980396 525
675399 683354 385
256580 999935 525
72409 309994 443
985546 157086 525
290523 95765 443
242745 625312 470
67225 384247 443
448512 235604 449
905657 866205 445
738140 849849 525
502264 40984 449
915498 494155 525
157646 754251 509
38353 713803 509
188346 538911 470
469610 754595 509
183826 897909 525
122218 577303 470
75550 212323 383
175798 785645 509
695552 452419 509
750534 849268 525
640208 395164 509
805359 667799 504
580263 260990 470
651028 582155 509
108924 11291 354
171040 874059 525
288876 849691 525
428700 489802 444
855670 988444 507
648532 52125 509
656657 465356 509
513913 342811 470
562616 646673 509
374001 268255 441
94462 451724 449
775555 534366 509
584355 215488 470
899871 823755 525
244344 271820 407
830945 916428 525
317606 547552 470
286240 152435 443
589934 59072 470
648656 111243 509
469636 180028 449
575298 106192 470
805830 525417 509
953373 417990 525
495984 599425 470
835013 544657 509
105354 904543 525
786232 122658 509
205466 581527 470
760337 569690 509
445666 468853 444
697311 561616 509
222850 505295 449
127515 943446 525
236227 883940 525
295271 591147 470
20778 750143 509
874724 807914 525
522853 823877 509
37952 165852 383
793513 773890 437
184145 898198 525
799127 987233 525
921757 803130 525
590849 163746 470
315581 755016 509
549400 57199 470
488954 564827 470
976784 378808 525
296983 673610 509
613271 482401 470
778247 427657 509
22888 412226 449
333394 45234 443
250573 155262 443
25789 667238 509
828958 402923 509
975986 242082 525
668708 358307 509
868760 848043 419
570645 471410 470
332350 408207 441
682416 445663 509
785280 362844 509
480592 420746 444
587394 294993 470
264495 400089 441
685314 619721 509
133418 689183 509
697611 155089 509
855510 497080 525
926687 264697 525
282135 666310 509
294089 249942 407
416872 122114 449
936459 265133 525
916630 443290 525
994410 369967 525
741597 797701 468
394705 77355 443
146217 562921 470
934597 165601 525
120145 657625 509
278825 99134 443
50759 295992 443
519613 186530 470
600179 774004 509
191369 987456 525
388878 860462 525
964089 778280 525
987375 346243 525
983755 75513 525
30421 207264 383
396181 10795 443
687067 845681 525
4739 953254 525
17318 49079 324
915657 830429 525
970397 96986 525
664655 603977 509
765415 360459 509
521991 751289 509
213227 333379 443
162128 920066 525
71491 206430 383
248483 926010 525
935124 299266 525
565446 400856 470
585526 684738 509
367935 670932 509
917038 100016 525
217422 815725 509
312093 418837 449
968762 135522 525
589014 398079 470
417181 922296 525
100293 862425 525
402445 725239 509
558009 474136 470
824903 99096 509
568820 627884 509
816802 214213 509
41184 296236 443
627505 75472 509
610145 184902 470
225012 775551 509
761304 226070 509
770552 176521 509
723689 926860 525
217105 381819 443
908747 370525 525
484570 551986 470
940972 133671 525
242978 584955 470
232787 159832 443
443856 679367 509
518660 620679 452
411943 23952 449
579469 964819 525
453167 307037 449
765248 837477 468
411612 55541 449
482961 454805 444
314247 39840 443
561956 984041 525
692920 224240 509
755162 222372 509
330773 665936 509
687588 238058 509
441221 282735 449
267821 878124 525
392445 356599 436
787778 291849 509
829728 608593 509
998112 623046 525
534513 321417 470
766953 402181 509
239003 121095 443
745512 652669 504
956579 836695 525
451027 700420 509
777314 372605 509
285636 425113 449
178024 370643 443
31862 749928 509
752433 708527 424
410396 906815 525
992633 415293 525
8229 519344 470
396389 272306 441
71354 279562 443
178713 195180 365
943550 332512 525
575804 888691 525
922970 94571 525
945966 484437 525
977126 558361 525
562642 705164 509
278324 766257 509
571323 340278 470
451328 149755 449
656994 165623 509
234717 331884 407
518027 702593 509
679765 322678 509
911352 366132 525
554131 831490 509
965489 399470 525
