%YAML 1.1
%TAG !u! tag:unity3d.com,2011:
--- !u!114 &11400000
MonoBehaviour:
  m_ObjectHideFlags: 0
  m_CorrespondingSourceObject: {fileID: 0}
  m_PrefabInstance: {fileID: 0}
  m_PrefabAsset: {fileID: 0}
  m_GameObject: {fileID: 0}
  m_Enabled: 1
  m_EditorHideFlags: 0
  m_Script: {fileID: 11500000, guid: df6aa7087dfe34d22bf5a5d675e91a2f, type: 3}
  m_Name: Scraps
  m_EditorClassIdentifier: 
  defaultValue: 25
  icon: {fileID: 21300000, guid: 6f57b9723ca5f4141977c701608110f5, type: 3}
