%YAML 1.1
%TAG !u! tag:unity3d.com,2011:
--- !u!1045 &1
EditorBuildSettings:
  m_ObjectHideFlags: 0
  serializedVersion: 2
  m_Scenes:
  - enabled: 1
    path: Assets/_Project/Scenes/MainMenu.unity
    guid: 9b45499f2aa894ea6a6545a3734407b8
  - enabled: 1
    path: Assets/_Project/Scenes/Level.unity
    guid: dd96babb856284b00a2659b3ccbb3d0c
  m_configObjects: {}
