%YAML 1.1
%TAG !u! tag:unity3d.com,2011:
--- !u!114 &11400000
MonoBehaviour:
  m_ObjectHideFlags: 0
  m_CorrespondingSourceObject: {fileID: 0}
  m_PrefabInstance: {fileID: 0}
  m_PrefabAsset: {fileID: 0}
  m_GameObject: {fileID: 0}
  m_Enabled: 1
  m_EditorHideFlags: 0
  m_Script: {fileID: 11500000, guid: 9f795cbeb837451dbc94a2e1c88e560d, type: 3}
  m_Name: MageAttack
  m_EditorClassIdentifier: 
  collection:
  - {fileID: 8300000, guid: af3b3488b6662314cb6bc5a68c6dab9e, type: 3}
  - {fileID: 8300000, guid: 1f1a11fed29b89944a5ab45ff922f86b, type: 3}
