%YAML 1.1
%TAG !u! tag:unity3d.com,2011:
--- !u!114 &11400000
MonoBehaviour:
  m_ObjectHideFlags: 0
  m_CorrespondingSourceObject: {fileID: 0}
  m_PrefabInstance: {fileID: 0}
  m_PrefabAsset: {fileID: 0}
  m_GameObject: {fileID: 0}
  m_Enabled: 1
  m_EditorHideFlags: 0
  m_Script: {fileID: 11500000, guid: 9f795cbeb837451dbc94a2e1c88e560d, type: 3}
  m_Name: goblinNoises
  m_EditorClassIdentifier: 
  collection:
  - {fileID: 8300000, guid: 7ad211d86fd0b3143b70f5e686478adf, type: 3}
  - {fileID: 8300000, guid: ee8cb876060f331439e3a7e71b3d8a03, type: 3}
  - {fileID: 8300000, guid: 45149e66ff72a0b489e91f3d644602a1, type: 3}
  - {fileID: 8300000, guid: d121dcabe32287443b82e1ebd1cc61a6, type: 3}
  - {fileID: 8300000, guid: badb74b06b6c1e848b842b8b9e37afa7, type: 3}
  - {fileID: 8300000, guid: bed3f0b9c0f45e34e9866e92b83ff2b5, type: 3}
  - {fileID: 8300000, guid: 0c072f3568a997740a2c5318f5e5b851, type: 3}
