%YAML 1.1
%TAG !u! tag:unity3d.com,2011:
--- !u!114 &11400000
MonoBehaviour:
  m_ObjectHideFlags: 0
  m_CorrespondingSourceObject: {fileID: 0}
  m_PrefabInstance: {fileID: 0}
  m_PrefabAsset: {fileID: 0}
  m_GameObject: {fileID: 0}
  m_Enabled: 1
  m_EditorHideFlags: 0
  m_Script: {fileID: 11500000, guid: 981ad601a9c0b4de083ba410963c0078, type: 3}
  m_Name: Day2Dialog
  m_EditorClassIdentifier: 
  speaker: {fileID: 11400000, guid: 1117574b8fb9848778d4caaa1f76898b, type: 2}
  _dialogue:
  - You probably already noticed that the heroes are getting stronger huh?
  - Right now they might be easy to handle but who knows how long that lasts.
  - If you want some extra money tho u can click on the dungeon core to lure more
    heroes with money.
  - But be careful if they reach the core while u have money in the treasury they
    will steal a bunch of it.
  _playOnce: 1
