%YAML 1.1
%TAG !u! tag:unity3d.com,2011:
--- !u!114 &11400000
MonoBehaviour:
  m_ObjectHideFlags: 0
  m_CorrespondingSourceObject: {fileID: 0}
  m_PrefabInstance: {fileID: 0}
  m_PrefabAsset: {fileID: 0}
  m_GameObject: {fileID: 0}
  m_Enabled: 1
  m_EditorHideFlags: 0
  m_Script: {fileID: 11500000, guid: c962e451076524821916ab7ba3b631d4, type: 3}
  m_Name: Dirt
  m_EditorClassIdentifier: 
  prefab: {fileID: 7559967165967771386, guid: dea5a552519e14ead922971f7b78826a, type: 3}
  color: {r: 1, g: 0, b: 0, a: 1}
  heightLevel: 1
  destroyable: 1
  oneOpen: {fileID: 2800000, guid: 8acfdea16f18842d38fb9355fab27836, type: 3}
  streetOpen: {fileID: 2800000, guid: 15e9e4f451e33449fa5fc8944b0c8468, type: 3}
  cornerOpen: {fileID: 2800000, guid: 41ed8369114c541eb987639e7936256f, type: 3}
  threeOpen: {fileID: 2800000, guid: e4ea8450ce894421080e60508dad5ce1, type: 3}
  fourOpen: {fileID: 2800000, guid: 5719e0b1aa6fb4837bde0b5693ddd883, type: 3}
  zeroOpen: {fileID: 2800000, guid: cd720dbc927b34720a8f8678c784b206, type: 3}
