%YAML 1.1
%TAG !u! tag:unity3d.com,2011:
--- !u!114 &11400000
MonoBehaviour:
  m_ObjectHideFlags: 0
  m_CorrespondingSourceObject: {fileID: 0}
  m_PrefabInstance: {fileID: 0}
  m_PrefabAsset: {fileID: 0}
  m_GameObject: {fileID: 0}
  m_Enabled: 1
  m_EditorHideFlags: 0
  m_Script: {fileID: 11500000, guid: 0e9ccf1a7f70044339a9912b0a0f43b7, type: 3}
  m_Name: Warrior
  m_EditorClassIdentifier: 
  _heroClassName: Warrior
  _icon: {fileID: 21300000, guid: 69c177349533f0d48ace6fe30a715c6b, type: 3}
  _prefab: {fileID: 2465277178116337524, guid: 3dad2e91dbd2e4d818dd519ab0b60d18, type: 3}
  _heroColor: {r: 0.8962264, g: 0.47822535, b: 0.097232126, a: 1}
  stats:
  - range:
      _rangeType: 1
      _range: {x: 35, y: 45}
    per: 1
    value: 3
  - range:
      _rangeType: 2
      _range: {x: 9, y: 13}
    per: 1
    value: 3
  - range:
      _rangeType: 4
      _range: {x: 100, y: 100}
    per: 1
    value: 0
  - range:
      _rangeType: 8
      _range: {x: 20, y: 20}
    per: 1
    value: 0
  - range:
      _rangeType: 16
      _range: {x: 18, y: 18}
    per: 1
    value: 0
  - range:
      _rangeType: 32
      _range: {x: 80, y: 80}
    per: 1
    value: 0
  capacity:
  - range:
      _rangeType: {fileID: 11400000, guid: ee5ac6593c36e46a48d2345b8e7745a7, type: 2}
      _range: {x: 7, y: 15}
    per: 1
    value: 0
  - range:
      _rangeType: {fileID: 11400000, guid: 624deb270978746deb5354ee953e35dd, type: 2}
      _range: {x: 15, y: 25}
    per: 1
    value: 10
  drops:
  - range:
      _rangeType: {fileID: 11400000, guid: 0125d354a48d1485ca6622adc2f9cb0c, type: 2}
      _range: {x: 5, y: 10}
    per: 1
    value: 2
  - range:
      _rangeType: {fileID: 11400000, guid: 82f9204b8f1b845fb87407195747d720, type: 2}
      _range: {x: 10, y: 20}
    per: 1
    value: 8
