%YAML 1.1
%TAG !u! tag:unity3d.com,2011:
--- !u!114 &11400000
MonoBehaviour:
  m_ObjectHideFlags: 0
  m_CorrespondingSourceObject: {fileID: 0}
  m_PrefabInstance: {fileID: 0}
  m_PrefabAsset: {fileID: 0}
  m_GameObject: {fileID: 0}
  m_Enabled: 1
  m_EditorHideFlags: 0
  m_Script: {fileID: 11500000, guid: 981ad601a9c0b4de083ba410963c0078, type: 3}
  m_Name: TestDialogue2
  m_EditorClassIdentifier: 
  speaker: {fileID: 11400000, guid: ca618f78c5fd54a8d884b35bb59282fe, type: 2}
  _dialogue:
  - 'Mein Name ist ...

    Ich bin...'
  - JAnsdkwjnefkwef
  - 'askndkwejnf.

    Ich hasse Rosenkohl.'
  _playOnce: 1
