%YAML 1.1
%TAG !u! tag:unity3d.com,2011:
--- !u!114 &11400000
MonoBehaviour:
  m_ObjectHideFlags: 0
  m_CorrespondingSourceObject: {fileID: 0}
  m_PrefabInstance: {fileID: 0}
  m_PrefabAsset: {fileID: 0}
  m_GameObject: {fileID: 0}
  m_Enabled: 1
  m_EditorHideFlags: 0
  m_Script: {fileID: 11500000, guid: c962e451076524821916ab7ba3b631d4, type: 3}
  m_Name: DungeonWall
  m_EditorClassIdentifier: 
  prefab: {fileID: 2941111926892032254, guid: cbf0e1905c9ba4ac393c1241334ce1a2, type: 3}
  color: {r: 0, g: 0, b: 0, a: 0}
  heightLevel: 1
  tileBeneath: {fileID: 0}
