%YAML 1.1
%TAG !u! tag:unity3d.com,2011:
--- !u!114 &11400000
MonoBehaviour:
  m_ObjectHideFlags: 0
  m_CorrespondingSourceObject: {fileID: 0}
  m_PrefabInstance: {fileID: 0}
  m_PrefabAsset: {fileID: 0}
  m_GameObject: {fileID: 0}
  m_Enabled: 1
  m_EditorHideFlags: 0
  m_Script: {fileID: 11500000, guid: 268098e45e654256ba080d3c1d1a65d8, type: 3}
  m_Name: StrategyStateEnter
  m_EditorClassIdentifier: 
  raised:
    m_PersistentCalls:
      m_Calls:
      - m_Target: {fileID: 11400000, guid: f8514500e3eb54478a4ff82f6b5b6a72, type: 2}
        m_TargetAssemblyTypeName: Heroes.Probabilities.ProbabilityCalculator, Assembly-CSharp
        m_MethodName: CalculateProbability
        m_Mode: 1
        m_Arguments:
          m_ObjectArgument: {fileID: 0}
          m_ObjectArgumentAssemblyTypeName: UnityEngine.Object, UnityEngine
          m_IntArgument: 0
          m_FloatArgument: 0
          m_StringArgument: 
          m_BoolArgument: 0
        m_CallState: 2
      - m_Target: {fileID: 11400000, guid: 95efd34be583d498c9cf1de41b771717, type: 2}
        m_TargetAssemblyTypeName: Heroes.ScriptableObjects.RuntimeSets.PlacedBuildingsSet,
          Assembly-CSharp
        m_MethodName: RepairAll
        m_Mode: 1
        m_Arguments:
          m_ObjectArgument: {fileID: 0}
          m_ObjectArgumentAssemblyTypeName: UnityEngine.Object, UnityEngine
          m_IntArgument: 0
          m_FloatArgument: 0
          m_StringArgument: 
          m_BoolArgument: 0
        m_CallState: 2
