%YAML 1.1
%TAG !u! tag:unity3d.com,2011:
--- !u!114 &11400000
MonoBehaviour:
  m_ObjectHideFlags: 0
  m_CorrespondingSourceObject: {fileID: 0}
  m_PrefabInstance: {fileID: 0}
  m_PrefabAsset: {fileID: 0}
  m_GameObject: {fileID: 0}
  m_Enabled: 1
  m_EditorHideFlags: 0
  m_Script: {fileID: 11500000, guid: 7eb7a7f93d1a346a99b1f74df5ccba48, type: 3}
  m_Name: WarriorDamage
  m_EditorClassIdentifier: 
  _speechBubbles:
  - That does nothing to me
  - Ahhh
  - Haha
  - I need to go to the toilet
  - I need healing
  - Who knew being impaled would feel this good
  - This game sucks
  - Why do we have not a single healer in this party
  - 'My axe is sharpened '
  - Its cold I wish i had a shirt
  - 'The leatherbelts keep rubbing my nipples

    I kinda like it tho'
  - 'We need to hurry

    mom says its past my bedtime'
  - Always skip leg day
  - My arms are the size of your head
  - Ouch my knee
