%YAML 1.1
%TAG !u! tag:unity3d.com,2011:
--- !u!21 &2100000
Material:
  serializedVersion: 6
  m_ObjectHideFlags: 0
  m_CorrespondingSourceObject: {fileID: 0}
  m_PrefabInstance: {fileID: 0}
  m_PrefabAsset: {fileID: 0}
  m_Name: DungeonWallV3
  m_Shader: {fileID: -6465566751694194690, guid: 880da22d1f3bd41a3bc584b3fde64687, type: 3}
  m_ShaderKeywords: 
  m_LightmapFlags: 4
  m_EnableInstancingVariants: 0
  m_DoubleSidedGI: 0
  m_CustomRenderQueue: -1
  stringTagMap: {}
  disabledShaderPasses: []
  m_SavedProperties:
    serializedVersion: 3
    m_TexEnvs:
    - Texture2D_6cbf42402a194e2197f92989ea3ab16e:
        m_Texture: {fileID: 2800000, guid: d7cc565be99a44de5a590daf09dea8d3, type: 3}
        m_Scale: {x: 1, y: 1}
        m_Offset: {x: 0, y: 0}
    - Texture2D_ba5409383c4f4b48a64302a7d837f313:
        m_Texture: {fileID: 2800000, guid: b680d05d75e1c4343b3e15fe72b61ec3, type: 3}
        m_Scale: {x: 1, y: 1}
        m_Offset: {x: 0, y: 0}
    - unity_Lightmaps:
        m_Texture: {fileID: 0}
        m_Scale: {x: 1, y: 1}
        m_Offset: {x: 0, y: 0}
    - unity_LightmapsInd:
        m_Texture: {fileID: 0}
        m_Scale: {x: 1, y: 1}
        m_Offset: {x: 0, y: 0}
    - unity_ShadowMasks:
        m_Texture: {fileID: 0}
        m_Scale: {x: 1, y: 1}
        m_Offset: {x: 0, y: 0}
    m_Floats:
    - Boolean_225baf4507de4605b851bc312758aa15: 1
    - Vector1_393a641d6783402982a6aae2262cc9a6: 0
    - _Saturation: 0
    m_Colors:
    - _BaseColor: {r: 1, g: 1, b: 1, a: 0}
    - _TopColor: {r: 0, g: 0, b: 0, a: 1}
    - _TopOffset: {r: -0.25, g: -0.125, b: 0, a: 0}
    - _TopSite: {r: 0.25, g: 0.25, b: 0, a: 0}
    - _TopSize: {r: 0.25, g: 0.25, b: 0, a: 0}
  m_BuildTextureStacks: []
