%YAML 1.1
%TAG !u! tag:unity3d.com,2011:
--- !u!114 &11400000
MonoBehaviour:
  m_ObjectHideFlags: 0
  m_CorrespondingSourceObject: {fileID: 0}
  m_PrefabInstance: {fileID: 0}
  m_PrefabAsset: {fileID: 0}
  m_GameObject: {fileID: 0}
  m_Enabled: 1
  m_EditorHideFlags: 0
  m_Script: {fileID: 11500000, guid: 9f795cbeb837451dbc94a2e1c88e560d, type: 3}
  m_Name: WarriorFootsteps
  m_EditorClassIdentifier: 
  collection:
  - {fileID: 8300000, guid: fa9af985eff87f248bd969a98a11ad7a, type: 3}
  - {fileID: 8300000, guid: ccea916bac75adc45b15db430865ae6e, type: 3}
  - {fileID: 8300000, guid: a56ccf1d802ef0f4e886ef2ee52bf175, type: 3}
  - {fileID: 8300000, guid: 20884a01fbc78aa40a9c252e8bcd752a, type: 3}
