%YAML 1.1
%TAG !u! tag:unity3d.com,2011:
--- !u!114 &11400000
MonoBehaviour:
  m_ObjectHideFlags: 0
  m_CorrespondingSourceObject: {fileID: 0}
  m_PrefabInstance: {fileID: 0}
  m_PrefabAsset: {fileID: 0}
  m_GameObject: {fileID: 0}
  m_Enabled: 1
  m_EditorHideFlags: 0
  m_Script: {fileID: 11500000, guid: c962e451076524821916ab7ba3b631d4, type: 3}
  m_Name: Core
  m_EditorClassIdentifier: 
  prefab: {fileID: 7192321922853593345, guid: 2764511a87eb04fe0ab59d709c29d10f, type: 3}
  color: {r: 1, g: 1, b: 0, a: 1}
  heightLevel: 1
  tileBeneath: {fileID: 1342633410532034921, guid: 44dec158886b44d309ca5f3aff6348ea, type: 3}
