%YAML 1.1
%TAG !u! tag:unity3d.com,2011:
--- !u!114 &11400000
MonoBehaviour:
  m_ObjectHideFlags: 0
  m_CorrespondingSourceObject: {fileID: 0}
  m_PrefabInstance: {fileID: 0}
  m_PrefabAsset: {fileID: 0}
  m_GameObject: {fileID: 0}
  m_Enabled: 1
  m_EditorHideFlags: 0
  m_Script: {fileID: 11500000, guid: df61e10b4e284ecfa156534762a4d088, type: 3}
  m_Name: MysticDungeon
  m_EditorClassIdentifier: 
  lightIntensity: 1.5
  lightColor: {r: 0.8666667, g: 0.2901961, b: 0.65882355, a: 1}
  lightRotation: {x: 15, y: 0, z: 0}
  difficulty:
    minHeroCount: 4
    heroCount:
    - source: {fileID: 11400000, guid: 624deb270978746deb5354ee953e35dd, type: 2}
      per: 75
      value: 1
    - source: {fileID: 11400000, guid: 87d85bb4bff5a4b118e41689526e3e96, type: 2}
      per: 3
      value: 1
    heroLevel:
    - source: {fileID: 11400000, guid: 87d85bb4bff5a4b118e41689526e3e96, type: 2}
      per: 1
      value: 1
    - source: {fileID: 11400000, guid: 87d85bb4bff5a4b118e41689526e3e96, type: 2}
      per: 5
      value: 2
    startingResources:
    - resourceValue: {fileID: 11400000, guid: 82f9204b8f1b845fb87407195747d720, type: 2}
      value: 200
    - resourceValue: {fileID: 11400000, guid: bd1697beabd614e939e1ed7bb3be717b, type: 2}
      value: 50
    - resourceValue: {fileID: 11400000, guid: 0125d354a48d1485ca6622adc2f9cb0c, type: 2}
      value: 50
    - resourceValue: {fileID: 11400000, guid: 624deb270978746deb5354ee953e35dd, type: 2}
      value: 0
    - resourceValue: {fileID: 11400000, guid: ee5ac6593c36e46a48d2345b8e7745a7, type: 2}
      value: 100
  texture: {fileID: 2800000, guid: 4db0bba7869c44740b2a1620ca323741, type: 3}
  defaultBlock: {fileID: 11400000, guid: 45bbde0c1132742068e9bf9b193e9229, type: 2}
  blocks:
  - {fileID: 11400000, guid: 92b87393c8b354894a858de8a7201927, type: 2}
  - {fileID: 11400000, guid: f8525de98222b48d0aa65513c1e1e166, type: 2}
  - {fileID: 11400000, guid: 45bbde0c1132742068e9bf9b193e9229, type: 2}
  - {fileID: 11400000, guid: 6261dbc125d314edb807e3017e0acdc1, type: 2}
  - {fileID: 11400000, guid: 3a8ac6864687249c7896119e858d2e19, type: 2}
  - {fileID: 11400000, guid: aa828abe07e2b48b183fce176a8540f1, type: 2}
