%YAML 1.1
%TAG !u! tag:unity3d.com,2011:
--- !u!114 &11400000
MonoBehaviour:
  m_ObjectHideFlags: 0
  m_CorrespondingSourceObject: {fileID: 0}
  m_PrefabInstance: {fileID: 0}
  m_PrefabAsset: {fileID: 0}
  m_GameObject: {fileID: 0}
  m_Enabled: 1
  m_EditorHideFlags: 0
  m_Script: {fileID: 11500000, guid: df6aa7087dfe34d22bf5a5d675e91a2f, type: 3}
  m_Name: Gold
  m_EditorClassIdentifier: 
  defaultValue: 100
  icon: {fileID: 21300000, guid: c9ab161e2c8ff19448ccd33b28bb1c4d, type: 3}
