%YAML 1.1
%TAG !u! tag:unity3d.com,2011:
--- !u!1 &1133158050748819404
GameObject:
  m_ObjectHideFlags: 0
  m_CorrespondingSourceObject: {fileID: 0}
  m_PrefabInstance: {fileID: 0}
  m_PrefabAsset: {fileID: 0}
  serializedVersion: 6
  m_Component:
  - component: {fileID: 1133158050748819392}
  - component: {fileID: 1133158050748819395}
  - component: {fileID: 1133158050748819394}
  m_Layer: 0
  m_Name: BuildModeController
  m_TagString: Untagged
  m_Icon: {fileID: 0}
  m_NavMeshLayer: 0
  m_StaticEditorFlags: 0
  m_IsActive: 1
--- !u!4 &1133158050748819392
Transform:
  m_ObjectHideFlags: 0
  m_CorrespondingSourceObject: {fileID: 0}
  m_PrefabInstance: {fileID: 0}
  m_PrefabAsset: {fileID: 0}
  m_GameObject: {fileID: 1133158050748819404}
  m_LocalRotation: {x: 0, y: 0, z: 0, w: 1}
  m_LocalPosition: {x: 0, y: 0, z: 0}
  m_LocalScale: {x: 1, y: 1, z: 1}
  m_Children: []
  m_Father: {fileID: 0}
  m_RootOrder: 0
  m_LocalEulerAnglesHint: {x: 0, y: 0, z: 0}
--- !u!114 &1133158050748819395
MonoBehaviour:
  m_ObjectHideFlags: 0
  m_CorrespondingSourceObject: {fileID: 0}
  m_PrefabInstance: {fileID: 0}
  m_PrefabAsset: {fileID: 0}
  m_GameObject: {fileID: 1133158050748819404}
  m_Enabled: 0
  m_EditorHideFlags: 0
  m_Script: {fileID: 11500000, guid: 878a3fcde45b4dce905e9dd8ba31ddad, type: 3}
  m_Name: 
  m_EditorClassIdentifier: 
  cam: {fileID: 0}
  gridLayerMask:
    serializedVersion: 2
    m_Bits: 2304
  floatingOffset: {x: 0, y: 2, z: 0}
  rotationIncrement: 60
  rotationEase: 8
  rotationDuration: 0.3
  positionDrag: 0.3
  wiggleScale: 10
  wiggleClamp: 20
  wiggleDrag: 0.3
  snappingDuration: 0.2
  snappingStyle: 26
--- !u!114 &1133158050748819394
MonoBehaviour:
  m_ObjectHideFlags: 0
  m_CorrespondingSourceObject: {fileID: 0}
  m_PrefabInstance: {fileID: 0}
  m_PrefabAsset: {fileID: 0}
  m_GameObject: {fileID: 1133158050748819404}
  m_Enabled: 1
  m_EditorHideFlags: 0
  m_Script: {fileID: 11500000, guid: 8292b24a84814b9c9ca812589a3746d8, type: 3}
  m_Name: 
  m_EditorClassIdentifier: 
