%YAML 1.1
%TAG !u! tag:unity3d.com,2011:
--- !u!114 &11400000
MonoBehaviour:
  m_ObjectHideFlags: 0
  m_CorrespondingSourceObject: {fileID: 0}
  m_PrefabInstance: {fileID: 0}
  m_PrefabAsset: {fileID: 0}
  m_GameObject: {fileID: 0}
  m_Enabled: 1
  m_EditorHideFlags: 0
  m_Script: {fileID: 11500000, guid: b95d16716c5040aeba0df34c8d9e35a7, type: 3}
  m_Name: EnemyWarrior
  m_EditorClassIdentifier: 
  description: 
  maxHealth: 140
  name: Enemy
  prefab: {fileID: 2825554289633462708, guid: 3fc9de295f95b884bacbff614af1a553, type: 3}
  icon: {fileID: 0}
  resourceCost:
    malisium: 0
    wood: 0
    stone: 0
  attackRange: 1
  attackRate: 1
  attackSound: {fileID: 0}
  attackType: 1
  damage: 20
  defense: 0
  dieSound: {fileID: 0}
  viewRange: 2
  walkingSound: {fileID: 0}
  walkSpeed: 1.8
  defaultMoveState: {fileID: 11400000, guid: 5dca7fc5a3fed18408f07f57a14d15aa, type: 2}
