%YAML 1.1
%TAG !u! tag:unity3d.com,2011:
--- !u!114 &11400000
MonoBehaviour:
  m_ObjectHideFlags: 0
  m_CorrespondingSourceObject: {fileID: 0}
  m_PrefabInstance: {fileID: 0}
  m_PrefabAsset: {fileID: 0}
  m_GameObject: {fileID: 0}
  m_Enabled: 1
  m_EditorHideFlags: 0
  m_Script: {fileID: 11500000, guid: ad8f717a953945e9bb09885a39670397, type: 3}
  m_Name: Level1_w3_g3_sp3
  m_EditorClassIdentifier: 
  spawnPointHelper: {fileID: 0}
  gatherPointHelper: {fileID: 0}
  spawnPoint: {x: 159.7, y: 0, z: 47}
  gatherPoint: {x: 144.9, y: 0, z: 61.2}
  randomDestinationRadius: 2
  unitPrefabs:
  - controller: {fileID: 3168013465331277277, guid: 3fc9de295f95b884bacbff614af1a553,
      type: 3}
    count: 11
  units: []
  unitStartState: {fileID: 11400000, guid: 5dca7fc5a3fed18408f07f57a14d15aa, type: 2}
  spawnPointColor: {r: 1, g: 0.92156863, b: 0.015686275, a: 1}
  gatherPointColor: {r: 0, g: 1, b: 0, a: 1}
