%YAML 1.1
%TAG !u! tag:unity3d.com,2011:
--- !u!114 &11400000
MonoBehaviour:
  m_ObjectHideFlags: 0
  m_CorrespondingSourceObject: {fileID: 0}
  m_PrefabInstance: {fileID: 0}
  m_PrefabAsset: {fileID: 0}
  m_GameObject: {fileID: 0}
  m_Enabled: 1
  m_EditorHideFlags: 0
  m_Script: {fileID: 11500000, guid: 5b68841ef5d48094ca568af082fff8cc, type: 3}
  m_Name: KeycodeNamesData
  m_EditorClassIdentifier: Assembly-CSharp:Kniblings.CustomInput:KeycodeNamesData
  serializationData:
    SerializedFormat: 2
    SerializedBytes: 
    ReferencedUnityObjects: []
    SerializedBytesString: 
    Prefab: {fileID: 0}
    PrefabModificationsReferencedUnityObjects: []
    PrefabModifications: []
    SerializationNodes:
    - Name: keyNames
      Entry: 7
      Data: 0|System.Collections.Generic.Dictionary`2[[UnityEngine.KeyCode, UnityEngine.CoreModule],[System.String,
        mscorlib]], mscorlib
    - Name: comparer
      Entry: 7
      Data: 1|System.Collections.Generic.EnumEqualityComparer`1[[UnityEngine.KeyCode,
        UnityEngine.CoreModule]], mscorlib
    - Name: 
      Entry: 12
      Data: 0
    - Name: 
      Entry: 13
      Data: 
    - Name: 
      Entry: 8
      Data: 
    - Name: 
      Entry: 12
      Data: 324
    - Name: 
      Entry: 7
      Data: 
    - Name: $k
      Entry: 3
      Data: 0
    - Name: $v
      Entry: 1
      Data: None
    - Name: 
      Entry: 8
      Data: 
    - Name: 
      Entry: 7
      Data: 
    - Name: $k
      Entry: 3
      Data: 8
    - Name: $v
      Entry: 1
      Data: Backspace
    - Name: 
      Entry: 8
      Data: 
    - Name: 
      Entry: 7
      Data: 
    - Name: $k
      Entry: 3
      Data: 9
    - Name: $v
      Entry: 1
      Data: Tab
    - Name: 
      Entry: 8
      Data: 
    - Name: 
      Entry: 7
      Data: 
    - Name: $k
      Entry: 3
      Data: 12
    - Name: $v
      Entry: 1
      Data: Clear
    - Name: 
      Entry: 8
      Data: 
    - Name: 
      Entry: 7
      Data: 
    - Name: $k
      Entry: 3
      Data: 13
    - Name: $v
      Entry: 1
      Data: Return
    - Name: 
      Entry: 8
      Data: 
    - Name: 
      Entry: 7
      Data: 
    - Name: $k
      Entry: 3
      Data: 19
    - Name: $v
      Entry: 1
      Data: Pause
    - Name: 
      Entry: 8
      Data: 
    - Name: 
      Entry: 7
      Data: 
    - Name: $k
      Entry: 3
      Data: 27
    - Name: $v
      Entry: 1
      Data: Escape
    - Name: 
      Entry: 8
      Data: 
    - Name: 
      Entry: 7
      Data: 
    - Name: $k
      Entry: 3
      Data: 32
    - Name: $v
      Entry: 1
      Data: Space
    - Name: 
      Entry: 8
      Data: 
    - Name: 
      Entry: 7
      Data: 
    - Name: $k
      Entry: 3
      Data: 33
    - Name: $v
      Entry: 1
      Data: Exclaim
    - Name: 
      Entry: 8
      Data: 
    - Name: 
      Entry: 7
      Data: 
    - Name: $k
      Entry: 3
      Data: 34
    - Name: $v
      Entry: 1
      Data: DoubleQuote
    - Name: 
      Entry: 8
      Data: 
    - Name: 
      Entry: 7
      Data: 
    - Name: $k
      Entry: 3
      Data: 35
    - Name: $v
      Entry: 1
      Data: Hash
    - Name: 
      Entry: 8
      Data: 
    - Name: 
      Entry: 7
      Data: 
    - Name: $k
      Entry: 3
      Data: 36
    - Name: $v
      Entry: 1
      Data: Dollar
    - Name: 
      Entry: 8
      Data: 
    - Name: 
      Entry: 7
      Data: 
    - Name: $k
      Entry: 3
      Data: 37
    - Name: $v
      Entry: 1
      Data: Percent
    - Name: 
      Entry: 8
      Data: 
    - Name: 
      Entry: 7
      Data: 
    - Name: $k
      Entry: 3
      Data: 38
    - Name: $v
      Entry: 1
      Data: Ampersand
    - Name: 
      Entry: 8
      Data: 
    - Name: 
      Entry: 7
      Data: 
    - Name: $k
      Entry: 3
      Data: 39
    - Name: $v
      Entry: 1
      Data: Quote
    - Name: 
      Entry: 8
      Data: 
    - Name: 
      Entry: 7
      Data: 
    - Name: $k
      Entry: 3
      Data: 40
    - Name: $v
      Entry: 1
      Data: LeftParen
    - Name: 
      Entry: 8
      Data: 
    - Name: 
      Entry: 7
      Data: 
    - Name: $k
      Entry: 3
      Data: 41
    - Name: $v
      Entry: 1
      Data: RightParen
    - Name: 
      Entry: 8
      Data: 
    - Name: 
      Entry: 7
      Data: 
    - Name: $k
      Entry: 3
      Data: 42
    - Name: $v
      Entry: 1
      Data: Asterisk
    - Name: 
      Entry: 8
      Data: 
    - Name: 
      Entry: 7
      Data: 
    - Name: $k
      Entry: 3
      Data: 43
    - Name: $v
      Entry: 1
      Data: Plus
    - Name: 
      Entry: 8
      Data: 
    - Name: 
      Entry: 7
      Data: 
    - Name: $k
      Entry: 3
      Data: 44
    - Name: $v
      Entry: 1
      Data: Comma
    - Name: 
      Entry: 8
      Data: 
    - Name: 
      Entry: 7
      Data: 
    - Name: $k
      Entry: 3
      Data: 45
    - Name: $v
      Entry: 1
      Data: Minus
    - Name: 
      Entry: 8
      Data: 
    - Name: 
      Entry: 7
      Data: 
    - Name: $k
      Entry: 3
      Data: 46
    - Name: $v
      Entry: 1
      Data: Period
    - Name: 
      Entry: 8
      Data: 
    - Name: 
      Entry: 7
      Data: 
    - Name: $k
      Entry: 3
      Data: 47
    - Name: $v
      Entry: 1
      Data: Slash
    - Name: 
      Entry: 8
      Data: 
    - Name: 
      Entry: 7
      Data: 
    - Name: $k
      Entry: 3
      Data: 48
    - Name: $v
      Entry: 1
      Data: Alpha0
    - Name: 
      Entry: 8
      Data: 
    - Name: 
      Entry: 7
      Data: 
    - Name: $k
      Entry: 3
      Data: 49
    - Name: $v
      Entry: 1
      Data: Alpha1
    - Name: 
      Entry: 8
      Data: 
    - Name: 
      Entry: 7
      Data: 
    - Name: $k
      Entry: 3
      Data: 50
    - Name: $v
      Entry: 1
      Data: Alpha2
    - Name: 
      Entry: 8
      Data: 
    - Name: 
      Entry: 7
      Data: 
    - Name: $k
      Entry: 3
      Data: 51
    - Name: $v
      Entry: 1
      Data: Alpha3
    - Name: 
      Entry: 8
      Data: 
    - Name: 
      Entry: 7
      Data: 
    - Name: $k
      Entry: 3
      Data: 52
    - Name: $v
      Entry: 1
      Data: Alpha4
    - Name: 
      Entry: 8
      Data: 
    - Name: 
      Entry: 7
      Data: 
    - Name: $k
      Entry: 3
      Data: 53
    - Name: $v
      Entry: 1
      Data: Alpha5
    - Name: 
      Entry: 8
      Data: 
    - Name: 
      Entry: 7
      Data: 
    - Name: $k
      Entry: 3
      Data: 54
    - Name: $v
      Entry: 1
      Data: Alpha6
    - Name: 
      Entry: 8
      Data: 
    - Name: 
      Entry: 7
      Data: 
    - Name: $k
      Entry: 3
      Data: 55
    - Name: $v
      Entry: 1
      Data: Alpha7
    - Name: 
      Entry: 8
      Data: 
    - Name: 
      Entry: 7
      Data: 
    - Name: $k
      Entry: 3
      Data: 56
    - Name: $v
      Entry: 1
      Data: Alpha8
    - Name: 
      Entry: 8
      Data: 
    - Name: 
      Entry: 7
      Data: 
    - Name: $k
      Entry: 3
      Data: 57
    - Name: $v
      Entry: 1
      Data: Alpha9
    - Name: 
      Entry: 8
      Data: 
    - Name: 
      Entry: 7
      Data: 
    - Name: $k
      Entry: 3
      Data: 58
    - Name: $v
      Entry: 1
      Data: Colon
    - Name: 
      Entry: 8
      Data: 
    - Name: 
      Entry: 7
      Data: 
    - Name: $k
      Entry: 3
      Data: 59
    - Name: $v
      Entry: 1
      Data: Semicolon
    - Name: 
      Entry: 8
      Data: 
    - Name: 
      Entry: 7
      Data: 
    - Name: $k
      Entry: 3
      Data: 60
    - Name: $v
      Entry: 1
      Data: Less
    - Name: 
      Entry: 8
      Data: 
    - Name: 
      Entry: 7
      Data: 
    - Name: $k
      Entry: 3
      Data: 61
    - Name: $v
      Entry: 1
      Data: Equals
    - Name: 
      Entry: 8
      Data: 
    - Name: 
      Entry: 7
      Data: 
    - Name: $k
      Entry: 3
      Data: 62
    - Name: $v
      Entry: 1
      Data: Greater
    - Name: 
      Entry: 8
      Data: 
    - Name: 
      Entry: 7
      Data: 
    - Name: $k
      Entry: 3
      Data: 63
    - Name: $v
      Entry: 1
      Data: Question
    - Name: 
      Entry: 8
      Data: 
    - Name: 
      Entry: 7
      Data: 
    - Name: $k
      Entry: 3
      Data: 64
    - Name: $v
      Entry: 1
      Data: At
    - Name: 
      Entry: 8
      Data: 
    - Name: 
      Entry: 7
      Data: 
    - Name: $k
      Entry: 3
      Data: 91
    - Name: $v
      Entry: 1
      Data: LeftBracket
    - Name: 
      Entry: 8
      Data: 
    - Name: 
      Entry: 7
      Data: 
    - Name: $k
      Entry: 3
      Data: 92
    - Name: $v
      Entry: 1
      Data: Backslash
    - Name: 
      Entry: 8
      Data: 
    - Name: 
      Entry: 7
      Data: 
    - Name: $k
      Entry: 3
      Data: 93
    - Name: $v
      Entry: 1
      Data: RightBracket
    - Name: 
      Entry: 8
      Data: 
    - Name: 
      Entry: 7
      Data: 
    - Name: $k
      Entry: 3
      Data: 94
    - Name: $v
      Entry: 1
      Data: Caret
    - Name: 
      Entry: 8
      Data: 
    - Name: 
      Entry: 7
      Data: 
    - Name: $k
      Entry: 3
      Data: 95
    - Name: $v
      Entry: 1
      Data: Underscore
    - Name: 
      Entry: 8
      Data: 
    - Name: 
      Entry: 7
      Data: 
    - Name: $k
      Entry: 3
      Data: 96
    - Name: $v
      Entry: 1
      Data: BackQuote
    - Name: 
      Entry: 8
      Data: 
    - Name: 
      Entry: 7
      Data: 
    - Name: $k
      Entry: 3
      Data: 97
    - Name: $v
      Entry: 1
      Data: A
    - Name: 
      Entry: 8
      Data: 
    - Name: 
      Entry: 7
      Data: 
    - Name: $k
      Entry: 3
      Data: 98
    - Name: $v
      Entry: 1
      Data: B
    - Name: 
      Entry: 8
      Data: 
    - Name: 
      Entry: 7
      Data: 
    - Name: $k
      Entry: 3
      Data: 99
    - Name: $v
      Entry: 1
      Data: C
    - Name: 
      Entry: 8
      Data: 
    - Name: 
      Entry: 7
      Data: 
    - Name: $k
      Entry: 3
      Data: 100
    - Name: $v
      Entry: 1
      Data: D
    - Name: 
      Entry: 8
      Data: 
    - Name: 
      Entry: 7
      Data: 
    - Name: $k
      Entry: 3
      Data: 101
    - Name: $v
      Entry: 1
      Data: E
    - Name: 
      Entry: 8
      Data: 
    - Name: 
      Entry: 7
      Data: 
    - Name: $k
      Entry: 3
      Data: 102
    - Name: $v
      Entry: 1
      Data: F
    - Name: 
      Entry: 8
      Data: 
    - Name: 
      Entry: 7
      Data: 
    - Name: $k
      Entry: 3
      Data: 103
    - Name: $v
      Entry: 1
      Data: G
    - Name: 
      Entry: 8
      Data: 
    - Name: 
      Entry: 7
      Data: 
    - Name: $k
      Entry: 3
      Data: 104
    - Name: $v
      Entry: 1
      Data: H
    - Name: 
      Entry: 8
      Data: 
    - Name: 
      Entry: 7
      Data: 
    - Name: $k
      Entry: 3
      Data: 105
    - Name: $v
      Entry: 1
      Data: I
    - Name: 
      Entry: 8
      Data: 
    - Name: 
      Entry: 7
      Data: 
    - Name: $k
      Entry: 3
      Data: 106
    - Name: $v
      Entry: 1
      Data: J
    - Name: 
      Entry: 8
      Data: 
    - Name: 
      Entry: 7
      Data: 
    - Name: $k
      Entry: 3
      Data: 107
    - Name: $v
      Entry: 1
      Data: K
    - Name: 
      Entry: 8
      Data: 
    - Name: 
      Entry: 7
      Data: 
    - Name: $k
      Entry: 3
      Data: 108
    - Name: $v
      Entry: 1
      Data: L
    - Name: 
      Entry: 8
      Data: 
    - Name: 
      Entry: 7
      Data: 
    - Name: $k
      Entry: 3
      Data: 109
    - Name: $v
      Entry: 1
      Data: M
    - Name: 
      Entry: 8
      Data: 
    - Name: 
      Entry: 7
      Data: 
    - Name: $k
      Entry: 3
      Data: 110
    - Name: $v
      Entry: 1
      Data: N
    - Name: 
      Entry: 8
      Data: 
    - Name: 
      Entry: 7
      Data: 
    - Name: $k
      Entry: 3
      Data: 111
    - Name: $v
      Entry: 1
      Data: O
    - Name: 
      Entry: 8
      Data: 
    - Name: 
      Entry: 7
      Data: 
    - Name: $k
      Entry: 3
      Data: 112
    - Name: $v
      Entry: 1
      Data: P
    - Name: 
      Entry: 8
      Data: 
    - Name: 
      Entry: 7
      Data: 
    - Name: $k
      Entry: 3
      Data: 113
    - Name: $v
      Entry: 1
      Data: Q
    - Name: 
      Entry: 8
      Data: 
    - Name: 
      Entry: 7
      Data: 
    - Name: $k
      Entry: 3
      Data: 114
    - Name: $v
      Entry: 1
      Data: R
    - Name: 
      Entry: 8
      Data: 
    - Name: 
      Entry: 7
      Data: 
    - Name: $k
      Entry: 3
      Data: 115
    - Name: $v
      Entry: 1
      Data: S
    - Name: 
      Entry: 8
      Data: 
    - Name: 
      Entry: 7
      Data: 
    - Name: $k
      Entry: 3
      Data: 116
    - Name: $v
      Entry: 1
      Data: T
    - Name: 
      Entry: 8
      Data: 
    - Name: 
      Entry: 7
      Data: 
    - Name: $k
      Entry: 3
      Data: 117
    - Name: $v
      Entry: 1
      Data: U
    - Name: 
      Entry: 8
      Data: 
    - Name: 
      Entry: 7
      Data: 
    - Name: $k
      Entry: 3
      Data: 118
    - Name: $v
      Entry: 1
      Data: V
    - Name: 
      Entry: 8
      Data: 
    - Name: 
      Entry: 7
      Data: 
    - Name: $k
      Entry: 3
      Data: 119
    - Name: $v
      Entry: 1
      Data: W
    - Name: 
      Entry: 8
      Data: 
    - Name: 
      Entry: 7
      Data: 
    - Name: $k
      Entry: 3
      Data: 120
    - Name: $v
      Entry: 1
      Data: X
    - Name: 
      Entry: 8
      Data: 
    - Name: 
      Entry: 7
      Data: 
    - Name: $k
      Entry: 3
      Data: 121
    - Name: $v
      Entry: 1
      Data: Y
    - Name: 
      Entry: 8
      Data: 
    - Name: 
      Entry: 7
      Data: 
    - Name: $k
      Entry: 3
      Data: 122
    - Name: $v
      Entry: 1
      Data: Z
    - Name: 
      Entry: 8
      Data: 
    - Name: 
      Entry: 7
      Data: 
    - Name: $k
      Entry: 3
      Data: 123
    - Name: $v
      Entry: 1
      Data: LeftCurlyBracket
    - Name: 
      Entry: 8
      Data: 
    - Name: 
      Entry: 7
      Data: 
    - Name: $k
      Entry: 3
      Data: 124
    - Name: $v
      Entry: 1
      Data: Pipe
    - Name: 
      Entry: 8
      Data: 
    - Name: 
      Entry: 7
      Data: 
    - Name: $k
      Entry: 3
      Data: 125
    - Name: $v
      Entry: 1
      Data: RightCurlyBracket
    - Name: 
      Entry: 8
      Data: 
    - Name: 
      Entry: 7
      Data: 
    - Name: $k
      Entry: 3
      Data: 126
    - Name: $v
      Entry: 1
      Data: Tilde
    - Name: 
      Entry: 8
      Data: 
    - Name: 
      Entry: 7
      Data: 
    - Name: $k
      Entry: 3
      Data: 127
    - Name: $v
      Entry: 1
      Data: Delete
    - Name: 
      Entry: 8
      Data: 
    - Name: 
      Entry: 7
      Data: 
    - Name: $k
      Entry: 3
      Data: 256
    - Name: $v
      Entry: 1
      Data: Keypad0
    - Name: 
      Entry: 8
      Data: 
    - Name: 
      Entry: 7
      Data: 
    - Name: $k
      Entry: 3
      Data: 257
    - Name: $v
      Entry: 1
      Data: Keypad1
    - Name: 
      Entry: 8
      Data: 
    - Name: 
      Entry: 7
      Data: 
    - Name: $k
      Entry: 3
      Data: 258
    - Name: $v
      Entry: 1
      Data: Keypad2
    - Name: 
      Entry: 8
      Data: 
    - Name: 
      Entry: 7
      Data: 
    - Name: $k
      Entry: 3
      Data: 259
    - Name: $v
      Entry: 1
      Data: Keypad3
    - Name: 
      Entry: 8
      Data: 
    - Name: 
      Entry: 7
      Data: 
    - Name: $k
      Entry: 3
      Data: 260
    - Name: $v
      Entry: 1
      Data: Keypad4
    - Name: 
      Entry: 8
      Data: 
    - Name: 
      Entry: 7
      Data: 
    - Name: $k
      Entry: 3
      Data: 261
    - Name: $v
      Entry: 1
      Data: Keypad5
    - Name: 
      Entry: 8
      Data: 
    - Name: 
      Entry: 7
      Data: 
    - Name: $k
      Entry: 3
      Data: 262
    - Name: $v
      Entry: 1
      Data: Keypad6
    - Name: 
      Entry: 8
      Data: 
    - Name: 
      Entry: 7
      Data: 
    - Name: $k
      Entry: 3
      Data: 263
    - Name: $v
      Entry: 1
      Data: Keypad7
    - Name: 
      Entry: 8
      Data: 
    - Name: 
      Entry: 7
      Data: 
    - Name: $k
      Entry: 3
      Data: 264
    - Name: $v
      Entry: 1
      Data: Keypad8
    - Name: 
      Entry: 8
      Data: 
    - Name: 
      Entry: 7
      Data: 
    - Name: $k
      Entry: 3
      Data: 265
    - Name: $v
      Entry: 1
      Data: Keypad9
    - Name: 
      Entry: 8
      Data: 
    - Name: 
      Entry: 7
      Data: 
    - Name: $k
      Entry: 3
      Data: 266
    - Name: $v
      Entry: 1
      Data: KeypadPeriod
    - Name: 
      Entry: 8
      Data: 
    - Name: 
      Entry: 7
      Data: 
    - Name: $k
      Entry: 3
      Data: 267
    - Name: $v
      Entry: 1
      Data: KeypadDivide
    - Name: 
      Entry: 8
      Data: 
    - Name: 
      Entry: 7
      Data: 
    - Name: $k
      Entry: 3
      Data: 268
    - Name: $v
      Entry: 1
      Data: KeypadMultiply
    - Name: 
      Entry: 8
      Data: 
    - Name: 
      Entry: 7
      Data: 
    - Name: $k
      Entry: 3
      Data: 269
    - Name: $v
      Entry: 1
      Data: KeypadMinus
    - Name: 
      Entry: 8
      Data: 
    - Name: 
      Entry: 7
      Data: 
    - Name: $k
      Entry: 3
      Data: 270
    - Name: $v
      Entry: 1
      Data: KeypadPlus
    - Name: 
      Entry: 8
      Data: 
    - Name: 
      Entry: 7
      Data: 
    - Name: $k
      Entry: 3
      Data: 271
    - Name: $v
      Entry: 1
      Data: KeypadEnter
    - Name: 
      Entry: 8
      Data: 
    - Name: 
      Entry: 7
      Data: 
    - Name: $k
      Entry: 3
      Data: 272
    - Name: $v
      Entry: 1
      Data: KeypadEquals
    - Name: 
      Entry: 8
      Data: 
    - Name: 
      Entry: 7
      Data: 
    - Name: $k
      Entry: 3
      Data: 273
    - Name: $v
      Entry: 1
      Data: UpArrow
    - Name: 
      Entry: 8
      Data: 
    - Name: 
      Entry: 7
      Data: 
    - Name: $k
      Entry: 3
      Data: 274
    - Name: $v
      Entry: 1
      Data: DownArrow
    - Name: 
      Entry: 8
      Data: 
    - Name: 
      Entry: 7
      Data: 
    - Name: $k
      Entry: 3
      Data: 275
    - Name: $v
      Entry: 1
      Data: RightArrow
    - Name: 
      Entry: 8
      Data: 
    - Name: 
      Entry: 7
      Data: 
    - Name: $k
      Entry: 3
      Data: 276
    - Name: $v
      Entry: 1
      Data: LeftArrow
    - Name: 
      Entry: 8
      Data: 
    - Name: 
      Entry: 7
      Data: 
    - Name: $k
      Entry: 3
      Data: 277
    - Name: $v
      Entry: 1
      Data: Insert
    - Name: 
      Entry: 8
      Data: 
    - Name: 
      Entry: 7
      Data: 
    - Name: $k
      Entry: 3
      Data: 278
    - Name: $v
      Entry: 1
      Data: Home
    - Name: 
      Entry: 8
      Data: 
    - Name: 
      Entry: 7
      Data: 
    - Name: $k
      Entry: 3
      Data: 279
    - Name: $v
      Entry: 1
      Data: End
    - Name: 
      Entry: 8
      Data: 
    - Name: 
      Entry: 7
      Data: 
    - Name: $k
      Entry: 3
      Data: 280
    - Name: $v
      Entry: 1
      Data: PageUp
    - Name: 
      Entry: 8
      Data: 
    - Name: 
      Entry: 7
      Data: 
    - Name: $k
      Entry: 3
      Data: 281
    - Name: $v
      Entry: 1
      Data: PageDown
    - Name: 
      Entry: 8
      Data: 
    - Name: 
      Entry: 7
      Data: 
    - Name: $k
      Entry: 3
      Data: 282
    - Name: $v
      Entry: 1
      Data: F1
    - Name: 
      Entry: 8
      Data: 
    - Name: 
      Entry: 7
      Data: 
    - Name: $k
      Entry: 3
      Data: 283
    - Name: $v
      Entry: 1
      Data: F2
    - Name: 
      Entry: 8
      Data: 
    - Name: 
      Entry: 7
      Data: 
    - Name: $k
      Entry: 3
      Data: 284
    - Name: $v
      Entry: 1
      Data: F3
    - Name: 
      Entry: 8
      Data: 
    - Name: 
      Entry: 7
      Data: 
    - Name: $k
      Entry: 3
      Data: 285
    - Name: $v
      Entry: 1
      Data: F4
    - Name: 
      Entry: 8
      Data: 
    - Name: 
      Entry: 7
      Data: 
    - Name: $k
      Entry: 3
      Data: 286
    - Name: $v
      Entry: 1
      Data: F5
    - Name: 
      Entry: 8
      Data: 
    - Name: 
      Entry: 7
      Data: 
    - Name: $k
      Entry: 3
      Data: 287
    - Name: $v
      Entry: 1
      Data: F6
    - Name: 
      Entry: 8
      Data: 
    - Name: 
      Entry: 7
      Data: 
    - Name: $k
      Entry: 3
      Data: 288
    - Name: $v
      Entry: 1
      Data: F7
    - Name: 
      Entry: 8
      Data: 
    - Name: 
      Entry: 7
      Data: 
    - Name: $k
      Entry: 3
      Data: 289
    - Name: $v
      Entry: 1
      Data: F8
    - Name: 
      Entry: 8
      Data: 
    - Name: 
      Entry: 7
      Data: 
    - Name: $k
      Entry: 3
      Data: 290
    - Name: $v
      Entry: 1
      Data: F9
    - Name: 
      Entry: 8
      Data: 
    - Name: 
      Entry: 7
      Data: 
    - Name: $k
      Entry: 3
      Data: 291
    - Name: $v
      Entry: 1
      Data: F10
    - Name: 
      Entry: 8
      Data: 
    - Name: 
      Entry: 7
      Data: 
    - Name: $k
      Entry: 3
      Data: 292
    - Name: $v
      Entry: 1
      Data: F11
    - Name: 
      Entry: 8
      Data: 
    - Name: 
      Entry: 7
      Data: 
    - Name: $k
      Entry: 3
      Data: 293
    - Name: $v
      Entry: 1
      Data: F12
    - Name: 
      Entry: 8
      Data: 
    - Name: 
      Entry: 7
      Data: 
    - Name: $k
      Entry: 3
      Data: 294
    - Name: $v
      Entry: 1
      Data: F13
    - Name: 
      Entry: 8
      Data: 
    - Name: 
      Entry: 7
      Data: 
    - Name: $k
      Entry: 3
      Data: 295
    - Name: $v
      Entry: 1
      Data: F14
    - Name: 
      Entry: 8
      Data: 
    - Name: 
      Entry: 7
      Data: 
    - Name: $k
      Entry: 3
      Data: 296
    - Name: $v
      Entry: 1
      Data: F15
    - Name: 
      Entry: 8
      Data: 
    - Name: 
      Entry: 7
      Data: 
    - Name: $k
      Entry: 3
      Data: 300
    - Name: $v
      Entry: 1
      Data: Numlock
    - Name: 
      Entry: 8
      Data: 
    - Name: 
      Entry: 7
      Data: 
    - Name: $k
      Entry: 3
      Data: 301
    - Name: $v
      Entry: 1
      Data: CapsLock
    - Name: 
      Entry: 8
      Data: 
    - Name: 
      Entry: 7
      Data: 
    - Name: $k
      Entry: 3
      Data: 302
    - Name: $v
      Entry: 1
      Data: ScrollLock
    - Name: 
      Entry: 8
      Data: 
    - Name: 
      Entry: 7
      Data: 
    - Name: $k
      Entry: 3
      Data: 303
    - Name: $v
      Entry: 1
      Data: RightShift
    - Name: 
      Entry: 8
      Data: 
    - Name: 
      Entry: 7
      Data: 
    - Name: $k
      Entry: 3
      Data: 304
    - Name: $v
      Entry: 1
      Data: LeftShift
    - Name: 
      Entry: 8
      Data: 
    - Name: 
      Entry: 7
      Data: 
    - Name: $k
      Entry: 3
      Data: 305
    - Name: $v
      Entry: 1
      Data: RightControl
    - Name: 
      Entry: 8
      Data: 
    - Name: 
      Entry: 7
      Data: 
    - Name: $k
      Entry: 3
      Data: 306
    - Name: $v
      Entry: 1
      Data: LeftControl
    - Name: 
      Entry: 8
      Data: 
    - Name: 
      Entry: 7
      Data: 
    - Name: $k
      Entry: 3
      Data: 307
    - Name: $v
      Entry: 1
      Data: RightAlt
    - Name: 
      Entry: 8
      Data: 
    - Name: 
      Entry: 7
      Data: 
    - Name: $k
      Entry: 3
      Data: 308
    - Name: $v
      Entry: 1
      Data: LeftAlt
    - Name: 
      Entry: 8
      Data: 
    - Name: 
      Entry: 7
      Data: 
    - Name: $k
      Entry: 3
      Data: 309
    - Name: $v
      Entry: 1
      Data: RightApple
    - Name: 
      Entry: 8
      Data: 
    - Name: 
      Entry: 7
      Data: 
    - Name: $k
      Entry: 3
      Data: 310
    - Name: $v
      Entry: 1
      Data: LeftCommand
    - Name: 
      Entry: 8
      Data: 
    - Name: 
      Entry: 7
      Data: 
    - Name: $k
      Entry: 3
      Data: 311
    - Name: $v
      Entry: 1
      Data: LeftWindows
    - Name: 
      Entry: 8
      Data: 
    - Name: 
      Entry: 7
      Data: 
    - Name: $k
      Entry: 3
      Data: 312
    - Name: $v
      Entry: 1
      Data: RightWindows
    - Name: 
      Entry: 8
      Data: 
    - Name: 
      Entry: 7
      Data: 
    - Name: $k
      Entry: 3
      Data: 313
    - Name: $v
      Entry: 1
      Data: AltGr
    - Name: 
      Entry: 8
      Data: 
    - Name: 
      Entry: 7
      Data: 
    - Name: $k
      Entry: 3
      Data: 315
    - Name: $v
      Entry: 1
      Data: Help
    - Name: 
      Entry: 8
      Data: 
    - Name: 
      Entry: 7
      Data: 
    - Name: $k
      Entry: 3
      Data: 316
    - Name: $v
      Entry: 1
      Data: Print
    - Name: 
      Entry: 8
      Data: 
    - Name: 
      Entry: 7
      Data: 
    - Name: $k
      Entry: 3
      Data: 317
    - Name: $v
      Entry: 1
      Data: SysReq
    - Name: 
      Entry: 8
      Data: 
    - Name: 
      Entry: 7
      Data: 
    - Name: $k
      Entry: 3
      Data: 318
    - Name: $v
      Entry: 1
      Data: Break
    - Name: 
      Entry: 8
      Data: 
    - Name: 
      Entry: 7
      Data: 
    - Name: $k
      Entry: 3
      Data: 319
    - Name: $v
      Entry: 1
      Data: Menu
    - Name: 
      Entry: 8
      Data: 
    - Name: 
      Entry: 7
      Data: 
    - Name: $k
      Entry: 3
      Data: 323
    - Name: $v
      Entry: 1
      Data: Mouse0
    - Name: 
      Entry: 8
      Data: 
    - Name: 
      Entry: 7
      Data: 
    - Name: $k
      Entry: 3
      Data: 324
    - Name: $v
      Entry: 1
      Data: Mouse1
    - Name: 
      Entry: 8
      Data: 
    - Name: 
      Entry: 7
      Data: 
    - Name: $k
      Entry: 3
      Data: 325
    - Name: $v
      Entry: 1
      Data: Mouse2
    - Name: 
      Entry: 8
      Data: 
    - Name: 
      Entry: 7
      Data: 
    - Name: $k
      Entry: 3
      Data: 326
    - Name: $v
      Entry: 1
      Data: Mouse3
    - Name: 
      Entry: 8
      Data: 
    - Name: 
      Entry: 7
      Data: 
    - Name: $k
      Entry: 3
      Data: 327
    - Name: $v
      Entry: 1
      Data: Mouse4
    - Name: 
      Entry: 8
      Data: 
    - Name: 
      Entry: 7
      Data: 
    - Name: $k
      Entry: 3
      Data: 328
    - Name: $v
      Entry: 1
      Data: Mouse5
    - Name: 
      Entry: 8
      Data: 
    - Name: 
      Entry: 7
      Data: 
    - Name: $k
      Entry: 3
      Data: 329
    - Name: $v
      Entry: 1
      Data: Mouse6
    - Name: 
      Entry: 8
      Data: 
    - Name: 
      Entry: 7
      Data: 
    - Name: $k
      Entry: 3
      Data: 330
    - Name: $v
      Entry: 1
      Data: JoystickButton0
    - Name: 
      Entry: 8
      Data: 
    - Name: 
      Entry: 7
      Data: 
    - Name: $k
      Entry: 3
      Data: 331
    - Name: $v
      Entry: 1
      Data: JoystickButton1
    - Name: 
      Entry: 8
      Data: 
    - Name: 
      Entry: 7
      Data: 
    - Name: $k
      Entry: 3
      Data: 332
    - Name: $v
      Entry: 1
      Data: JoystickButton2
    - Name: 
      Entry: 8
      Data: 
    - Name: 
      Entry: 7
      Data: 
    - Name: $k
      Entry: 3
      Data: 333
    - Name: $v
      Entry: 1
      Data: JoystickButton3
    - Name: 
      Entry: 8
      Data: 
    - Name: 
      Entry: 7
      Data: 
    - Name: $k
      Entry: 3
      Data: 334
    - Name: $v
      Entry: 1
      Data: JoystickButton4
    - Name: 
      Entry: 8
      Data: 
    - Name: 
      Entry: 7
      Data: 
    - Name: $k
      Entry: 3
      Data: 335
    - Name: $v
      Entry: 1
      Data: JoystickButton5
    - Name: 
      Entry: 8
      Data: 
    - Name: 
      Entry: 7
      Data: 
    - Name: $k
      Entry: 3
      Data: 336
    - Name: $v
      Entry: 1
      Data: JoystickButton6
    - Name: 
      Entry: 8
      Data: 
    - Name: 
      Entry: 7
      Data: 
    - Name: $k
      Entry: 3
      Data: 337
    - Name: $v
      Entry: 1
      Data: JoystickButton7
    - Name: 
      Entry: 8
      Data: 
    - Name: 
      Entry: 7
      Data: 
    - Name: $k
      Entry: 3
      Data: 338
    - Name: $v
      Entry: 1
      Data: JoystickButton8
    - Name: 
      Entry: 8
      Data: 
    - Name: 
      Entry: 7
      Data: 
    - Name: $k
      Entry: 3
      Data: 339
    - Name: $v
      Entry: 1
      Data: JoystickButton9
    - Name: 
      Entry: 8
      Data: 
    - Name: 
      Entry: 7
      Data: 
    - Name: $k
      Entry: 3
      Data: 340
    - Name: $v
      Entry: 1
      Data: JoystickButton10
    - Name: 
      Entry: 8
      Data: 
    - Name: 
      Entry: 7
      Data: 
    - Name: $k
      Entry: 3
      Data: 341
    - Name: $v
      Entry: 1
      Data: JoystickButton11
    - Name: 
      Entry: 8
      Data: 
    - Name: 
      Entry: 7
      Data: 
    - Name: $k
      Entry: 3
      Data: 342
    - Name: $v
      Entry: 1
      Data: JoystickButton12
    - Name: 
      Entry: 8
      Data: 
    - Name: 
      Entry: 7
      Data: 
    - Name: $k
      Entry: 3
      Data: 343
    - Name: $v
      Entry: 1
      Data: JoystickButton13
    - Name: 
      Entry: 8
      Data: 
    - Name: 
      Entry: 7
      Data: 
    - Name: $k
      Entry: 3
      Data: 344
    - Name: $v
      Entry: 1
      Data: JoystickButton14
    - Name: 
      Entry: 8
      Data: 
    - Name: 
      Entry: 7
      Data: 
    - Name: $k
      Entry: 3
      Data: 345
    - Name: $v
      Entry: 1
      Data: JoystickButton15
    - Name: 
      Entry: 8
      Data: 
    - Name: 
      Entry: 7
      Data: 
    - Name: $k
      Entry: 3
      Data: 346
    - Name: $v
      Entry: 1
      Data: JoystickButton16
    - Name: 
      Entry: 8
      Data: 
    - Name: 
      Entry: 7
      Data: 
    - Name: $k
      Entry: 3
      Data: 347
    - Name: $v
      Entry: 1
      Data: JoystickButton17
    - Name: 
      Entry: 8
      Data: 
    - Name: 
      Entry: 7
      Data: 
    - Name: $k
      Entry: 3
      Data: 348
    - Name: $v
      Entry: 1
      Data: JoystickButton18
    - Name: 
      Entry: 8
      Data: 
    - Name: 
      Entry: 7
      Data: 
    - Name: $k
      Entry: 3
      Data: 349
    - Name: $v
      Entry: 1
      Data: JoystickButton19
    - Name: 
      Entry: 8
      Data: 
    - Name: 
      Entry: 7
      Data: 
    - Name: $k
      Entry: 3
      Data: 350
    - Name: $v
      Entry: 1
      Data: Joystick1Button0
    - Name: 
      Entry: 8
      Data: 
    - Name: 
      Entry: 7
      Data: 
    - Name: $k
      Entry: 3
      Data: 351
    - Name: $v
      Entry: 1
      Data: Joystick1Button1
    - Name: 
      Entry: 8
      Data: 
    - Name: 
      Entry: 7
      Data: 
    - Name: $k
      Entry: 3
      Data: 352
    - Name: $v
      Entry: 1
      Data: Joystick1Button2
    - Name: 
      Entry: 8
      Data: 
    - Name: 
      Entry: 7
      Data: 
    - Name: $k
      Entry: 3
      Data: 353
    - Name: $v
      Entry: 1
      Data: Joystick1Button3
    - Name: 
      Entry: 8
      Data: 
    - Name: 
      Entry: 7
      Data: 
    - Name: $k
      Entry: 3
      Data: 354
    - Name: $v
      Entry: 1
      Data: Joystick1Button4
    - Name: 
      Entry: 8
      Data: 
    - Name: 
      Entry: 7
      Data: 
    - Name: $k
      Entry: 3
      Data: 355
    - Name: $v
      Entry: 1
      Data: Joystick1Button5
    - Name: 
      Entry: 8
      Data: 
    - Name: 
      Entry: 7
      Data: 
    - Name: $k
      Entry: 3
      Data: 356
    - Name: $v
      Entry: 1
      Data: Joystick1Button6
    - Name: 
      Entry: 8
      Data: 
    - Name: 
      Entry: 7
      Data: 
    - Name: $k
      Entry: 3
      Data: 357
    - Name: $v
      Entry: 1
      Data: Joystick1Button7
    - Name: 
      Entry: 8
      Data: 
    - Name: 
      Entry: 7
      Data: 
    - Name: $k
      Entry: 3
      Data: 358
    - Name: $v
      Entry: 1
      Data: Joystick1Button8
    - Name: 
      Entry: 8
      Data: 
    - Name: 
      Entry: 7
      Data: 
    - Name: $k
      Entry: 3
      Data: 359
    - Name: $v
      Entry: 1
      Data: Joystick1Button9
    - Name: 
      Entry: 8
      Data: 
    - Name: 
      Entry: 7
      Data: 
    - Name: $k
      Entry: 3
      Data: 360
    - Name: $v
      Entry: 1
      Data: Joystick1Button10
    - Name: 
      Entry: 8
      Data: 
    - Name: 
      Entry: 7
      Data: 
    - Name: $k
      Entry: 3
      Data: 361
    - Name: $v
      Entry: 1
      Data: Joystick1Button11
    - Name: 
      Entry: 8
      Data: 
    - Name: 
      Entry: 7
      Data: 
    - Name: $k
      Entry: 3
      Data: 362
    - Name: $v
      Entry: 1
      Data: Joystick1Button12
    - Name: 
      Entry: 8
      Data: 
    - Name: 
      Entry: 7
      Data: 
    - Name: $k
      Entry: 3
      Data: 363
    - Name: $v
      Entry: 1
      Data: Joystick1Button13
    - Name: 
      Entry: 8
      Data: 
    - Name: 
      Entry: 7
      Data: 
    - Name: $k
      Entry: 3
      Data: 364
    - Name: $v
      Entry: 1
      Data: Joystick1Button14
    - Name: 
      Entry: 8
      Data: 
    - Name: 
      Entry: 7
      Data: 
    - Name: $k
      Entry: 3
      Data: 365
    - Name: $v
      Entry: 1
      Data: Joystick1Button15
    - Name: 
      Entry: 8
      Data: 
    - Name: 
      Entry: 7
      Data: 
    - Name: $k
      Entry: 3
      Data: 366
    - Name: $v
      Entry: 1
      Data: Joystick1Button16
    - Name: 
      Entry: 8
      Data: 
    - Name: 
      Entry: 7
      Data: 
    - Name: $k
      Entry: 3
      Data: 367
    - Name: $v
      Entry: 1
      Data: Joystick1Button17
    - Name: 
      Entry: 8
      Data: 
    - Name: 
      Entry: 7
      Data: 
    - Name: $k
      Entry: 3
      Data: 368
    - Name: $v
      Entry: 1
      Data: Joystick1Button18
    - Name: 
      Entry: 8
      Data: 
    - Name: 
      Entry: 7
      Data: 
    - Name: $k
      Entry: 3
      Data: 369
    - Name: $v
      Entry: 1
      Data: Joystick1Button19
    - Name: 
      Entry: 8
      Data: 
    - Name: 
      Entry: 7
      Data: 
    - Name: $k
      Entry: 3
      Data: 370
    - Name: $v
      Entry: 1
      Data: Joystick2Button0
    - Name: 
      Entry: 8
      Data: 
    - Name: 
      Entry: 7
      Data: 
    - Name: $k
      Entry: 3
      Data: 371
    - Name: $v
      Entry: 1
      Data: Joystick2Button1
    - Name: 
      Entry: 8
      Data: 
    - Name: 
      Entry: 7
      Data: 
    - Name: $k
      Entry: 3
      Data: 372
    - Name: $v
      Entry: 1
      Data: Joystick2Button2
    - Name: 
      Entry: 8
      Data: 
    - Name: 
      Entry: 7
      Data: 
    - Name: $k
      Entry: 3
      Data: 373
    - Name: $v
      Entry: 1
      Data: Joystick2Button3
    - Name: 
      Entry: 8
      Data: 
    - Name: 
      Entry: 7
      Data: 
    - Name: $k
      Entry: 3
      Data: 374
    - Name: $v
      Entry: 1
      Data: Joystick2Button4
    - Name: 
      Entry: 8
      Data: 
    - Name: 
      Entry: 7
      Data: 
    - Name: $k
      Entry: 3
      Data: 375
    - Name: $v
      Entry: 1
      Data: Joystick2Button5
    - Name: 
      Entry: 8
      Data: 
    - Name: 
      Entry: 7
      Data: 
    - Name: $k
      Entry: 3
      Data: 376
    - Name: $v
      Entry: 1
      Data: Joystick2Button6
    - Name: 
      Entry: 8
      Data: 
    - Name: 
      Entry: 7
      Data: 
    - Name: $k
      Entry: 3
      Data: 377
    - Name: $v
      Entry: 1
      Data: Joystick2Button7
    - Name: 
      Entry: 8
      Data: 
    - Name: 
      Entry: 7
      Data: 
    - Name: $k
      Entry: 3
      Data: 378
    - Name: $v
      Entry: 1
      Data: Joystick2Button8
    - Name: 
      Entry: 8
      Data: 
    - Name: 
      Entry: 7
      Data: 
    - Name: $k
      Entry: 3
      Data: 379
    - Name: $v
      Entry: 1
      Data: Joystick2Button9
    - Name: 
      Entry: 8
      Data: 
    - Name: 
      Entry: 7
      Data: 
    - Name: $k
      Entry: 3
      Data: 380
    - Name: $v
      Entry: 1
      Data: Joystick2Button10
    - Name: 
      Entry: 8
      Data: 
    - Name: 
      Entry: 7
      Data: 
    - Name: $k
      Entry: 3
      Data: 381
    - Name: $v
      Entry: 1
      Data: Joystick2Button11
    - Name: 
      Entry: 8
      Data: 
    - Name: 
      Entry: 7
      Data: 
    - Name: $k
      Entry: 3
      Data: 382
    - Name: $v
      Entry: 1
      Data: Joystick2Button12
    - Name: 
      Entry: 8
      Data: 
    - Name: 
      Entry: 7
      Data: 
    - Name: $k
      Entry: 3
      Data: 383
    - Name: $v
      Entry: 1
      Data: Joystick2Button13
    - Name: 
      Entry: 8
      Data: 
    - Name: 
      Entry: 7
      Data: 
    - Name: $k
      Entry: 3
      Data: 384
    - Name: $v
      Entry: 1
      Data: Joystick2Button14
    - Name: 
      Entry: 8
      Data: 
    - Name: 
      Entry: 7
      Data: 
    - Name: $k
      Entry: 3
      Data: 385
    - Name: $v
      Entry: 1
      Data: Joystick2Button15
    - Name: 
      Entry: 8
      Data: 
    - Name: 
      Entry: 7
      Data: 
    - Name: $k
      Entry: 3
      Data: 386
    - Name: $v
      Entry: 1
      Data: Joystick2Button16
    - Name: 
      Entry: 8
      Data: 
    - Name: 
      Entry: 7
      Data: 
    - Name: $k
      Entry: 3
      Data: 387
    - Name: $v
      Entry: 1
      Data: Joystick2Button17
    - Name: 
      Entry: 8
      Data: 
    - Name: 
      Entry: 7
      Data: 
    - Name: $k
      Entry: 3
      Data: 388
    - Name: $v
      Entry: 1
      Data: Joystick2Button18
    - Name: 
      Entry: 8
      Data: 
    - Name: 
      Entry: 7
      Data: 
    - Name: $k
      Entry: 3
      Data: 389
    - Name: $v
      Entry: 1
      Data: Joystick2Button19
    - Name: 
      Entry: 8
      Data: 
    - Name: 
      Entry: 7
      Data: 
    - Name: $k
      Entry: 3
      Data: 390
    - Name: $v
      Entry: 1
      Data: Joystick3Button0
    - Name: 
      Entry: 8
      Data: 
    - Name: 
      Entry: 7
      Data: 
    - Name: $k
      Entry: 3
      Data: 391
    - Name: $v
      Entry: 1
      Data: Joystick3Button1
    - Name: 
      Entry: 8
      Data: 
    - Name: 
      Entry: 7
      Data: 
    - Name: $k
      Entry: 3
      Data: 392
    - Name: $v
      Entry: 1
      Data: Joystick3Button2
    - Name: 
      Entry: 8
      Data: 
    - Name: 
      Entry: 7
      Data: 
    - Name: $k
      Entry: 3
      Data: 393
    - Name: $v
      Entry: 1
      Data: Joystick3Button3
    - Name: 
      Entry: 8
      Data: 
    - Name: 
      Entry: 7
      Data: 
    - Name: $k
      Entry: 3
      Data: 394
    - Name: $v
      Entry: 1
      Data: Joystick3Button4
    - Name: 
      Entry: 8
      Data: 
    - Name: 
      Entry: 7
      Data: 
    - Name: $k
      Entry: 3
      Data: 395
    - Name: $v
      Entry: 1
      Data: Joystick3Button5
    - Name: 
      Entry: 8
      Data: 
    - Name: 
      Entry: 7
      Data: 
    - Name: $k
      Entry: 3
      Data: 396
    - Name: $v
      Entry: 1
      Data: Joystick3Button6
    - Name: 
      Entry: 8
      Data: 
    - Name: 
      Entry: 7
      Data: 
    - Name: $k
      Entry: 3
      Data: 397
    - Name: $v
      Entry: 1
      Data: Joystick3Button7
    - Name: 
      Entry: 8
      Data: 
    - Name: 
      Entry: 7
      Data: 
    - Name: $k
      Entry: 3
      Data: 398
    - Name: $v
      Entry: 1
      Data: Joystick3Button8
    - Name: 
      Entry: 8
      Data: 
    - Name: 
      Entry: 7
      Data: 
    - Name: $k
      Entry: 3
      Data: 399
    - Name: $v
      Entry: 1
      Data: Joystick3Button9
    - Name: 
      Entry: 8
      Data: 
    - Name: 
      Entry: 7
      Data: 
    - Name: $k
      Entry: 3
      Data: 400
    - Name: $v
      Entry: 1
      Data: Joystick3Button10
    - Name: 
      Entry: 8
      Data: 
    - Name: 
      Entry: 7
      Data: 
    - Name: $k
      Entry: 3
      Data: 401
    - Name: $v
      Entry: 1
      Data: Joystick3Button11
    - Name: 
      Entry: 8
      Data: 
    - Name: 
      Entry: 7
      Data: 
    - Name: $k
      Entry: 3
      Data: 402
    - Name: $v
      Entry: 1
      Data: Joystick3Button12
    - Name: 
      Entry: 8
      Data: 
    - Name: 
      Entry: 7
      Data: 
    - Name: $k
      Entry: 3
      Data: 403
    - Name: $v
      Entry: 1
      Data: Joystick3Button13
    - Name: 
      Entry: 8
      Data: 
    - Name: 
      Entry: 7
      Data: 
    - Name: $k
      Entry: 3
      Data: 404
    - Name: $v
      Entry: 1
      Data: Joystick3Button14
    - Name: 
      Entry: 8
      Data: 
    - Name: 
      Entry: 7
      Data: 
    - Name: $k
      Entry: 3
      Data: 405
    - Name: $v
      Entry: 1
      Data: Joystick3Button15
    - Name: 
      Entry: 8
      Data: 
    - Name: 
      Entry: 7
      Data: 
    - Name: $k
      Entry: 3
      Data: 406
    - Name: $v
      Entry: 1
      Data: Joystick3Button16
    - Name: 
      Entry: 8
      Data: 
    - Name: 
      Entry: 7
      Data: 
    - Name: $k
      Entry: 3
      Data: 407
    - Name: $v
      Entry: 1
      Data: Joystick3Button17
    - Name: 
      Entry: 8
      Data: 
    - Name: 
      Entry: 7
      Data: 
    - Name: $k
      Entry: 3
      Data: 408
    - Name: $v
      Entry: 1
      Data: Joystick3Button18
    - Name: 
      Entry: 8
      Data: 
    - Name: 
      Entry: 7
      Data: 
    - Name: $k
      Entry: 3
      Data: 409
    - Name: $v
      Entry: 1
      Data: Joystick3Button19
    - Name: 
      Entry: 8
      Data: 
    - Name: 
      Entry: 7
      Data: 
    - Name: $k
      Entry: 3
      Data: 410
    - Name: $v
      Entry: 1
      Data: Joystick4Button0
    - Name: 
      Entry: 8
      Data: 
    - Name: 
      Entry: 7
      Data: 
    - Name: $k
      Entry: 3
      Data: 411
    - Name: $v
      Entry: 1
      Data: Joystick4Button1
    - Name: 
      Entry: 8
      Data: 
    - Name: 
      Entry: 7
      Data: 
    - Name: $k
      Entry: 3
      Data: 412
    - Name: $v
      Entry: 1
      Data: Joystick4Button2
    - Name: 
      Entry: 8
      Data: 
    - Name: 
      Entry: 7
      Data: 
    - Name: $k
      Entry: 3
      Data: 413
    - Name: $v
      Entry: 1
      Data: Joystick4Button3
    - Name: 
      Entry: 8
      Data: 
    - Name: 
      Entry: 7
      Data: 
    - Name: $k
      Entry: 3
      Data: 414
    - Name: $v
      Entry: 1
      Data: Joystick4Button4
    - Name: 
      Entry: 8
      Data: 
    - Name: 
      Entry: 7
      Data: 
    - Name: $k
      Entry: 3
      Data: 415
    - Name: $v
      Entry: 1
      Data: Joystick4Button5
    - Name: 
      Entry: 8
      Data: 
    - Name: 
      Entry: 7
      Data: 
    - Name: $k
      Entry: 3
      Data: 416
    - Name: $v
      Entry: 1
      Data: Joystick4Button6
    - Name: 
      Entry: 8
      Data: 
    - Name: 
      Entry: 7
      Data: 
    - Name: $k
      Entry: 3
      Data: 417
    - Name: $v
      Entry: 1
      Data: Joystick4Button7
    - Name: 
      Entry: 8
      Data: 
    - Name: 
      Entry: 7
      Data: 
    - Name: $k
      Entry: 3
      Data: 418
    - Name: $v
      Entry: 1
      Data: Joystick4Button8
    - Name: 
      Entry: 8
      Data: 
    - Name: 
      Entry: 7
      Data: 
    - Name: $k
      Entry: 3
      Data: 419
    - Name: $v
      Entry: 1
      Data: Joystick4Button9
    - Name: 
      Entry: 8
      Data: 
    - Name: 
      Entry: 7
      Data: 
    - Name: $k
      Entry: 3
      Data: 420
    - Name: $v
      Entry: 1
      Data: Joystick4Button10
    - Name: 
      Entry: 8
      Data: 
    - Name: 
      Entry: 7
      Data: 
    - Name: $k
      Entry: 3
      Data: 421
    - Name: $v
      Entry: 1
      Data: Joystick4Button11
    - Name: 
      Entry: 8
      Data: 
    - Name: 
      Entry: 7
      Data: 
    - Name: $k
      Entry: 3
      Data: 422
    - Name: $v
      Entry: 1
      Data: Joystick4Button12
    - Name: 
      Entry: 8
      Data: 
    - Name: 
      Entry: 7
      Data: 
    - Name: $k
      Entry: 3
      Data: 423
    - Name: $v
      Entry: 1
      Data: Joystick4Button13
    - Name: 
      Entry: 8
      Data: 
    - Name: 
      Entry: 7
      Data: 
    - Name: $k
      Entry: 3
      Data: 424
    - Name: $v
      Entry: 1
      Data: Joystick4Button14
    - Name: 
      Entry: 8
      Data: 
    - Name: 
      Entry: 7
      Data: 
    - Name: $k
      Entry: 3
      Data: 425
    - Name: $v
      Entry: 1
      Data: Joystick4Button15
    - Name: 
      Entry: 8
      Data: 
    - Name: 
      Entry: 7
      Data: 
    - Name: $k
      Entry: 3
      Data: 426
    - Name: $v
      Entry: 1
      Data: Joystick4Button16
    - Name: 
      Entry: 8
      Data: 
    - Name: 
      Entry: 7
      Data: 
    - Name: $k
      Entry: 3
      Data: 427
    - Name: $v
      Entry: 1
      Data: Joystick4Button17
    - Name: 
      Entry: 8
      Data: 
    - Name: 
      Entry: 7
      Data: 
    - Name: $k
      Entry: 3
      Data: 428
    - Name: $v
      Entry: 1
      Data: Joystick4Button18
    - Name: 
      Entry: 8
      Data: 
    - Name: 
      Entry: 7
      Data: 
    - Name: $k
      Entry: 3
      Data: 429
    - Name: $v
      Entry: 1
      Data: Joystick4Button19
    - Name: 
      Entry: 8
      Data: 
    - Name: 
      Entry: 7
      Data: 
    - Name: $k
      Entry: 3
      Data: 430
    - Name: $v
      Entry: 1
      Data: Joystick5Button0
    - Name: 
      Entry: 8
      Data: 
    - Name: 
      Entry: 7
      Data: 
    - Name: $k
      Entry: 3
      Data: 431
    - Name: $v
      Entry: 1
      Data: Joystick5Button1
    - Name: 
      Entry: 8
      Data: 
    - Name: 
      Entry: 7
      Data: 
    - Name: $k
      Entry: 3
      Data: 432
    - Name: $v
      Entry: 1
      Data: Joystick5Button2
    - Name: 
      Entry: 8
      Data: 
    - Name: 
      Entry: 7
      Data: 
    - Name: $k
      Entry: 3
      Data: 433
    - Name: $v
      Entry: 1
      Data: Joystick5Button3
    - Name: 
      Entry: 8
      Data: 
    - Name: 
      Entry: 7
      Data: 
    - Name: $k
      Entry: 3
      Data: 434
    - Name: $v
      Entry: 1
      Data: Joystick5Button4
    - Name: 
      Entry: 8
      Data: 
    - Name: 
      Entry: 7
      Data: 
    - Name: $k
      Entry: 3
      Data: 435
    - Name: $v
      Entry: 1
      Data: Joystick5Button5
    - Name: 
      Entry: 8
      Data: 
    - Name: 
      Entry: 7
      Data: 
    - Name: $k
      Entry: 3
      Data: 436
    - Name: $v
      Entry: 1
      Data: Joystick5Button6
    - Name: 
      Entry: 8
      Data: 
    - Name: 
      Entry: 7
      Data: 
    - Name: $k
      Entry: 3
      Data: 437
    - Name: $v
      Entry: 1
      Data: Joystick5Button7
    - Name: 
      Entry: 8
      Data: 
    - Name: 
      Entry: 7
      Data: 
    - Name: $k
      Entry: 3
      Data: 438
    - Name: $v
      Entry: 1
      Data: Joystick5Button8
    - Name: 
      Entry: 8
      Data: 
    - Name: 
      Entry: 7
      Data: 
    - Name: $k
      Entry: 3
      Data: 439
    - Name: $v
      Entry: 1
      Data: Joystick5Button9
    - Name: 
      Entry: 8
      Data: 
    - Name: 
      Entry: 7
      Data: 
    - Name: $k
      Entry: 3
      Data: 440
    - Name: $v
      Entry: 1
      Data: Joystick5Button10
    - Name: 
      Entry: 8
      Data: 
    - Name: 
      Entry: 7
      Data: 
    - Name: $k
      Entry: 3
      Data: 441
    - Name: $v
      Entry: 1
      Data: Joystick5Button11
    - Name: 
      Entry: 8
      Data: 
    - Name: 
      Entry: 7
      Data: 
    - Name: $k
      Entry: 3
      Data: 442
    - Name: $v
      Entry: 1
      Data: Joystick5Button12
    - Name: 
      Entry: 8
      Data: 
    - Name: 
      Entry: 7
      Data: 
    - Name: $k
      Entry: 3
      Data: 443
    - Name: $v
      Entry: 1
      Data: Joystick5Button13
    - Name: 
      Entry: 8
      Data: 
    - Name: 
      Entry: 7
      Data: 
    - Name: $k
      Entry: 3
      Data: 444
    - Name: $v
      Entry: 1
      Data: Joystick5Button14
    - Name: 
      Entry: 8
      Data: 
    - Name: 
      Entry: 7
      Data: 
    - Name: $k
      Entry: 3
      Data: 445
    - Name: $v
      Entry: 1
      Data: Joystick5Button15
    - Name: 
      Entry: 8
      Data: 
    - Name: 
      Entry: 7
      Data: 
    - Name: $k
      Entry: 3
      Data: 446
    - Name: $v
      Entry: 1
      Data: Joystick5Button16
    - Name: 
      Entry: 8
      Data: 
    - Name: 
      Entry: 7
      Data: 
    - Name: $k
      Entry: 3
      Data: 447
    - Name: $v
      Entry: 1
      Data: Joystick5Button17
    - Name: 
      Entry: 8
      Data: 
    - Name: 
      Entry: 7
      Data: 
    - Name: $k
      Entry: 3
      Data: 448
    - Name: $v
      Entry: 1
      Data: Joystick5Button18
    - Name: 
      Entry: 8
      Data: 
    - Name: 
      Entry: 7
      Data: 
    - Name: $k
      Entry: 3
      Data: 449
    - Name: $v
      Entry: 1
      Data: Joystick5Button19
    - Name: 
      Entry: 8
      Data: 
    - Name: 
      Entry: 7
      Data: 
    - Name: $k
      Entry: 3
      Data: 450
    - Name: $v
      Entry: 1
      Data: Joystick6Button0
    - Name: 
      Entry: 8
      Data: 
    - Name: 
      Entry: 7
      Data: 
    - Name: $k
      Entry: 3
      Data: 451
    - Name: $v
      Entry: 1
      Data: Joystick6Button1
    - Name: 
      Entry: 8
      Data: 
    - Name: 
      Entry: 7
      Data: 
    - Name: $k
      Entry: 3
      Data: 452
    - Name: $v
      Entry: 1
      Data: Joystick6Button2
    - Name: 
      Entry: 8
      Data: 
    - Name: 
      Entry: 7
      Data: 
    - Name: $k
      Entry: 3
      Data: 453
    - Name: $v
      Entry: 1
      Data: Joystick6Button3
    - Name: 
      Entry: 8
      Data: 
    - Name: 
      Entry: 7
      Data: 
    - Name: $k
      Entry: 3
      Data: 454
    - Name: $v
      Entry: 1
      Data: Joystick6Button4
    - Name: 
      Entry: 8
      Data: 
    - Name: 
      Entry: 7
      Data: 
    - Name: $k
      Entry: 3
      Data: 455
    - Name: $v
      Entry: 1
      Data: Joystick6Button5
    - Name: 
      Entry: 8
      Data: 
    - Name: 
      Entry: 7
      Data: 
    - Name: $k
      Entry: 3
      Data: 456
    - Name: $v
      Entry: 1
      Data: Joystick6Button6
    - Name: 
      Entry: 8
      Data: 
    - Name: 
      Entry: 7
      Data: 
    - Name: $k
      Entry: 3
      Data: 457
    - Name: $v
      Entry: 1
      Data: Joystick6Button7
    - Name: 
      Entry: 8
      Data: 
    - Name: 
      Entry: 7
      Data: 
    - Name: $k
      Entry: 3
      Data: 458
    - Name: $v
      Entry: 1
      Data: Joystick6Button8
    - Name: 
      Entry: 8
      Data: 
    - Name: 
      Entry: 7
      Data: 
    - Name: $k
      Entry: 3
      Data: 459
    - Name: $v
      Entry: 1
      Data: Joystick6Button9
    - Name: 
      Entry: 8
      Data: 
    - Name: 
      Entry: 7
      Data: 
    - Name: $k
      Entry: 3
      Data: 460
    - Name: $v
      Entry: 1
      Data: Joystick6Button10
    - Name: 
      Entry: 8
      Data: 
    - Name: 
      Entry: 7
      Data: 
    - Name: $k
      Entry: 3
      Data: 461
    - Name: $v
      Entry: 1
      Data: Joystick6Button11
    - Name: 
      Entry: 8
      Data: 
    - Name: 
      Entry: 7
      Data: 
    - Name: $k
      Entry: 3
      Data: 462
    - Name: $v
      Entry: 1
      Data: Joystick6Button12
    - Name: 
      Entry: 8
      Data: 
    - Name: 
      Entry: 7
      Data: 
    - Name: $k
      Entry: 3
      Data: 463
    - Name: $v
      Entry: 1
      Data: Joystick6Button13
    - Name: 
      Entry: 8
      Data: 
    - Name: 
      Entry: 7
      Data: 
    - Name: $k
      Entry: 3
      Data: 464
    - Name: $v
      Entry: 1
      Data: Joystick6Button14
    - Name: 
      Entry: 8
      Data: 
    - Name: 
      Entry: 7
      Data: 
    - Name: $k
      Entry: 3
      Data: 465
    - Name: $v
      Entry: 1
      Data: Joystick6Button15
    - Name: 
      Entry: 8
      Data: 
    - Name: 
      Entry: 7
      Data: 
    - Name: $k
      Entry: 3
      Data: 466
    - Name: $v
      Entry: 1
      Data: Joystick6Button16
    - Name: 
      Entry: 8
      Data: 
    - Name: 
      Entry: 7
      Data: 
    - Name: $k
      Entry: 3
      Data: 467
    - Name: $v
      Entry: 1
      Data: Joystick6Button17
    - Name: 
      Entry: 8
      Data: 
    - Name: 
      Entry: 7
      Data: 
    - Name: $k
      Entry: 3
      Data: 468
    - Name: $v
      Entry: 1
      Data: Joystick6Button18
    - Name: 
      Entry: 8
      Data: 
    - Name: 
      Entry: 7
      Data: 
    - Name: $k
      Entry: 3
      Data: 469
    - Name: $v
      Entry: 1
      Data: Joystick6Button19
    - Name: 
      Entry: 8
      Data: 
    - Name: 
      Entry: 7
      Data: 
    - Name: $k
      Entry: 3
      Data: 470
    - Name: $v
      Entry: 1
      Data: Joystick7Button0
    - Name: 
      Entry: 8
      Data: 
    - Name: 
      Entry: 7
      Data: 
    - Name: $k
      Entry: 3
      Data: 471
    - Name: $v
      Entry: 1
      Data: Joystick7Button1
    - Name: 
      Entry: 8
      Data: 
    - Name: 
      Entry: 7
      Data: 
    - Name: $k
      Entry: 3
      Data: 472
    - Name: $v
      Entry: 1
      Data: Joystick7Button2
    - Name: 
      Entry: 8
      Data: 
    - Name: 
      Entry: 7
      Data: 
    - Name: $k
      Entry: 3
      Data: 473
    - Name: $v
      Entry: 1
      Data: Joystick7Button3
    - Name: 
      Entry: 8
      Data: 
    - Name: 
      Entry: 7
      Data: 
    - Name: $k
      Entry: 3
      Data: 474
    - Name: $v
      Entry: 1
      Data: Joystick7Button4
    - Name: 
      Entry: 8
      Data: 
    - Name: 
      Entry: 7
      Data: 
    - Name: $k
      Entry: 3
      Data: 475
    - Name: $v
      Entry: 1
      Data: Joystick7Button5
    - Name: 
      Entry: 8
      Data: 
    - Name: 
      Entry: 7
      Data: 
    - Name: $k
      Entry: 3
      Data: 476
    - Name: $v
      Entry: 1
      Data: Joystick7Button6
    - Name: 
      Entry: 8
      Data: 
    - Name: 
      Entry: 7
      Data: 
    - Name: $k
      Entry: 3
      Data: 477
    - Name: $v
      Entry: 1
      Data: Joystick7Button7
    - Name: 
      Entry: 8
      Data: 
    - Name: 
      Entry: 7
      Data: 
    - Name: $k
      Entry: 3
      Data: 478
    - Name: $v
      Entry: 1
      Data: Joystick7Button8
    - Name: 
      Entry: 8
      Data: 
    - Name: 
      Entry: 7
      Data: 
    - Name: $k
      Entry: 3
      Data: 479
    - Name: $v
      Entry: 1
      Data: Joystick7Button9
    - Name: 
      Entry: 8
      Data: 
    - Name: 
      Entry: 7
      Data: 
    - Name: $k
      Entry: 3
      Data: 480
    - Name: $v
      Entry: 1
      Data: Joystick7Button10
    - Name: 
      Entry: 8
      Data: 
    - Name: 
      Entry: 7
      Data: 
    - Name: $k
      Entry: 3
      Data: 481
    - Name: $v
      Entry: 1
      Data: Joystick7Button11
    - Name: 
      Entry: 8
      Data: 
    - Name: 
      Entry: 7
      Data: 
    - Name: $k
      Entry: 3
      Data: 482
    - Name: $v
      Entry: 1
      Data: Joystick7Button12
    - Name: 
      Entry: 8
      Data: 
    - Name: 
      Entry: 7
      Data: 
    - Name: $k
      Entry: 3
      Data: 483
    - Name: $v
      Entry: 1
      Data: Joystick7Button13
    - Name: 
      Entry: 8
      Data: 
    - Name: 
      Entry: 7
      Data: 
    - Name: $k
      Entry: 3
      Data: 484
    - Name: $v
      Entry: 1
      Data: Joystick7Button14
    - Name: 
      Entry: 8
      Data: 
    - Name: 
      Entry: 7
      Data: 
    - Name: $k
      Entry: 3
      Data: 485
    - Name: $v
      Entry: 1
      Data: Joystick7Button15
    - Name: 
      Entry: 8
      Data: 
    - Name: 
      Entry: 7
      Data: 
    - Name: $k
      Entry: 3
      Data: 486
    - Name: $v
      Entry: 1
      Data: Joystick7Button16
    - Name: 
      Entry: 8
      Data: 
    - Name: 
      Entry: 7
      Data: 
    - Name: $k
      Entry: 3
      Data: 487
    - Name: $v
      Entry: 1
      Data: Joystick7Button17
    - Name: 
      Entry: 8
      Data: 
    - Name: 
      Entry: 7
      Data: 
    - Name: $k
      Entry: 3
      Data: 488
    - Name: $v
      Entry: 1
      Data: Joystick7Button18
    - Name: 
      Entry: 8
      Data: 
    - Name: 
      Entry: 7
      Data: 
    - Name: $k
      Entry: 3
      Data: 489
    - Name: $v
      Entry: 1
      Data: Joystick7Button19
    - Name: 
      Entry: 8
      Data: 
    - Name: 
      Entry: 7
      Data: 
    - Name: $k
      Entry: 3
      Data: 490
    - Name: $v
      Entry: 1
      Data: Joystick8Button0
    - Name: 
      Entry: 8
      Data: 
    - Name: 
      Entry: 7
      Data: 
    - Name: $k
      Entry: 3
      Data: 491
    - Name: $v
      Entry: 1
      Data: Joystick8Button1
    - Name: 
      Entry: 8
      Data: 
    - Name: 
      Entry: 7
      Data: 
    - Name: $k
      Entry: 3
      Data: 492
    - Name: $v
      Entry: 1
      Data: Joystick8Button2
    - Name: 
      Entry: 8
      Data: 
    - Name: 
      Entry: 7
      Data: 
    - Name: $k
      Entry: 3
      Data: 493
    - Name: $v
      Entry: 1
      Data: Joystick8Button3
    - Name: 
      Entry: 8
      Data: 
    - Name: 
      Entry: 7
      Data: 
    - Name: $k
      Entry: 3
      Data: 494
    - Name: $v
      Entry: 1
      Data: Joystick8Button4
    - Name: 
      Entry: 8
      Data: 
    - Name: 
      Entry: 7
      Data: 
    - Name: $k
      Entry: 3
      Data: 495
    - Name: $v
      Entry: 1
      Data: Joystick8Button5
    - Name: 
      Entry: 8
      Data: 
    - Name: 
      Entry: 7
      Data: 
    - Name: $k
      Entry: 3
      Data: 496
    - Name: $v
      Entry: 1
      Data: Joystick8Button6
    - Name: 
      Entry: 8
      Data: 
    - Name: 
      Entry: 7
      Data: 
    - Name: $k
      Entry: 3
      Data: 497
    - Name: $v
      Entry: 1
      Data: Joystick8Button7
    - Name: 
      Entry: 8
      Data: 
    - Name: 
      Entry: 7
      Data: 
    - Name: $k
      Entry: 3
      Data: 498
    - Name: $v
      Entry: 1
      Data: Joystick8Button8
    - Name: 
      Entry: 8
      Data: 
    - Name: 
      Entry: 7
      Data: 
    - Name: $k
      Entry: 3
      Data: 499
    - Name: $v
      Entry: 1
      Data: Joystick8Button9
    - Name: 
      Entry: 8
      Data: 
    - Name: 
      Entry: 7
      Data: 
    - Name: $k
      Entry: 3
      Data: 500
    - Name: $v
      Entry: 1
      Data: Joystick8Button10
    - Name: 
      Entry: 8
      Data: 
    - Name: 
      Entry: 7
      Data: 
    - Name: $k
      Entry: 3
      Data: 501
    - Name: $v
      Entry: 1
      Data: Joystick8Button11
    - Name: 
      Entry: 8
      Data: 
    - Name: 
      Entry: 7
      Data: 
    - Name: $k
      Entry: 3
      Data: 502
    - Name: $v
      Entry: 1
      Data: Joystick8Button12
    - Name: 
      Entry: 8
      Data: 
    - Name: 
      Entry: 7
      Data: 
    - Name: $k
      Entry: 3
      Data: 503
    - Name: $v
      Entry: 1
      Data: Joystick8Button13
    - Name: 
      Entry: 8
      Data: 
    - Name: 
      Entry: 7
      Data: 
    - Name: $k
      Entry: 3
      Data: 504
    - Name: $v
      Entry: 1
      Data: Joystick8Button14
    - Name: 
      Entry: 8
      Data: 
    - Name: 
      Entry: 7
      Data: 
    - Name: $k
      Entry: 3
      Data: 505
    - Name: $v
      Entry: 1
      Data: Joystick8Button15
    - Name: 
      Entry: 8
      Data: 
    - Name: 
      Entry: 7
      Data: 
    - Name: $k
      Entry: 3
      Data: 506
    - Name: $v
      Entry: 1
      Data: Joystick8Button16
    - Name: 
      Entry: 8
      Data: 
    - Name: 
      Entry: 7
      Data: 
    - Name: $k
      Entry: 3
      Data: 507
    - Name: $v
      Entry: 1
      Data: Joystick8Button17
    - Name: 
      Entry: 8
      Data: 
    - Name: 
      Entry: 7
      Data: 
    - Name: $k
      Entry: 3
      Data: 508
    - Name: $v
      Entry: 1
      Data: Joystick8Button18
    - Name: 
      Entry: 8
      Data: 
    - Name: 
      Entry: 7
      Data: 
    - Name: $k
      Entry: 3
      Data: 509
    - Name: $v
      Entry: 1
      Data: Joystick8Button19
    - Name: 
      Entry: 8
      Data: 
    - Name: 
      Entry: 13
      Data: 
    - Name: 
      Entry: 8
      Data: 
