%YAML 1.1
%TAG !u! tag:unity3d.com,2011:
--- !u!114 &11400000
MonoBehaviour:
  m_ObjectHideFlags: 0
  m_CorrespondingSourceObject: {fileID: 0}
  m_PrefabInstance: {fileID: 0}
  m_PrefabAsset: {fileID: 0}
  m_GameObject: {fileID: 0}
  m_Enabled: 1
  m_EditorHideFlags: 0
  m_Script: {fileID: 11500000, guid: b0111224b6e24d58b1ea77de4d862ec7, type: 3}
  m_Name: EnemyLookForKniblingDecision
  m_EditorClassIdentifier: 
  targetMask:
    serializedVersion: 2
    m_Bits: 8192
  obstacleMask:
    serializedVersion: 2
    m_Bits: 2049
