%YAML 1.1
%TAG !u! tag:unity3d.com,2011:
--- !u!181963792 &2655988077585873504
Preset:
  m_ObjectHideFlags: 0
  m_CorrespondingSourceObject: {fileID: 0}
  m_PrefabInstance: {fileID: 0}
  m_PrefabAsset: {fileID: 0}
  m_Name: WaveGroup
  m_TargetType:
    m_NativeTypeID: 114
    m_ManagedTypePPtr: {fileID: 11500000, guid: ad8f717a953945e9bb09885a39670397,
      type: 3}
    m_ManagedTypeFallback: 
  m_Properties:
  - target: {fileID: 0}
    propertyPath: m_Enabled
    value: 1
    objectReference: {fileID: 0}
  - target: {fileID: 0}
    propertyPath: m_EditorHideFlags
    value: 0
    objectReference: {fileID: 0}
  - target: {fileID: 0}
    propertyPath: m_EditorClassIdentifier
    value: 
    objectReference: {fileID: 0}
  - target: {fileID: 0}
    propertyPath: unitStartState
    value: 
    objectReference: {fileID: 11400000, guid: 5dca7fc5a3fed18408f07f57a14d15aa, type: 2}
  - target: {fileID: 0}
    propertyPath: spawnPointHelper
    value: 
    objectReference: {fileID: 0}
  - target: {fileID: 0}
    propertyPath: gatherPointHelper
    value: 
    objectReference: {fileID: 0}
  - target: {fileID: 0}
    propertyPath: spawnPoint.x
    value: 122.19999
    objectReference: {fileID: 0}
  - target: {fileID: 0}
    propertyPath: spawnPoint.y
    value: 0.01499939
    objectReference: {fileID: 0}
  - target: {fileID: 0}
    propertyPath: spawnPoint.z
    value: 165.84612
    objectReference: {fileID: 0}
  - target: {fileID: 0}
    propertyPath: gatherPoint.x
    value: 122.19999
    objectReference: {fileID: 0}
  - target: {fileID: 0}
    propertyPath: gatherPoint.y
    value: 0.01499939
    objectReference: {fileID: 0}
  - target: {fileID: 0}
    propertyPath: gatherPoint.z
    value: 158.91794
    objectReference: {fileID: 0}
  - target: {fileID: 0}
    propertyPath: randomDestinationRadius
    value: 2
    objectReference: {fileID: 0}
  - target: {fileID: 0}
    propertyPath: unitPrefabs.Array.size
    value: 1
    objectReference: {fileID: 0}
  - target: {fileID: 0}
    propertyPath: unitPrefabs.Array.data[0].controller
    value: 
    objectReference: {fileID: 3168013465331277277, guid: 3fc9de295f95b884bacbff614af1a553,
      type: 3}
  - target: {fileID: 0}
    propertyPath: unitPrefabs.Array.data[0].count
    value: 10
    objectReference: {fileID: 0}
  - target: {fileID: 0}
    propertyPath: units.Array.size
    value: 0
    objectReference: {fileID: 0}
  m_ExcludedProperties: []
