{
  "tools": [
    {
      "name": "ActiveDirectoryEnumeration",
      "source": "https://github.com/CasperGN/ActiveDirectoryEnumeration",
      "description": "Enumerate AD through LDAP with a collection of helpfull scripts being bundled: ASREPRoasting, Kerberoasting, dump AD as BloodHound JSON files, searching GPOs in SYSVOL for cpassword and decrypting, run without creds",
      "language": "Python",
      "price": "Free",
      "online": "False"
    },
    {
      "name": "ad-ldap-enum",
      "source": "https://github.com/CroweCybersecurity/ad-ldap-enum",
      "description": "LDAP based Active Directory user and group enumeration tool",
      "language": "Python",
      "price": "Free",
      "online": "False"
    },
    {
      "name": "ADenum",
      "source": "https://github.com/SecuProject/ADenum",
      "description": "Find misconfiguration through the LDAP protocol and exploit some weaknesses with kerberos",
      "language": "Python",
      "price": "Free",
      "online": "False",
      "keywords": "active directory, windows",
      "blackarch": "adenum"
    },
    {
      "name": "adfsbrute",
      "source": "https://github.com/ricardojoserf/adfsbrute",
      "description": "Test credentials against Active Directory Federation Services (ADFS), allowing password spraying or bruteforce attacks",
      "language": "Python",
      "price": "Free",
      "online": "False"
    },
    {
      "name": "archtorify",
      "source": "https://github.com/brainfucksec/archtorify",
      "description": "Script for Arch Linux which use iptables settings to create a transparent proxy through Tor Network",
      "language": "Shell",
      "price": "Free",
      "online": "False"
    },
    {
      "name": "Arecibo",
      "source": "https://github.com/TarlogicSecurity/Arecibo",
      "description": "Endpoint for Out-of-Band Exfiltration (DNS & HTTP)",
      "language": "Python",
      "price": "Free",
      "online": "False"
    },
    {
      "name": "ASNmap",
      "source": "https://github.com/projectdiscovery/asnmap",
      "description": "CLI and Library for quickly mapping organization network ranges using ASN information",
      "language": "Go",
      "price": "Free",
      "online": "False"
    },
    {
      "name": "bettercap",
      "website": "http://www.bettercap.org/",
      "source": "https://github.com/bettercap/bettercap",
      "description": "MITM framework",
      "language": "Ruby",
      "price": "Free",
      "online": "False"
    },
    {
      "name": "bettercap web UI",
      "website": "http://www.bettercap.org/",
      "source": "https://github.com/bettercap/ui",
      "description": "Web UI for bettercap",
      "language": "TypeScript",
      "price": "Free",
      "online": "False"
    },
    {
      "name": "bloodyAD",
      "source": "https://github.com/CravateRouge/bloodyAD",
      "description": "Active Directory privilege escalation framework",
      "language": "Python",
      "price": "Free",
      "online": "False"
    },
    {
      "name": "boofuzz",
      "source": "https://github.com/jtpereyda/boofuzz",
      "description": "Network protocol fuzzing framework",
      "language": "Python",
      "price": "Free",
      "online": "False"
    },
    {
      "name": "Boomerang",
      "source": "https://github.com/paranoidninja/Boomerang",
      "description": "Client/Server HTTP pivoting tool",
      "language": "Go",
      "price": "Free",
      "online": "False"
    },
    {
      "name": "BruteSpray",
      "source": "https://github.com/x90skysn3k/brutespray",
      "description": "Takes nmap GNMAP/XML output or newline seperated JSONS and automatically brute-forces services with default credentials using Medusa",
      "language": "Python",
      "price": "Free",
      "online": "False"
    },
    {
      "name": "BruteX",
      "source": "https://github.com/1N3/BruteX",
      "description": "Tool using nmap and hydra to automatically bruteforce network service accounts",
      "language": "Shell",
      "price": "Free",
      "online": "False"
    },
    {
      "name": "Carnivore",
      "website": "https://research.nccgroup.com/2020/12/03/tool-release-carnivore-microsoft-external-assessment-tool/",
      "source": "https://github.com/nccgroup/Carnivore",
      "description": "Assessment of on-premises Microsoft servers such as ADFS, Skype, Exchange, and RDWeb",
      "language": "CSharp",
      "price": "Free",
      "online": "False"
    },
    {
      "name": "CapAnalysis",
      "website": "http://www.capanalysis.net",
      "source": "https://sourceforge.net/projects/capanalysis/",
      "description": "PCAP analyzer",
      "language": "C",
      "price": "Free",
      "online": "True"
    },
    {
      "name": "Cerbrutus",
      "source": "https://github.com/Cerbrutus-BruteForcer/cerbrutus",
      "description": "Network services credentials brute-forcer: SSH, FTP",
      "language": "Python",
      "price": "Free",
      "online": "False"
    },
    {
      "name": "chisel",
      "source": "https://github.com/jpillora/chisel",
      "description": "Fast TCP tunneling over HTTP secured by SSH",
      "language": "Go",
      "price": "Free",
      "online": "False"
    },
    {
      "name": "CloudShark",
      "website": "https://www.cloudshark.org/",
      "description": "PCAP analyzer",
      "price": "Paid",
      "online": "True"
    },
    {
      "name": "CrackMapExec",
      "source": "https://github.com/byt3bl33d3r/CrackMapExec",
      "description": "Post-exploitation tool to assess Active Directory networks",
      "language": "Python",
      "price": "Free",
      "online": "False",
      "blackarch": "crackmapexec"
    },
    {
      "name": "Evil-WinRM",
      "source": "https://github.com/Hackplayers/evil-winrm",
      "description": "Enhanced WinRM shell",
      "language": "Ruby",
      "price": "Free",
      "online": "False"
    },
    {
      "name": "Garfield",
      "source": "https://github.com/torque59/Garfield",
      "description": "Attack framework for distributed systems",
      "language": "Python",
      "price": "Free",
      "online": "False"
    },
    {
      "name": "Girsh",
      "source": "https://github.com/nodauf/Girsh",
      "description": "Detect the OS and execute the correct commands to upgrade it to a full interactive reverse shell",
      "language": "Go",
      "price": "Free",
      "online": "False"
    },
    {
      "name": "Go-RouterSocks",
      "source": "https://github.com/nodauf/Go-RouterSocks",
      "description": "Socks proxy router to handle multi-clients on the same port",
      "language": "Go",
      "price": "Free",
      "online": "False",
      "keywords": "pivoting"
    },
    {
      "name": "GoldenCopy",
      "source": "https://github.com/Dramelac/GoldenCopy",
      "description": "Copy the properties and groups of a user from neo4j (bloodhound) to create an identical golden ticket",
      "language": "Python",
      "price": "Free",
      "online": "False",
      "keywords": "active directory"
    },
    {
      "name": "GoMapEnum",
      "source": "https://github.com/nodauf/GoMapEnum",
      "description": "User enumeration and password bruteforce on Azure, ADFS, OWA, O365 and gather emails on Linkedin",
      "language": "Go",
      "price": "Free",
      "online": "False"
    },
    {
      "name": "goddi",
      "source": "https://github.com/NetSPI/goddi",
      "description": "Active Directory domain information dumper",
      "language": "Go",
      "price": "Free",
      "online": "False"
    },
    {
      "name": "HASSH",
      "source": "https://github.com/salesforce/hassh",
      "description": "Network fingerprinting standard which can be used to identify specific client and server SSH implementations",
      "language": "Python",
      "price": "Free",
      "online": "False"
    },
    {
      "name": "HellRaiser",
      "source": "https://github.com/m0nad/HellRaiser",
      "description": "Scan with nmap to correlate CPE's found with cve-search to enumerate vulnerabilities",
      "language": "Ruby",
      "price": "Free",
      "online": "False"
    },
    {
      "name": "Hydra",
      "website": "https://www.thc.org/thc-hydra/",
      "source": "https://github.com/vanhauser-thc/thc-hydra",
      "description": "Network login cracker",
      "language": "C",
      "price": "Free",
      "online": "False",
      "blackarch": "hydra"
    },
    {
      "name": "Ica2Tcp",
      "source": "https://github.com/synacktiv/ica2tcp",
      "description": "SOCKS proxy for Citrix",
      "language": "C",
      "price": "Free",
      "online": "False"
    },
    {
      "name": "kalitorify",
      "source": "https://github.com/brainfucksec/kalitorify",
      "description": "Script for Kali Linux which use iptables settings to create a transparent proxy through Tor Network",
      "language": "Shell",
      "price": "Free",
      "online": "False"
    },
        {
      "name": "Kerbrute",
      "source": "https://github.com/ropnop/kerbrute",
      "description": "Bruteforce and enumerate valid Active Directory accounts through Kerberos Pre-Authentication",
      "language": "Go",
      "price": "Free",
      "online": "False",
      "blackarch": "kerbrute"
    },
    {
      "name": "Krbrelayx",
      "website": "https://dirkjanm.io/krbrelayx-unconstrained-delegation-abuse-toolkit/",
      "source": "https://github.com/dirkjanm/krbrelayx",
      "description": "Toolkit for abusing unconstrained delegation",
      "language": "Python",
      "price": "Free",
      "online": "False"
    },
    {
      "name": "Ligolo",
      "source": "https://github.com/sysdream/ligolo",
      "description": "Pivot / reverse tunneling tool with SOCKS5 et TCP tunnel support",
      "language": "Go",
      "price": "Free",
      "online": "False"
    },
    {
      "name": "lsassy",
      "source": "https://github.com/Hackndo/lsassy",
      "description": "CLI tool and library to extract credentials from lsass remotely",
      "language": "Python",
      "price": "Free",
      "online": "False",
      "blackarch": "python-lsassy"
    },
    {
      "name": "Mail.Rip V2",
      "source": "https://github.com/DrPython3/MailRipV2",
      "description": "SMTP credentials bruteforcer / checker",
      "language": "Python",
      "price": "Free",
      "online": "False",
      "keywords": "SOCKS4, SOCKS5"
    },
    {
      "name": "Masscan",
      "source": "https://github.com/robertdavidgraham/masscan",
      "description": "Port scanner for massive networks",
      "language": "C",
      "price": "Free",
      "online": "False"
    },
    {
      "name": "Medusa",
      "website": "http://foofus.net/goons/jmk/medusa/medusa.html",
      "description": "Network login cracker",
      "price": "Free",
      "online": "False"
    },
    {
      "name": "Medusa-gui",
      "source": "https://github.com/Tak31337/medusa-gui",
      "description": "GUI for Medusa",
      "language": "Java",
      "price": "Free",
      "online": "False"
    },
    {
      "name": "ncat",
      "website": "https://nmap.org/ncat/",
      "source": "https://github.com/nmap/nmap/tree/master/ncat",
      "description": "Improved reimplementation of Netcat by nmap team; Supports TCP and UDP, IPv4 and IPv6, SSL, proxy (HTTP and SOCKS4)",
      "language": "C",
      "price": "Free",
      "online": "False",
      "blackarch": "nmap",
      "keywords": "reverse shell, bind shell, listener"
    },
    {
      "name": "Ncrack",
      "website": "https://nmap.org/ncrack/",
      "source": "https://github.com/nmap/ncrack",
      "description": "Reliable and adaptative network login cracker supporting a large number of protocols",
      "language": "Cplusplus",
      "price": "Free",
      "online": "False"
    },
    {
      "name": "nemesis",
      "website": "http://troglobit.com/projects/nemesis/",
      "source": "https://github.com/troglobit/nemesis",
      "description": "Packet manipulation CLI tool; craft and inject packets of several protocols",
      "language": "Python",
      "price": "Free",
      "online": "False"
    },
    {
      "name": "Netfort Free Cloud Based PCAP Analysis",
      "website": "https://www.netfort.com/cloud-based-pcap-analysis/",
      "description": "PCAP analyzer; needs registration",
      "price": "Free",
      "online": "True"
    },
    {
      "name": "NetworkMiner",
      "website": "http://www.netresec.com/?page=NetworkMiner",
      "description": "Network sniffer/packet capturing tool",
      "price": "Free",
      "online": "False"
    },
    {
      "name": "NetworkTotal",
      "website": "https://www.networktotal.com/",
      "description": "PCAP analyzer; using Suricata",
      "price": "Free",
      "online": "True"
    },
    {
      "name": "Nipe",
      "source": "https://github.com/GouveaHeitor/nipe",
      "description": "Script to make TOR as default gateway",
      "language": "Perl",
      "price": "Free",
      "online": "False"
    },
    {
      "name": "Nmap",
      "website": "https://nmap.org/",
      "source": "https://github.com/nmap/nmap",
      "description": "Tool for network discovery and security auditing",
      "language": "C",
      "price": "Free",
      "online": "False",
      "blackarch": "nmap"
    },
    {
      "name": "nmap-parse-output",
      "source": "https://github.com/ernw/nmap-parse-output",
      "description": "Converts / manipulates / extracts data from a nmap scan output",
      "language": "Shell",
      "price": "Free",
      "online": "False",
      "blackarch": "nmap-parse-output"
    },
    {
      "name": "NMapGUI",
      "source": "https://github.com/danicuestasuarez/NMapGUI",
      "description": "Advanced GUI for Nmap",
      "language": "Java",
      "price": "Free",
      "online": "False"
    },
    {
      "name": "Nozzlr",
      "source": "https://github.com/intrd/nozzlr",
      "description": "Multithreaded and modular bruteforce framework with network templates",
      "language": "Python",
      "price": "Free",
      "online": "False"
    },
    {
      "name": "onesixtyone",
      "source": "https://github.com/trailofbits/onesixtyone",
      "description": "SNMP scanner",
      "language": "C",
      "price": "Free",
      "online": "False"
    },
    {
      "name": "OOB-Server",
      "source": "https://github.com/JuxhinDB/OOB-Server",
      "description": "Bind9 DNS server for pentesters to use for Out-of-Band vulnerabilities",
      "language": "Shell",
      "price": "Free",
      "online": "False"
    },
    {
      "name": "PacketFu",
      "source": "https://github.com/packetfu/packetfu",
      "description": "Packet manipulation library; forge, send, decode, capture packets of a wide number of protocols",
      "language": "Ruby",
      "price": "Free",
      "online": "False"
    },
    {
      "name": "PacketTotal",
      "website": "https://packettotal.com/",
      "description": "PCAP analyzer; using Bro, Suricata and Elasticsearch",
      "price": "Free",
      "online": "True"
    },
    {
      "name": "PacketWhisper",
      "source": "https://github.com/TryCatchHCF/PacketWhisper",
      "description": "Stealthy Data exfiltration via DNS, without the need for attacker-controlled Name Servers or domain",
      "language": "Python",
      "price": "Free",
      "online": "False"
    },
    {
      "name": "Patator",
      "source": "https://github.com/lanjelot/patator",
      "description": "Multi-protocol bruteforce tool",
      "language": "Python",
      "price": "Free",
      "online": "False"
    },
    {
      "name": "PKINIT tools",
      "source": "https://github.com/dirkjanm/PKINITtools",
      "description": "Kerberos PKINIT and relaying to AD CS",
      "language": "Python",
      "price": "Free",
      "online": "False",
      "keywords": "windows"
    },
    {
      "name": "polarbearscan",
      "website": "http://santarago.org/pbscan.html",
      "source": "https://github.com/gvb84/pbscan",
      "description": "Port scanner and banner grabber",
      "language": "C",
      "price": "Free",
      "online": "False"
    },
    {
      "name": "Polymorph",
      "source": "https://github.com/shramos/polymorph",
      "description": "Real-time network packet manipulation framework",
      "language": "Python",
      "price": "Free",
      "online": "False"
    },
    {
      "name": "pty4all",
      "source": "https://github.com/laluka/pty4all",
      "description": "Persistent multi reverse shell handler",
      "language": "Shell",
      "price": "Free",
      "online": "False",
      "keywords": "PTY"
    },
    {
      "name": "pwncat",
      "website": "https://pwncat.org/",
      "source": "https://github.com/cytopia/pwncat",
      "description": "Sophisticated bind and reverse shell handler with many features as well as a drop-in replacement or compatible complement to netcat, ncat or socat",
      "language": "Python",
      "price": "Free",
      "online": "False",
      "blackarch": "pwncat"
    },
    {
      "name": "pwncat-caleb",
      "website": "https://pwncat.readthedocs.io/",
      "source": "https://github.com/calebstewart/pwncat",
      "description": "Fancy reverse and bind shell handler, can perform automated actions on the remote host including enumeration, implant installation and privilege escalation; attempt to spawn a pseudoterminal (pty) for a full interactive session",
      "language": "Python",
      "price": "Free",
      "online": "False",
      "blackarch": "pwncat-caleb"
    },
    {
      "name": "pywerview",
      "source": "https://github.com/the-useless-one/pywerview",
      "description": "A partial Python rewriting of PowerSploit's PowerView",
      "language": "Python",
      "price": "Free",
      "online": "False",
      "keywords": "LDAP",
      "blackarch": "python-pywerview"
    },
    {
      "name": "PyWhisker",
      "source": "https://github.com/ShutdownRepo/pywhisker",
      "description": "Persistent and stealthy backdooring of user and computer Active Directory objects",
      "language": "Python",
      "price": "Free",
      "online": "False",
      "keywords": "msDS, windows, domain controller, AD CS, NTLM, Kerberos"
    },
    {
      "name": "rdp-sec-check",
      "source": "https://github.com/portcullislabs/rdp-sec-check",
      "description": "Script to enumerate security settings of an RDP Service",
      "language": "Perl",
      "price": "Free",
      "online": "False"
    },
    {
      "name": "Responder",
      "source": "https://github.com/SpiderLabs/Responder",
      "description": "LLMNR, NBT-NS and MDNS poisoner to intercept authentication requests/answers",
      "language": "Python",
      "price": "Free",
      "online": "False"
    },
    {
      "name": "RMIScout",
      "website": "https://know.bishopfox.com/research/rmiscout",
      "source": "https://github.com/BishopFox/rmiscout",
      "description": "Enumerate Java RMI functions and exploit RMI parameter unmarshalling vulnerabilities through wordlist and bruteforce strategies",
      "language": "Java",
      "price": "Free",
      "online": "False"
    },
    {
      "name": "RouterSploit",
      "source": "https://github.com/threat9/routersploit",
      "description": "Exploitation framework for embedded devices: exploits, default credentials, scanners, payloads",
      "language": "Python",
      "price": "Free",
      "online": "False",
      "blackarch": "routersploit"
    },
    {
      "name": "ruby-nmap",
      "source": "https://github.com/sophsec/ruby-nmap",
      "description": "Library for nmap, allows automating nmap and parsing nmap XML files",
      "language": "Ruby",
      "price": "Free",
      "online": "False",
      "blackarch": "ruby-ruby-nmap"
    },
    {
      "name": "Rustcat",
      "website": "https://github.com/robiot/rustcat/wiki/Installation-Guide",
      "source": "https://github.com/robiot/rustcat",
      "description": "Port and reverse shell listener; less features than ncat, pwncat, pwncat-caleb but has command history",
      "language": "Rust",
      "price": "Free",
      "online": "False",
      "blackarch": "rustcat"
    },
    {
      "name": "sandmap",
      "website": "https://github.com/trimstray/sandmap/wiki",
      "source": "https://github.com/trimstray/sandmap",
      "description": "Metasploit-like CLI interface for Nmap Script Engine (NSE)",
      "language": "Shell",
      "price": "Free",
      "online": "False"
    },
    {
      "name": "Scapy",
      "website": "https://scapy.net/",
      "source": "https://github.com/secdev/scapy/",
      "description": "Packet manipulation library; forge, send, decode, capture packets of a wide number of protocols",
      "language": "Python",
      "price": "Free",
      "online": "False"
    },
    {
      "name": "Seth",
      "source": "https://github.com/SySS-Research/Seth",
      "description": "RDP MitM tool",
      "language": "Python",
      "price": "Free",
      "online": "False"
    },
    {
      "name": "Singularity",
      "website": "https://www.nccgroup.trust/us/about-us/newsroom-and-events/blog/2018/august/singularity-of-origin-a-dns-rebinding-attack-framework/",
      "source": "https://github.com/nccgroup/singularity",
      "description": "DNS rebinding attack framework",
      "language": "Go",
      "price": "Free",
      "online": "False"
    },
    {
      "name": "sJET",
      "source": "https://github.com/siberas/sjet",
      "description": "JMX Exploitation Toolkit",
      "language": "Python",
      "price": "Free",
      "online": "False"
    },
    {
      "name": "Snaffler",
      "source": "https://github.com/SnaffCon/Snaffler",
      "description": "Find credentials and valuable information from windows active directory environments (shares, files)",
      "language": "CSharp",
      "price": "Free",
      "online": "False"
    },
    {
      "name": "SNMP Brute",
      "source": "https://github.com/SECFORCE/SNMP-Brute",
      "description": "SNMP brute force, enumeration, CISCO config downloader and password cracking script",
      "language": "Python",
      "price": "Free",
      "online": "False"
    },
    {
      "name": "snmpbw.pl",
      "source": "https://github.com/dheiland-r7/snmp",
      "description": "Multithreaded script for bulk walking targeted host systems for SNMP data",
      "language": "Perl",
      "price": "Free",
      "online": "False"
    },
    {
      "name": "ssh-audit",
      "website": "https://www.ssh-audit.com/",
      "source": "https://github.com/jtesta/ssh-audit",
      "description": "SSH scanner that detects protocol, version, grab banner, recognize software and operating system, output algorithm information and recommendations",
      "language": "Python",
      "price": "Free",
      "online": "False"
    },
    {
      "name": "Suricata Language Server",
      "website": "https://www.stamus-networks.com/blog/suricata-language-server",
      "source": "https://github.com/StamusNetworks/suricata-language-server",
      "description": "Implementation of the Language Server Protocol for Suricata signatures; real-time rule syntax checking and auto-completion",
      "language": "Python",
      "price": "Free",
      "online": "False"
    },
    {
      "name": "Tsunami",
      "source": "https://github.com/google/tsunami-security-scanner",
      "description": "Network security scanner with an extensible plugin system",
      "language": "Java",
      "price": "Free",
      "online": "False"
    },
    {
      "name": "WebMap v1",
      "source": "https://github.com/PunitTailor55/WebMap",
      "description": "A web dashboard for nmap XML report",
      "language": "Python",
      "price": "Free",
      "online": "False"
    },
    {
      "name": "WebMap v2",
      "source": "https://github.com/Hamza-Megahed/WebMap",
      "description": "A web dashboard for nmap XML report",
      "language": "Python",
      "price": "Free",
      "online": "False"
    },
    {
      "name": "Whonow",
      "source": "https://github.com/brannondorsey/whonow",
      "description": "DNS Server for executing DNS Rebinding attacks",
      "language": "JavaScript",
      "price": "Free",
      "online": "False"
    },
    {
      "name": "windapsearch",
      "source": "https://github.com/ropnop/windapsearch",
      "description": "Script to enumerate users, groups and computers from a Windows domain through LDAP queries",
      "language": "Python",
      "price": "Free",
      "online": "False"
    },
    {
      "name": "Wireshark",
      "website": "https://www.wireshark.org/",
      "source": "https://code.wireshark.org/review/gitweb?p=wireshark.git",
      "description": "Network protocol analyzer",
      "language": "Cplusplus",
      "price": "Free",
      "online": "False"
    },
    {
      "name": "Xprobe2",
      "source": "https://github.com/binarytrails/xprobe2",
      "description": "Remote active operating system fingerprinting",
      "language": "CPlusPlus",
      "price": "Free",
      "online": "False"
    },
    {
      "name": "yersinia",
      "source": "https://github.com/tomac/yersinia",
      "description": "Framework for layer 2 attacks",
      "language": "C",
      "price": "Free",
      "online": "False"
    },
    {
      "name": "Zenmap",
      "website": "https://nmap.org/zenmap/",
      "source": "https://github.com/nmap/nmap/tree/master/zenmap",
      "description": "GUI for Nmap",
      "language": "Python",
      "price": "Free",
      "online": "False"
    },
    {
      "name": "Zmap",
      "website": "https://zmap.io/",
      "source": "https://github.com/zmap/zmap",
      "description": "Collection of tools to scan and study massive networks",
      "language": "C",
      "price": "Free",
      "online": "False"
    }
  ]
}
