<?xml version="1.0" encoding="UTF-8"?>
<svg id="Layer_1" data-name="Layer 1" xmlns="http://www.w3.org/2000/svg" width="500" height="500" viewBox="0 0 500 500">
  <defs>
    <style>
      .cls-1 {
        fill: #fff;
      }
    </style>
  </defs>
  <polygon class="cls-1" points="401.1568 219.58765 98.8432 219.58765 98.8432 232.98969 131.09863 232.98969 131.09863 252.57733 164.98969 252.57733 164.98969 232.98969 335.01031 232.98969 335.01031 252.57733 368.90137 252.57733 368.90137 232.98969 401.1568 232.98969 401.1568 219.58765"/>
  <g>
    <polygon class="cls-1" points="181.35077 241.74261 131.09863 403.09277 244.50073 403.09277 244.50073 241.74261 181.35077 241.74261"/>
    <polygon class="cls-1" points="244.50073 211.91351 244.50073 96.90723 226.45947 96.90723 190.64099 211.91351 244.50073 211.91351"/>
  </g>
  <g>
    <polygon class="cls-1" points="309.35901 211.91351 273.54053 96.90723 255.49927 96.90723 255.49927 211.91351 309.35901 211.91351"/>
    <polygon class="cls-1" points="318.64923 241.74261 255.49927 241.74261 255.49927 403.09277 368.90137 403.09277 318.64923 241.74261"/>
  </g>
</svg>