<?xml version="1.0" encoding="UTF-8" standalone="no"?>
<!-- Created with Inkscape (http://www.inkscape.org/) -->

<svg
   width="32"
   height="32"
   viewBox="0 0 32 32"
   version="1.1"
   id="SVGRoot"
   inkscape:version="1.2.2 (b0a8486541, 2022-12-01)"
   sodipodi:docname="delete.svg"
   xmlns:inkscape="http://www.inkscape.org/namespaces/inkscape"
   xmlns:sodipodi="http://sodipodi.sourceforge.net/DTD/sodipodi-0.dtd"
   xmlns="http://www.w3.org/2000/svg"
   xmlns:svg="http://www.w3.org/2000/svg">
  <sodipodi:namedview
     id="namedview7"
     pagecolor="#ffffff"
     bordercolor="#666666"
     borderopacity="1.0"
     inkscape:pageshadow="2"
     inkscape:pageopacity="0.0"
     inkscape:pagecheckerboard="true"
     inkscape:document-units="px"
     showgrid="true"
     units="px"
     inkscape:showpageshadow="0"
     inkscape:deskcolor="#d1d1d1"
     inkscape:zoom="13.455444"
     inkscape:cx="23.29912"
     inkscape:cy="12.076896"
     inkscape:window-width="1352"
     inkscape:window-height="801"
     inkscape:window-x="493"
     inkscape:window-y="47"
     inkscape:window-maximized="0"
     inkscape:current-layer="layer1">
    <inkscape:grid
       type="xygrid"
       id="grid14"
       empspacing="4"
       dotted="false"
       originx="0"
       originy="0" />
  </sodipodi:namedview>
  <defs
     id="defs2" />
  <g
     inkscape:label="Layer 1"
     inkscape:groupmode="layer"
     id="layer1">
    <path
       id="rect897"
       style="fill:none;fill-opacity:0.992188;fill-rule:evenodd;stroke:#ff0000;stroke-width:2;stroke-dasharray:none;paint-order:fill markers stroke;stop-color:#000000"
       d="m 26,9 v 19 c 0,1.108 -0.892,2 -2,2 H 8 C 6.892,30 6,29.108 6,28 V 9"
       sodipodi:nodetypes="cssssc" />
    <rect
       style="fill:none;fill-opacity:0.992188;fill-rule:evenodd;stroke:#ff0000;stroke-width:2;stroke-dasharray:none;stroke-opacity:1;paint-order:fill markers stroke;stop-color:#000000"
       id="rect2962"
       width="26"
       height="4"
       x="3"
       y="6"
       ry="1.5" />
    <path
       id="path3079"
       style="fill:none;fill-opacity:0.992188;fill-rule:evenodd;stroke:#ff0000;stroke-width:2;stroke-dasharray:none;paint-order:fill markers stroke;stop-color:#000000"
       d="M 20,5 V 4 C 20,2.892 19.108,2 18,2 h -4 c -1.108,0 -2,0.892 -2,2 v 1"
       sodipodi:nodetypes="cssssc" />
    <path
       style="fill:none;stroke:#fb0000;stroke-width:1.5;stroke-linecap:round;stroke-linejoin:miter;stroke-dasharray:none;stroke-opacity:1"
       d="M 11,14 V 26"
       id="path3081"
       sodipodi:nodetypes="cc" />
    <path
       style="fill:none;stroke:#fb0000;stroke-width:1.5;stroke-linecap:round;stroke-linejoin:miter;stroke-dasharray:none;stroke-opacity:1"
       d="M 21,14 V 26"
       id="path3083"
       sodipodi:nodetypes="cc" />
    <path
       style="fill:none;stroke:#fb0000;stroke-width:1.5;stroke-linecap:round;stroke-linejoin:miter;stroke-dasharray:none;stroke-opacity:1"
       d="M 16,14 V 26"
       id="path3085"
       sodipodi:nodetypes="cc" />
  </g>
</svg>
