{
  "pages": [
    {
      "resource_id": "11850",
      "page": 0,
      "main_container": 241,
      "sessions": [
        487,
        494,
        503,
        518,
        528,
        541,
        544
      ]
    },
    {
      "resource_id": "12211",
      "page": 0,
      "main_container": 205,
      "sessions": [
        46,
        134
      ]
    },
    {
      "resource_id": "1249",
      "page": 0,
      "main_container": 1,
      "sessions": [
        100,
        341
      ]
    },
    {
      "resource_id": "1250",
      "page": 0,
      "main_container": 2,
      "sessions": [
        191,
        387
      ]
    },
    {
      "resource_id": "1259",
      "page": 0,
      "main_container": 3,
      "sessions": [
        112,
        334
      ]
    },
    {
      "resource_id": "1260",
      "page": 0,
      "main_container": 4,
      "sessions": [
        279,
        350
      ]
    },
    {
      "resource_id": "1316",
      "page": 0,
      "main_container": 6,
      "sessions": [
        31,
        47
      ]
    },
    {
      "resource_id": "1378",
      "page": 0,
      "main_container": 14,
      "sessions": [
        243,
        319
      ]
    },
    {
      "resource_id": "1396",
      "page": 0,
      "main_container": 17,
      "sessions": [
        38
      ]
    },
    {
      "resource_id": "1397",
      "page": 0,
      "main_container": 18,
      "sessions": [
        206
      ]
    },
    {
      "resource_id": "1421",
      "page": 0,
      "main_container": 25,
      "sessions": [
        488
      ]
    },
    {
      "resource_id": "1421",
      "page": 1,
      "main_container": 25,
      "sessions": []
    },
    {
      "resource_id": "1473",
      "page": 0,
      "main_container": 30,
      "sessions": [
        87,
        177
      ]
    },
    {
      "resource_id": "1474",
      "page": 0,
      "main_container": 31,
      "sessions": [
        318
      ]
    },
    {
      "resource_id": "1532",
      "page": 0,
      "main_container": 36,
      "sessions": [
        136,
        221
      ]
    },
    {
      "resource_id": "1557",
      "page": 0,
      "main_container": 37,
      "sessions": [
        10,
        24
      ]
    },
    {
      "resource_id": "1571",
      "page": 0,
      "main_container": 40,
      "sessions": [
        12,
        26
      ]
    },
    {
      "resource_id": "1577",
      "page": 0,
      "main_container": 43,
      "sessions": [
        14,
        27
      ]
    },
    {
      "resource_id": "1581",
      "page": 0,
      "main_container": 42,
      "sessions": [
        7
      ]
    },
    {
      "resource_id": "16095",
      "page": 0,
      "main_container": 82,
      "sessions": [
        233,
        265
      ]
    },
    {
      "resource_id": "1663",
      "page": 0,
      "main_container": 62,
      "sessions": [
        88,
        256,
        560,
        603
      ]
    },
    {
      "resource_id": "1663",
      "page": 1,
      "main_container": 62,
      "sessions": []
    },
    {
      "resource_id": "1665",
      "page": 0,
      "main_container": 63,
      "sessions": [
        174,
        323,
        409,
        417,
        580,
        626
      ]
    },
    {
      "resource_id": "1665",
      "page": 1,
      "main_container": 63,
      "sessions": []
    },
    {
      "resource_id": "1669",
      "page": 0,
      "main_container": 64,
      "sessions": [
        89,
        257,
        408,
        414,
        561,
        604
      ]
    },
    {
      "resource_id": "1669",
      "page": 1,
      "main_container": 64,
      "sessions": []
    },
    {
      "resource_id": "1688",
      "page": 0,
      "main_container": 65,
      "sessions": [
        143,
        301
      ]
    },
    {
      "resource_id": "1697",
      "page": 0,
      "main_container": 68,
      "sessions": [
        118,
        285
      ]
    },
    {
      "resource_id": "1701",
      "page": 0,
      "main_container": 69,
      "sessions": [
        50,
        218
      ]
    },
    {
      "resource_id": "17151",
      "page": 0,
      "main_container": 38,
      "sessions": [
        11,
        25
      ]
    },
    {
      "resource_id": "17329",
      "page": 0,
      "main_container": 162,
      "sessions": [
        33,
        138,
        611
      ]
    },
    {
      "resource_id": "17330",
      "page": 0,
      "main_container": 163,
      "sessions": [
        247,
        310,
        356
      ]
    },
    {
      "resource_id": "1747",
      "page": 0,
      "main_container": 71,
      "sessions": [
        192,
        342,
        404
      ]
    },
    {
      "resource_id": "1748",
      "page": 0,
      "main_container": 72,
      "sessions": [
        103,
        269,
        405
      ]
    },
    {
      "resource_id": "1750",
      "page": 0,
      "main_container": 73,
      "sessions": [
        238,
        314
      ]
    },
    {
      "resource_id": "1758",
      "page": 0,
      "main_container": 74,
      "sessions": [
        78,
        171
      ]
    },
    {
      "resource_id": "1762",
      "page": 0,
      "main_container": 75,
      "sessions": [
        210,
        376
      ]
    },
    {
      "resource_id": "1764",
      "page": 0,
      "main_container": 76,
      "sessions": [
        124,
        290
      ]
    },
    {
      "resource_id": "1766",
      "page": 0,
      "main_container": 77,
      "sessions": [
        157,
        315
      ]
    },
    {
      "resource_id": "1772",
      "page": 0,
      "main_container": 78,
      "sessions": [
        125,
        126,
        291,
        292
      ]
    },
    {
      "resource_id": "1776",
      "page": 0,
      "main_container": 79,
      "sessions": [
        65,
        151
      ]
    },
    {
      "resource_id": "1801",
      "page": 0,
      "main_container": 81,
      "sessions": [
        157,
        315
      ]
    },
    {
      "resource_id": "1830",
      "page": 0,
      "main_container": 83,
      "sessions": [
        127,
        555,
        571,
        591
      ]
    },
    {
      "resource_id": "1831",
      "page": 0,
      "main_container": 84,
      "sessions": [
        42,
        551,
        596
      ]
    },
    {
      "resource_id": "1832",
      "page": 0,
      "main_container": 85,
      "sessions": [
        152,
        224,
        565,
        585
      ]
    },
    {
      "resource_id": "1833",
      "page": 0,
      "main_container": 87,
      "sessions": [
        184,
        266,
        550,
        553,
        566,
        572,
        586,
        641
      ]
    },
    {
      "resource_id": "1834",
      "page": 0,
      "main_container": 88,
      "sessions": [
        53,
        554
      ]
    },
    {
      "resource_id": "1836",
      "page": 0,
      "main_container": 89,
      "sessions": [
        270,
        567
      ]
    },
    {
      "resource_id": "1839",
      "page": 0,
      "main_container": 90,
      "sessions": [
        193,
        607
      ]
    },
    {
      "resource_id": "1846",
      "page": 0,
      "main_container": 91,
      "sessions": [
        104,
        642
      ]
    },
    {
      "resource_id": "1849",
      "page": 0,
      "main_container": 92,
      "sessions": [
        211,
        589
      ]
    },
    {
      "resource_id": "1855",
      "page": 0,
      "main_container": 93,
      "sessions": [
        246,
        613
      ]
    },
    {
      "resource_id": "2001",
      "page": 0,
      "main_container": 100,
      "sessions": [
        195,
        389
      ]
    },
    {
      "resource_id": "20343",
      "page": 0,
      "main_container": 21,
      "sessions": [
        135,
        205
      ]
    },
    {
      "resource_id": "20344",
      "page": 0,
      "main_container": 22,
      "sessions": [
        244,
        352
      ]
    },
    {
      "resource_id": "2074",
      "page": 0,
      "main_container": 106,
      "sessions": [
        267,
        558,
        559,
        593,
        597,
        608,
        647
      ]
    },
    {
      "resource_id": "2074",
      "page": 1,
      "main_container": 106,
      "sessions": [
        336,
        614,
        620,
        621,
        631
      ]
    },
    {
      "resource_id": "2075",
      "page": 0,
      "main_container": 107,
      "sessions": [
        119,
        120,
        186,
        287,
        337,
        568,
        569,
        583,
        610,
        632
      ]
    },
    {
      "resource_id": "2075",
      "page": 1,
      "main_container": 107,
      "sessions": []
    },
    {
      "resource_id": "2079",
      "page": 0,
      "main_container": 110,
      "sessions": [
        91,
        258,
        570,
        574,
        577,
        578,
        587,
        590,
        594,
        645,
        646
      ]
    },
    {
      "resource_id": "2079",
      "page": 1,
      "main_container": 110,
      "sessions": [
        615,
        616,
        617,
        622
      ]
    },
    {
      "resource_id": "2080",
      "page": 0,
      "main_container": 112,
      "sessions": [
        98,
        106,
        187,
        272,
        564,
        584
      ]
    },
    {
      "resource_id": "2080",
      "page": 1,
      "main_container": 112,
      "sessions": [
        338,
        406,
        633
      ]
    },
    {
      "resource_id": "2081",
      "page": 0,
      "main_container": 113,
      "sessions": [
        295,
        357,
        549,
        552,
        588,
        592,
        612,
        636
      ]
    },
    {
      "resource_id": "2083",
      "page": 0,
      "main_container": 114,
      "sessions": [
        4,
        19
      ]
    },
    {
      "resource_id": "2084",
      "page": 0,
      "main_container": 115,
      "sessions": [
        5,
        20
      ]
    },
    {
      "resource_id": "20864",
      "page": 0,
      "main_container": 183,
      "sessions": [
        71,
        160,
        241,
        317
      ]
    },
    {
      "resource_id": "21237",
      "page": 0,
      "main_container": 263,
      "sessions": [
        79,
        249
      ]
    },
    {
      "resource_id": "2143",
      "page": 0,
      "main_container": 119,
      "sessions": [
        79,
        249
      ]
    },
    {
      "resource_id": "2153",
      "page": 0,
      "main_container": 120,
      "sessions": [
        129,
        213,
        358
      ]
    },
    {
      "resource_id": "2173",
      "page": 0,
      "main_container": 121,
      "sessions": [
        107
      ]
    },
    {
      "resource_id": "2178",
      "page": 0,
      "main_container": 122,
      "sessions": [
        108,
        618
      ]
    },
    {
      "resource_id": "2179",
      "page": 0,
      "main_container": 123,
      "sessions": [
        390,
        637
      ]
    },
    {
      "resource_id": "2183",
      "page": 0,
      "main_container": 124,
      "sessions": [
        395
      ]
    },
    {
      "resource_id": "2184",
      "page": 0,
      "main_container": 125,
      "sessions": [
        196
      ]
    },
    {
      "resource_id": "2187",
      "page": 0,
      "main_container": 128,
      "sessions": [
        400,
        643
      ]
    },
    {
      "resource_id": "2202",
      "page": 0,
      "main_container": 129,
      "sessions": [
        343
      ]
    },
    {
      "resource_id": "2205",
      "page": 0,
      "main_container": 130,
      "sessions": [
        391
      ]
    },
    {
      "resource_id": "2209",
      "page": 0,
      "main_container": 131,
      "sessions": [
        274
      ]
    },
    {
      "resource_id": "2211",
      "page": 0,
      "main_container": 138,
      "sessions": [
        110
      ]
    },
    {
      "resource_id": "2215",
      "page": 0,
      "main_container": 132,
      "sessions": [
        304
      ]
    },
    {
      "resource_id": "2218",
      "page": 0,
      "main_container": 133,
      "sessions": [
        130,
        573
      ]
    },
    {
      "resource_id": "2219",
      "page": 0,
      "main_container": 134,
      "sessions": [
        109
      ]
    },
    {
      "resource_id": "2220",
      "page": 0,
      "main_container": 135,
      "sessions": [
        344
      ]
    },
    {
      "resource_id": "2222",
      "page": 0,
      "main_container": 136,
      "sessions": [
        197
      ]
    },
    {
      "resource_id": "2223",
      "page": 0,
      "main_container": 137,
      "sessions": [
        392
      ]
    },
    {
      "resource_id": "2266",
      "page": 0,
      "main_container": 139,
      "sessions": [
        92,
        259,
        562,
        605
      ]
    },
    {
      "resource_id": "2267",
      "page": 0,
      "main_container": 140,
      "sessions": [
        179,
        328,
        606,
        629
      ]
    },
    {
      "resource_id": "2316",
      "page": 0,
      "main_container": 141,
      "sessions": [
        80,
        396
      ]
    },
    {
      "resource_id": "2317",
      "page": 0,
      "main_container": 142,
      "sessions": [
        250,
        383
      ]
    },
    {
      "resource_id": "2324",
      "page": 0,
      "main_container": 143,
      "sessions": [
        159,
        372
      ]
    },
    {
      "resource_id": "2328",
      "page": 0,
      "main_container": 144,
      "sessions": [
        222
      ]
    },
    {
      "resource_id": "2336",
      "page": 0,
      "main_container": 145,
      "sessions": [
        225,
        373
      ]
    },
    {
      "resource_id": "23411",
      "page": 0,
      "main_container": 328,
      "sessions": [
        61,
        166,
        182,
        279,
        331,
        520
      ]
    },
    {
      "resource_id": "2349",
      "page": 0,
      "main_container": 146,
      "sessions": [
        463
      ]
    },
    {
      "resource_id": "2349",
      "page": 1,
      "main_container": 146,
      "sessions": []
    },
    {
      "resource_id": "2362",
      "page": 0,
      "main_container": 150,
      "sessions": [
        44,
        131,
        296,
        359
      ]
    },
    {
      "resource_id": "23919",
      "page": 0,
      "main_container": 158,
      "sessions": [
        423,
        424,
        430,
        435,
        436,
        442,
        443
      ]
    },
    {
      "resource_id": "23919",
      "page": 1,
      "main_container": 158,
      "sessions": [
        448
      ]
    },
    {
      "resource_id": "2404",
      "page": 0,
      "main_container": 155,
      "sessions": [
        99,
        188,
        602
      ]
    },
    {
      "resource_id": "2405",
      "page": 0,
      "main_container": 156,
      "sessions": [
        251,
        320,
        413,
        416,
        638,
        648
      ]
    },
    {
      "resource_id": "2405",
      "page": 1,
      "main_container": 156,
      "sessions": []
    },
    {
      "resource_id": "2406",
      "page": 0,
      "main_container": 157,
      "sessions": [
        153,
        234,
        312
      ]
    },
    {
      "resource_id": "24515",
      "page": 0,
      "main_container": 148,
      "sessions": [
        465
      ]
    },
    {
      "resource_id": "24515",
      "page": 1,
      "main_container": 148,
      "sessions": []
    },
    {
      "resource_id": "24517",
      "page": 0,
      "main_container": 149,
      "sessions": [
        466
      ]
    },
    {
      "resource_id": "24517",
      "page": 1,
      "main_container": 149,
      "sessions": []
    },
    {
      "resource_id": "24520",
      "page": 0,
      "main_container": 147,
      "sessions": [
        464
      ]
    },
    {
      "resource_id": "24520",
      "page": 1,
      "main_container": 147,
      "sessions": []
    },
    {
      "resource_id": "2466",
      "page": 0,
      "main_container": 159,
      "sessions": [
        240,
        411,
        609
      ]
    },
    {
      "resource_id": "2499",
      "page": 0,
      "main_container": 160,
      "sessions": [
        115
      ]
    },
    {
      "resource_id": "2500",
      "page": 0,
      "main_container": 161,
      "sessions": [
        284
      ]
    },
    {
      "resource_id": "2505",
      "page": 0,
      "main_container": 104,
      "sessions": [
        51,
        137,
        361
      ]
    },
    {
      "resource_id": "2517",
      "page": 0,
      "main_container": 168,
      "sessions": [
        145,
        226,
        366
      ]
    },
    {
      "resource_id": "25230",
      "page": 0,
      "main_container": 32,
      "sessions": [
        63,
        232
      ]
    },
    {
      "resource_id": "25266",
      "page": 0,
      "main_container": 165,
      "sessions": [
        54,
        140
      ]
    },
    {
      "resource_id": "25298",
      "page": 0,
      "main_container": 19,
      "sessions": [
        77,
        326
      ]
    },
    {
      "resource_id": "25299",
      "page": 0,
      "main_container": 20,
      "sessions": [
        49,
        223
      ]
    },
    {
      "resource_id": "2551",
      "page": 0,
      "main_container": 176,
      "sessions": [
        189,
        339,
        634
      ]
    },
    {
      "resource_id": "2553",
      "page": 0,
      "main_container": 177,
      "sessions": [
        214,
        298,
        377
      ]
    },
    {
      "resource_id": "2555",
      "page": 0,
      "main_container": 179,
      "sessions": [
        58,
        148,
        311
      ]
    },
    {
      "resource_id": "2556",
      "page": 0,
      "main_container": 178,
      "sessions": [
        83,
        384
      ]
    },
    {
      "resource_id": "2564",
      "page": 0,
      "main_container": 181,
      "sessions": [
        139,
        302,
        362
      ]
    },
    {
      "resource_id": "2567",
      "page": 0,
      "main_container": 182,
      "sessions": [
        45,
        133,
        216,
        299
      ]
    },
    {
      "resource_id": "2622",
      "page": 0,
      "main_container": 184,
      "sessions": [
        59
      ]
    },
    {
      "resource_id": "2624",
      "page": 0,
      "main_container": 206,
      "sessions": [
        39,
        122
      ]
    },
    {
      "resource_id": "2627",
      "page": 0,
      "main_container": 185,
      "sessions": [
        333
      ]
    },
    {
      "resource_id": "2631",
      "page": 0,
      "main_container": 186,
      "sessions": [
        75
      ]
    },
    {
      "resource_id": "2632",
      "page": 0,
      "main_container": 187,
      "sessions": [
        166,
        330
      ]
    },
    {
      "resource_id": "2634",
      "page": 0,
      "main_container": 188,
      "sessions": [
        385
      ]
    },
    {
      "resource_id": "2635",
      "page": 0,
      "main_container": 189,
      "sessions": [
        86
      ]
    },
    {
      "resource_id": "2640",
      "page": 0,
      "main_container": 191,
      "sessions": [
        55
      ]
    },
    {
      "resource_id": "2646",
      "page": 0,
      "main_container": 192,
      "sessions": [
        182,
        397
      ]
    },
    {
      "resource_id": "2647",
      "page": 0,
      "main_container": 193,
      "sessions": [
        198,
        345
      ]
    },
    {
      "resource_id": "2648",
      "page": 0,
      "main_container": 194,
      "sessions": [
        96,
        331
      ]
    },
    {
      "resource_id": "2649",
      "page": 0,
      "main_container": 195,
      "sessions": [
        393
      ]
    },
    {
      "resource_id": "2650",
      "page": 0,
      "main_container": 196,
      "sessions": [
        61
      ]
    },
    {
      "resource_id": "2657",
      "page": 0,
      "main_container": 197,
      "sessions": [
        199,
        403
      ]
    },
    {
      "resource_id": "2661",
      "page": 0,
      "main_container": 198,
      "sessions": [
        254
      ]
    },
    {
      "resource_id": "2663",
      "page": 0,
      "main_container": 199,
      "sessions": [
        200,
        346
      ]
    },
    {
      "resource_id": "2664",
      "page": 0,
      "main_container": 200,
      "sessions": [
        172
      ]
    },
    {
      "resource_id": "2666",
      "page": 0,
      "main_container": 190,
      "sessions": [
        173,
        322
      ]
    },
    {
      "resource_id": "2668",
      "page": 0,
      "main_container": 202,
      "sessions": [
        149
      ]
    },
    {
      "resource_id": "2670",
      "page": 0,
      "main_container": 203,
      "sessions": [
        162
      ]
    },
    {
      "resource_id": "2671",
      "page": 0,
      "main_container": 204,
      "sessions": [
        141
      ]
    },
    {
      "resource_id": "2721",
      "page": 0,
      "main_container": 207,
      "sessions": [
        183,
        332
      ]
    },
    {
      "resource_id": "2737",
      "page": 0,
      "main_container": 208,
      "sessions": [
        433
      ]
    },
    {
      "resource_id": "2738",
      "page": 0,
      "main_container": 209,
      "sessions": [
        446
      ]
    },
    {
      "resource_id": "2817",
      "page": 0,
      "main_container": 210,
      "sessions": [
        74
      ]
    },
    {
      "resource_id": "2818",
      "page": 0,
      "main_container": 211,
      "sessions": [
        242
      ]
    },
    {
      "resource_id": "2819",
      "page": 0,
      "main_container": 212,
      "sessions": [
        60,
        375
      ]
    },
    {
      "resource_id": "28596",
      "page": 0,
      "main_container": 164,
      "sessions": [
        93,
        264,
        374,
        579
      ]
    },
    {
      "resource_id": "28770",
      "page": 0,
      "main_container": 33,
      "sessions": [
        150,
        371
      ]
    },
    {
      "resource_id": "28771",
      "page": 0,
      "main_container": 34,
      "sessions": [
        207,
        355
      ]
    },
    {
      "resource_id": "2880",
      "page": 0,
      "main_container": 220,
      "sessions": [
        438
      ]
    },
    {
      "resource_id": "2884",
      "page": 0,
      "main_container": 221,
      "sessions": [
        276,
        598,
        627
      ]
    },
    {
      "resource_id": "2887",
      "page": 0,
      "main_container": 222,
      "sessions": [
        84,
        563
      ]
    },
    {
      "resource_id": "2889",
      "page": 0,
      "main_container": 223,
      "sessions": [
        277,
        599
      ]
    },
    {
      "resource_id": "2890",
      "page": 0,
      "main_container": 225,
      "sessions": [
        202,
        640
      ]
    },
    {
      "resource_id": "2892",
      "page": 0,
      "main_container": 226,
      "sessions": [
        347,
        623
      ]
    },
    {
      "resource_id": "2893",
      "page": 0,
      "main_container": 224,
      "sessions": [
        201,
        575
      ]
    },
    {
      "resource_id": "2900",
      "page": 0,
      "main_container": 227,
      "sessions": [
        278,
        600
      ]
    },
    {
      "resource_id": "2901",
      "page": 0,
      "main_container": 228,
      "sessions": [
        111,
        556
      ]
    },
    {
      "resource_id": "2916",
      "page": 0,
      "main_container": 230,
      "sessions": [
        97,
        581
      ]
    },
    {
      "resource_id": "2917",
      "page": 0,
      "main_container": 231,
      "sessions": [
        72,
        595
      ]
    },
    {
      "resource_id": "2921",
      "page": 0,
      "main_container": 232,
      "sessions": [
        170,
        619
      ]
    },
    {
      "resource_id": "2927",
      "page": 0,
      "main_container": 233,
      "sessions": [
        401,
        644
      ]
    },
    {
      "resource_id": "2941",
      "page": 0,
      "main_container": 234,
      "sessions": [
        399,
        548
      ]
    },
    {
      "resource_id": "29538",
      "page": 0,
      "main_container": 126,
      "sessions": [
        402
      ]
    },
    {
      "resource_id": "2963",
      "page": 0,
      "main_container": 235,
      "sessions": [
        85,
        576,
        601
      ]
    },
    {
      "resource_id": "29649",
      "page": 0,
      "main_container": 105,
      "sessions": [
        185,
        335
      ]
    },
    {
      "resource_id": "2989",
      "page": 0,
      "main_container": 238,
      "sessions": [
        6,
        21
      ]
    },
    {
      "resource_id": "2990",
      "page": 0,
      "main_container": 239,
      "sessions": [
        15,
        28,
        29
      ]
    },
    {
      "resource_id": "33212",
      "page": 0,
      "main_container": 297,
      "sessions": [
        496,
        506,
        531,
        542
      ]
    },
    {
      "resource_id": "33213",
      "page": 0,
      "main_container": 298,
      "sessions": [
        496,
        506,
        531,
        542,
        587,
        590,
        594
      ]
    },
    {
      "resource_id": "3339",
      "page": 0,
      "main_container": 344,
      "sessions": [
        432,
        445
      ]
    },
    {
      "resource_id": "3341",
      "page": 0,
      "main_container": 256,
      "sessions": [
        294,
        467,
        473,
        479,
        490,
        499,
        512,
        524,
        536
      ]
    },
    {
      "resource_id": "3341",
      "page": 1,
      "main_container": 256,
      "sessions": [
        483
      ]
    },
    {
      "resource_id": "3342",
      "page": 0,
      "main_container": 243,
      "sessions": [
        65,
        151
      ]
    },
    {
      "resource_id": "3343",
      "page": 0,
      "main_container": 244,
      "sessions": [
        45,
        73,
        133,
        171,
        216,
        239,
        293,
        545
      ]
    },
    {
      "resource_id": "3344",
      "page": 0,
      "main_container": 245,
      "sessions": [
        238,
        314
      ]
    },
    {
      "resource_id": "3345",
      "page": 0,
      "main_container": 246,
      "sessions": [
        78,
        124,
        157,
        290,
        315
      ]
    },
    {
      "resource_id": "3349",
      "page": 0,
      "main_container": 247,
      "sessions": [
        210,
        376
      ]
    },
    {
      "resource_id": "3350",
      "page": 0,
      "main_container": 248,
      "sessions": [
        50,
        64,
        218,
        231
      ]
    },
    {
      "resource_id": "3352",
      "page": 0,
      "main_container": 257,
      "sessions": [
        131,
        467,
        473,
        479,
        483
      ]
    },
    {
      "resource_id": "3353",
      "page": 0,
      "main_container": 258,
      "sessions": [
        43,
        128,
        158,
        212,
        299,
        316,
        483
      ]
    },
    {
      "resource_id": "3354",
      "page": 0,
      "main_container": 259,
      "sessions": [
        467,
        473,
        479,
        483
      ]
    },
    {
      "resource_id": "3355",
      "page": 0,
      "main_container": 249,
      "sessions": [
        83,
        384,
        510,
        535
      ]
    },
    {
      "resource_id": "3356",
      "page": 0,
      "main_container": 250,
      "sessions": [
        71,
        145,
        160,
        226,
        241,
        317,
        366,
        415
      ]
    },
    {
      "resource_id": "3358",
      "page": 0,
      "main_container": 251,
      "sessions": [
        51,
        137,
        214,
        298,
        361,
        377
      ]
    },
    {
      "resource_id": "3359",
      "page": 0,
      "main_container": 252,
      "sessions": [
        118,
        143,
        237,
        285,
        301
      ]
    },
    {
      "resource_id": "33629",
      "page": 0,
      "main_container": 214,
      "sessions": [
        52,
        116,
        303
      ]
    },
    {
      "resource_id": "3363",
      "page": 0,
      "main_container": 254,
      "sessions": [
        126,
        292,
        497,
        507,
        521,
        532,
        543
      ]
    },
    {
      "resource_id": "33636",
      "page": 0,
      "main_container": 217,
      "sessions": [
        37,
        114,
        300
      ]
    },
    {
      "resource_id": "3365",
      "page": 0,
      "main_container": 255,
      "sessions": [
        420,
        497,
        507,
        521,
        532,
        543
      ]
    },
    {
      "resource_id": "33684",
      "page": 0,
      "main_container": 15,
      "sessions": [
        219,
        369
      ]
    },
    {
      "resource_id": "33689",
      "page": 0,
      "main_container": 23,
      "sessions": [
        176,
        327
      ]
    },
    {
      "resource_id": "3369",
      "page": 0,
      "main_container": 260,
      "sessions": [
        490,
        499,
        504,
        509,
        512,
        519,
        524,
        536
      ]
    },
    {
      "resource_id": "3369",
      "page": 1,
      "main_container": 260,
      "sessions": []
    },
    {
      "resource_id": "33691",
      "page": 0,
      "main_container": 24,
      "sessions": [
        62,
        286
      ]
    },
    {
      "resource_id": "3370",
      "page": 0,
      "main_container": 261,
      "sessions": [
        70,
        139,
        215,
        498,
        511,
        523
      ]
    },
    {
      "resource_id": "3370",
      "page": 1,
      "main_container": 261,
      "sessions": [
        302,
        359
      ]
    },
    {
      "resource_id": "3371",
      "page": 0,
      "main_container": 262,
      "sessions": [
        44,
        58,
        136,
        148,
        221,
        296,
        311,
        362
      ]
    },
    {
      "resource_id": "3380",
      "page": 0,
      "main_container": 264,
      "sessions": [
        129,
        213,
        358
      ]
    },
    {
      "resource_id": "3400",
      "page": 0,
      "main_container": 275,
      "sessions": [
        421,
        422,
        615,
        646
      ]
    },
    {
      "resource_id": "3401",
      "page": 0,
      "main_container": 276,
      "sessions": [
        616
      ]
    },
    {
      "resource_id": "34059",
      "page": 0,
      "main_container": 39,
      "sessions": [
        3,
        18
      ]
    },
    {
      "resource_id": "3410",
      "page": 0,
      "main_container": 277,
      "sessions": [
        409,
        472,
        476,
        485
      ]
    },
    {
      "resource_id": "3410",
      "page": 1,
      "main_container": 277,
      "sessions": []
    },
    {
      "resource_id": "3411",
      "page": 0,
      "main_container": 285,
      "sessions": [
        99,
        251,
        320,
        430,
        470,
        474,
        478,
        482,
        574,
        602
      ]
    },
    {
      "resource_id": "3411",
      "page": 1,
      "main_container": 285,
      "sessions": [
        484,
        638
      ]
    },
    {
      "resource_id": "3412",
      "page": 0,
      "main_container": 286,
      "sessions": [
        181,
        329,
        435,
        436,
        470,
        474,
        478,
        482,
        558,
        593
      ]
    },
    {
      "resource_id": "3412",
      "page": 1,
      "main_container": 286,
      "sessions": [
        448,
        484
      ]
    },
    {
      "resource_id": "3414",
      "page": 0,
      "main_container": 278,
      "sessions": [
        2,
        9,
        17,
        23
      ]
    },
    {
      "resource_id": "3415",
      "page": 0,
      "main_container": 279,
      "sessions": [
        408,
        430,
        597,
        621
      ]
    },
    {
      "resource_id": "3416",
      "page": 0,
      "main_container": 284,
      "sessions": [
        13,
        323,
        412,
        414,
        424,
        435,
        626,
        645
      ]
    },
    {
      "resource_id": "3416",
      "page": 1,
      "main_container": 284,
      "sessions": []
    },
    {
      "resource_id": "3417",
      "page": 0,
      "main_container": 287,
      "sessions": [
        3,
        10,
        18,
        24,
        240,
        470,
        474,
        478,
        482,
        484,
        609
      ]
    },
    {
      "resource_id": "3417",
      "page": 1,
      "main_container": 287,
      "sessions": [
        448
      ]
    },
    {
      "resource_id": "3418",
      "page": 0,
      "main_container": 288,
      "sessions": [
        89,
        174,
        245,
        470,
        474,
        478,
        561,
        580,
        604
      ]
    },
    {
      "resource_id": "3418",
      "page": 1,
      "main_container": 288,
      "sessions": [
        257,
        339,
        482,
        484,
        634
      ]
    },
    {
      "resource_id": "3419",
      "page": 0,
      "main_container": 289,
      "sessions": [
        1,
        16,
        417,
        559,
        577
      ]
    },
    {
      "resource_id": "3420",
      "page": 0,
      "main_container": 290,
      "sessions": [
        88,
        263,
        411,
        560,
        578
      ]
    },
    {
      "resource_id": "3420",
      "page": 1,
      "main_container": 290,
      "sessions": []
    },
    {
      "resource_id": "3421",
      "page": 0,
      "main_container": 280,
      "sessions": [
        90,
        189,
        256,
        442,
        603,
        647
      ]
    },
    {
      "resource_id": "3421",
      "page": 1,
      "main_container": 280,
      "sessions": []
    },
    {
      "resource_id": "3422",
      "page": 0,
      "main_container": 281,
      "sessions": [
        188,
        413,
        416,
        423,
        424,
        435,
        436,
        442,
        443
      ]
    },
    {
      "resource_id": "3422",
      "page": 1,
      "main_container": 281,
      "sessions": [
        648
      ]
    },
    {
      "resource_id": "3423",
      "page": 0,
      "main_container": 282,
      "sessions": [
        8,
        22,
        153,
        234,
        312,
        423,
        424,
        430,
        442,
        443
      ]
    },
    {
      "resource_id": "3423",
      "page": 1,
      "main_container": 282,
      "sessions": []
    },
    {
      "resource_id": "3424",
      "page": 0,
      "main_container": 283,
      "sessions": [
        94,
        261,
        622
      ]
    },
    {
      "resource_id": "34388",
      "page": 0,
      "main_container": 109,
      "sessions": [
        181,
        329,
        410,
        418
      ]
    },
    {
      "resource_id": "34392",
      "page": 0,
      "main_container": 108,
      "sessions": [
        90,
        263
      ]
    },
    {
      "resource_id": "3448",
      "page": 0,
      "main_container": 293,
      "sessions": [
        468,
        475,
        481
      ]
    },
    {
      "resource_id": "3449",
      "page": 0,
      "main_container": 294,
      "sessions": [
        119,
        495,
        505,
        522,
        530,
        533,
        568,
        614
      ]
    },
    {
      "resource_id": "3449",
      "page": 1,
      "main_container": 294,
      "sessions": []
    },
    {
      "resource_id": "3450",
      "page": 0,
      "main_container": 295,
      "sessions": [
        120,
        569,
        620
      ]
    },
    {
      "resource_id": "3451",
      "page": 0,
      "main_container": 296,
      "sessions": [
        287,
        570,
        610,
        617
      ]
    },
    {
      "resource_id": "3452",
      "page": 0,
      "main_container": 299,
      "sessions": [
        103,
        269,
        404,
        405
      ]
    },
    {
      "resource_id": "3453",
      "page": 0,
      "main_container": 300,
      "sessions": [
        192,
        342,
        480
      ]
    },
    {
      "resource_id": "3454",
      "page": 0,
      "main_container": 301,
      "sessions": [
        410,
        418,
        469
      ]
    },
    {
      "resource_id": "3455",
      "page": 0,
      "main_container": 302,
      "sessions": [
        106,
        272,
        406
      ]
    },
    {
      "resource_id": "3456",
      "page": 0,
      "main_container": 303,
      "sessions": [
        106,
        272,
        406
      ]
    },
    {
      "resource_id": "3457",
      "page": 0,
      "main_container": 304,
      "sessions": [
        195,
        389,
        526,
        538
      ]
    },
    {
      "resource_id": "3458",
      "page": 0,
      "main_container": 305,
      "sessions": [
        419,
        428,
        434,
        439,
        514
      ]
    },
    {
      "resource_id": "3459",
      "page": 0,
      "main_container": 306,
      "sessions": [
        101,
        388,
        515,
        652
      ]
    },
    {
      "resource_id": "3460",
      "page": 0,
      "main_container": 307,
      "sessions": [
        195,
        389,
        526,
        538
      ]
    },
    {
      "resource_id": "3461",
      "page": 0,
      "main_container": 308,
      "sessions": [
        429,
        440
      ]
    },
    {
      "resource_id": "3462",
      "page": 0,
      "main_container": 309,
      "sessions": [
        101,
        388,
        515,
        652
      ]
    },
    {
      "resource_id": "3463",
      "page": 0,
      "main_container": 310,
      "sessions": [
        516,
        534,
        539
      ]
    },
    {
      "resource_id": "3463",
      "page": 1,
      "main_container": 310,
      "sessions": []
    },
    {
      "resource_id": "3464",
      "page": 0,
      "main_container": 311,
      "sessions": [
        516,
        534,
        539
      ]
    },
    {
      "resource_id": "3464",
      "page": 1,
      "main_container": 311,
      "sessions": []
    },
    {
      "resource_id": "3465",
      "page": 0,
      "main_container": 312,
      "sessions": [
        502,
        516,
        534,
        539,
        547
      ]
    },
    {
      "resource_id": "3465",
      "page": 1,
      "main_container": 312,
      "sessions": []
    },
    {
      "resource_id": "3466",
      "page": 0,
      "main_container": 313,
      "sessions": [
        502,
        516,
        534,
        539,
        547
      ]
    },
    {
      "resource_id": "3466",
      "page": 1,
      "main_container": 313,
      "sessions": []
    },
    {
      "resource_id": "3477",
      "page": 0,
      "main_container": 314,
      "sessions": [
        91,
        267,
        336,
        493,
        502,
        515,
        529,
        608,
        631
      ]
    },
    {
      "resource_id": "3477",
      "page": 1,
      "main_container": 314,
      "sessions": [
        547
      ]
    },
    {
      "resource_id": "3478",
      "page": 0,
      "main_container": 315,
      "sessions": [
        486
      ]
    },
    {
      "resource_id": "3479",
      "page": 0,
      "main_container": 316,
      "sessions": [
        486
      ]
    },
    {
      "resource_id": "3480",
      "page": 0,
      "main_container": 317,
      "sessions": [
        486
      ]
    },
    {
      "resource_id": "3482",
      "page": 0,
      "main_container": 318,
      "sessions": [
        98,
        564
      ]
    },
    {
      "resource_id": "3482",
      "page": 1,
      "main_container": 318,
      "sessions": []
    },
    {
      "resource_id": "3484",
      "page": 0,
      "main_container": 334,
      "sessions": [
        41,
        66,
        77,
        121,
        144,
        164,
        176,
        223,
        244,
        286,
        305,
        326,
        351,
        369,
        386,
        437
      ]
    },
    {
      "resource_id": "3485",
      "page": 0,
      "main_container": 335,
      "sessions": [
        34,
        36,
        48,
        62,
        81,
        135,
        147,
        165,
        205,
        219,
        230,
        260,
        283,
        306,
        327,
        352,
        360,
        365,
        425,
        431
      ]
    },
    {
      "resource_id": "3491",
      "page": 0,
      "main_container": 265,
      "sessions": [
        168
      ]
    },
    {
      "resource_id": "3496",
      "page": 0,
      "main_container": 336,
      "sessions": [
        35,
        52,
        69,
        93,
        113,
        114,
        140,
        167,
        204,
        220,
        229,
        252,
        264,
        281,
        282,
        300,
        313,
        321,
        356,
        370,
        382,
        579
      ]
    },
    {
      "resource_id": "3496",
      "page": 1,
      "main_container": 336,
      "sessions": []
    },
    {
      "resource_id": "3497",
      "page": 0,
      "main_container": 337,
      "sessions": [
        49,
        60,
        116,
        142,
        156,
        217,
        247,
        303,
        310,
        324,
        353,
        375,
        381,
        426,
        441
      ]
    },
    {
      "resource_id": "3497",
      "page": 1,
      "main_container": 337,
      "sessions": []
    },
    {
      "resource_id": "3504",
      "page": 0,
      "main_container": 266,
      "sessions": [
        491,
        500,
        513,
        525,
        537
      ]
    },
    {
      "resource_id": "3507",
      "page": 0,
      "main_container": 267,
      "sessions": [
        489,
        508
      ]
    },
    {
      "resource_id": "3508",
      "page": 0,
      "main_container": 268,
      "sessions": [
        243,
        319
      ]
    },
    {
      "resource_id": "3511",
      "page": 0,
      "main_container": 269,
      "sessions": [
        30,
        477,
        492,
        501,
        517,
        527,
        540
      ]
    },
    {
      "resource_id": "3511",
      "page": 1,
      "main_container": 269,
      "sessions": []
    },
    {
      "resource_id": "3512",
      "page": 0,
      "main_container": 338,
      "sessions": [
        32,
        57,
        87,
        138,
        150,
        207,
        297,
        355,
        371,
        407,
        611
      ]
    },
    {
      "resource_id": "3513",
      "page": 0,
      "main_container": 339,
      "sessions": [
        56,
        63,
        82,
        123,
        146,
        180,
        227,
        232,
        253,
        309,
        364,
        374,
        444
      ]
    },
    {
      "resource_id": "3514",
      "page": 0,
      "main_container": 340,
      "sessions": [
        37,
        54,
        76,
        117,
        187,
        228,
        248,
        308,
        338,
        363,
        379,
        546,
        584,
        633
      ]
    },
    {
      "resource_id": "3514",
      "page": 1,
      "main_container": 340,
      "sessions": []
    },
    {
      "resource_id": "35161",
      "page": 0,
      "main_container": 44,
      "sessions": [
        178
      ]
    },
    {
      "resource_id": "3526",
      "page": 0,
      "main_container": 341,
      "sessions": [
        433,
        446
      ]
    },
    {
      "resource_id": "3527",
      "page": 0,
      "main_container": 342,
      "sessions": [
        33,
        169,
        208,
        289,
        380
      ]
    },
    {
      "resource_id": "3528",
      "page": 0,
      "main_container": 343,
      "sessions": [
        40,
        68,
        102,
        155,
        209,
        236,
        268,
        288,
        354,
        378
      ]
    },
    {
      "resource_id": "3534",
      "page": 0,
      "main_container": 270,
      "sessions": [
        175,
        203,
        225,
        255,
        280,
        325,
        349,
        373
      ]
    },
    {
      "resource_id": "3559",
      "page": 0,
      "main_container": 272,
      "sessions": [
        80,
        250,
        383,
        396
      ]
    },
    {
      "resource_id": "3562",
      "page": 0,
      "main_container": 274,
      "sessions": [
        31,
        47,
        159,
        185,
        335,
        372
      ]
    },
    {
      "resource_id": "3564",
      "page": 0,
      "main_container": 319,
      "sessions": [
        111,
        154,
        193,
        278,
        343,
        399,
        402,
        549,
        552,
        556,
        567,
        588,
        600,
        618
      ]
    },
    {
      "resource_id": "3565",
      "page": 0,
      "main_container": 320,
      "sessions": [
        53,
        72,
        96,
        141,
        199,
        304,
        346,
        438,
        595,
        637,
        641,
        642
      ]
    },
    {
      "resource_id": "3566",
      "page": 0,
      "main_container": 321,
      "sessions": [
        39,
        112,
        122,
        196,
        275,
        347,
        395,
        401,
        550,
        555,
        571,
        591,
        599,
        623,
        644
      ]
    },
    {
      "resource_id": "3567",
      "page": 0,
      "main_container": 322,
      "sessions": [
        42,
        86,
        173,
        224,
        277,
        344,
        385,
        393,
        548,
        551,
        566,
        572,
        585,
        596
      ]
    },
    {
      "resource_id": "3567",
      "page": 1,
      "main_container": 322,
      "sessions": []
    },
    {
      "resource_id": "3568",
      "page": 0,
      "main_container": 323,
      "sessions": [
        55,
        108,
        130,
        200,
        246,
        265,
        334,
        350,
        392,
        397,
        400,
        554,
        573,
        575,
        589,
        613,
        643
      ]
    },
    {
      "resource_id": "3569",
      "page": 0,
      "main_container": 324,
      "sessions": [
        59,
        85,
        132,
        152,
        178,
        270,
        330,
        394,
        586,
        592,
        601
      ]
    },
    {
      "resource_id": "3570",
      "page": 0,
      "main_container": 325,
      "sessions": [
        75,
        109,
        162,
        198,
        211,
        233,
        276,
        333,
        390,
        565,
        598,
        612,
        636
      ]
    },
    {
      "resource_id": "3575",
      "page": 0,
      "main_container": 329,
      "sessions": [
        107,
        345
      ]
    },
    {
      "resource_id": "3576",
      "page": 0,
      "main_container": 330,
      "sessions": [
        170,
        640
      ]
    },
    {
      "resource_id": "3577",
      "page": 0,
      "main_container": 331,
      "sessions": [
        110,
        201,
        322,
        607
      ]
    },
    {
      "resource_id": "3578",
      "page": 0,
      "main_container": 332,
      "sessions": [
        46,
        67,
        100,
        134,
        149,
        191,
        254,
        341,
        387,
        398,
        403,
        520
      ]
    },
    {
      "resource_id": "3583",
      "page": 0,
      "main_container": 347,
      "sessions": [
        172,
        235,
        307,
        368
      ]
    },
    {
      "resource_id": "3588",
      "page": 0,
      "main_container": 348,
      "sessions": [
        97,
        581
      ]
    },
    {
      "resource_id": "3589",
      "page": 0,
      "main_container": 349,
      "sessions": [
        163,
        557,
        576,
        627
      ]
    },
    {
      "resource_id": "3590",
      "page": 0,
      "main_container": 350,
      "sessions": [
        619
      ]
    },
    {
      "resource_id": "3607",
      "page": 0,
      "main_container": 351,
      "sessions": [
        38,
        74,
        115,
        177,
        206,
        242,
        284,
        318
      ]
    },
    {
      "resource_id": "3608",
      "page": 0,
      "main_container": 352,
      "sessions": [
        367
      ]
    },
    {
      "resource_id": "36287",
      "page": 0,
      "main_container": 215,
      "sessions": [
        76,
        282,
        370
      ]
    },
    {
      "resource_id": "36289",
      "page": 0,
      "main_container": 218,
      "sessions": [
        167,
        227,
        313
      ]
    },
    {
      "resource_id": "36298",
      "page": 0,
      "main_container": 219,
      "sessions": [
        252,
        382
      ]
    },
    {
      "resource_id": "37348",
      "page": 0,
      "main_container": 111,
      "sessions": [
        94,
        245,
        261,
        412
      ]
    },
    {
      "resource_id": "41309",
      "page": 0,
      "main_container": 171,
      "sessions": [
        204,
        281,
        324
      ]
    },
    {
      "resource_id": "41310",
      "page": 0,
      "main_container": 169,
      "sessions": [
        81,
        165,
        351
      ]
    },
    {
      "resource_id": "41311",
      "page": 0,
      "main_container": 172,
      "sessions": [
        32,
        56,
        306
      ]
    },
    {
      "resource_id": "41508",
      "page": 0,
      "main_container": 16,
      "sessions": [
        48,
        305
      ]
    },
    {
      "resource_id": "41777",
      "page": 0,
      "main_container": 29,
      "sessions": [
        35,
        220
      ]
    },
    {
      "resource_id": "42159",
      "page": 0,
      "main_container": 67,
      "sessions": [
        237
      ]
    },
    {
      "resource_id": "42227",
      "page": 0,
      "main_container": 273,
      "sessions": [
        449,
        451,
        452
      ]
    },
    {
      "resource_id": "42606",
      "page": 0,
      "main_container": 45,
      "sessions": [
        67,
        154
      ]
    },
    {
      "resource_id": "43831",
      "page": 0,
      "main_container": 170,
      "sessions": [
        66,
        235,
        368
      ]
    },
    {
      "resource_id": "43832",
      "page": 0,
      "main_container": 174,
      "sessions": [
        113,
        248,
        386
      ]
    },
    {
      "resource_id": "43834",
      "page": 0,
      "main_container": 173,
      "sessions": [
        36,
        121,
        260
      ]
    },
    {
      "resource_id": "44441",
      "page": 0,
      "main_container": 86,
      "sessions": [
        394,
        557
      ]
    },
    {
      "resource_id": "45872",
      "page": 0,
      "main_container": 292,
      "sessions": [
        183,
        332
      ]
    },
    {
      "resource_id": "47407",
      "page": 0,
      "main_container": 13,
      "sessions": [
        454,
        456,
        458,
        460,
        462
      ]
    },
    {
      "resource_id": "48690",
      "page": 0,
      "main_container": 175,
      "sessions": [
        34,
        82,
        228
      ]
    },
    {
      "resource_id": "50856",
      "page": 0,
      "main_container": 167,
      "sessions": [
        147,
        297
      ]
    },
    {
      "resource_id": "50857",
      "page": 0,
      "main_container": 166,
      "sessions": [
        253,
        321
      ]
    },
    {
      "resource_id": "51903",
      "page": 0,
      "main_container": 10,
      "sessions": [
        168
      ]
    },
    {
      "resource_id": "51909",
      "page": 0,
      "main_container": 11,
      "sessions": [
        449,
        451,
        452
      ]
    },
    {
      "resource_id": "51910",
      "page": 0,
      "main_container": 12,
      "sessions": [
        453,
        455,
        457,
        459,
        461
      ]
    },
    {
      "resource_id": "5207",
      "page": 0,
      "main_container": 80,
      "sessions": [
        239,
        293
      ]
    },
    {
      "resource_id": "54690",
      "page": 0,
      "main_container": 116,
      "sessions": [
        164,
        230,
        360
      ]
    },
    {
      "resource_id": "54899",
      "page": 0,
      "main_container": 291,
      "sessions": [
        471
      ]
    },
    {
      "resource_id": "55714",
      "page": 0,
      "main_container": 50,
      "sessions": [
        57,
        146,
        309
      ]
    },
    {
      "resource_id": "55716",
      "page": 0,
      "main_container": 51,
      "sessions": [
        169,
        208
      ]
    },
    {
      "resource_id": "55717",
      "page": 0,
      "main_container": 53,
      "sessions": [
        68,
        229
      ]
    },
    {
      "resource_id": "57548",
      "page": 0,
      "main_container": 28,
      "sessions": [
        426,
        441
      ]
    },
    {
      "resource_id": "57896",
      "page": 0,
      "main_container": 52,
      "sessions": [
        40,
        364,
        407
      ]
    },
    {
      "resource_id": "57898",
      "page": 0,
      "main_container": 54,
      "sessions": [
        283,
        353
      ]
    },
    {
      "resource_id": "58472",
      "page": 0,
      "main_container": 240,
      "sessions": [
        190,
        340,
        635
      ]
    },
    {
      "resource_id": "61796",
      "page": 0,
      "main_container": 117,
      "sessions": [
        144,
        307,
        365
      ]
    },
    {
      "resource_id": "62596",
      "page": 0,
      "main_container": 55,
      "sessions": [
        123,
        367
      ]
    },
    {
      "resource_id": "62597",
      "page": 0,
      "main_container": 56,
      "sessions": [
        180,
        380
      ]
    },
    {
      "resource_id": "62598",
      "page": 0,
      "main_container": 59,
      "sessions": [
        155,
        288
      ]
    },
    {
      "resource_id": "62599",
      "page": 0,
      "main_container": 60,
      "sessions": [
        41,
        209
      ]
    },
    {
      "resource_id": "62602",
      "page": 0,
      "main_container": 57,
      "sessions": [
        69,
        236
      ]
    },
    {
      "resource_id": "64688",
      "page": 0,
      "main_container": 58,
      "sessions": [
        102,
        268
      ]
    },
    {
      "resource_id": "65521",
      "page": 0,
      "main_container": 96,
      "sessions": [
        582,
        628,
        630
      ]
    },
    {
      "resource_id": "6881",
      "page": 0,
      "main_container": 101,
      "sessions": [
        128,
        212,
        294,
        415
      ]
    },
    {
      "resource_id": "68995",
      "page": 0,
      "main_container": 46,
      "sessions": [
        163
      ]
    },
    {
      "resource_id": "69017",
      "page": 0,
      "main_container": 61,
      "sessions": [
        156,
        289
      ]
    },
    {
      "resource_id": "69026",
      "page": 0,
      "main_container": 48,
      "sessions": [
        354
      ]
    },
    {
      "resource_id": "69795",
      "page": 0,
      "main_container": 127,
      "sessions": [
        273
      ]
    },
    {
      "resource_id": "71194",
      "page": 0,
      "main_container": 49,
      "sessions": [
        378
      ]
    },
    {
      "resource_id": "71531",
      "page": 0,
      "main_container": 201,
      "sessions": [
        275,
        398
      ]
    },
    {
      "resource_id": "72449",
      "page": 0,
      "main_container": 353,
      "sessions": [
        105,
        194,
        271
      ]
    },
    {
      "resource_id": "73842",
      "page": 0,
      "main_container": 97,
      "sessions": [
        105
      ]
    },
    {
      "resource_id": "73843",
      "page": 0,
      "main_container": 98,
      "sessions": [
        194
      ]
    },
    {
      "resource_id": "73844",
      "page": 0,
      "main_container": 99,
      "sessions": [
        271
      ]
    },
    {
      "resource_id": "74145",
      "page": 0,
      "main_container": 41,
      "sessions": [
        13
      ]
    },
    {
      "resource_id": "79827",
      "page": 0,
      "main_container": 26,
      "sessions": [
        425,
        437
      ]
    },
    {
      "resource_id": "79828",
      "page": 0,
      "main_container": 27,
      "sessions": [
        431,
        444
      ]
    },
    {
      "resource_id": "79833",
      "page": 0,
      "main_container": 213,
      "sessions": [
        217,
        381
      ]
    },
    {
      "resource_id": "79870",
      "page": 0,
      "main_container": 5,
      "sessions": [
        117,
        308,
        379
      ]
    },
    {
      "resource_id": "79910",
      "page": 0,
      "main_container": 154,
      "sessions": [
        132
      ]
    },
    {
      "resource_id": "79942",
      "page": 0,
      "main_container": 152,
      "sessions": [
        95,
        625
      ]
    },
    {
      "resource_id": "79944",
      "page": 0,
      "main_container": 153,
      "sessions": [
        262,
        639
      ]
    },
    {
      "resource_id": "81163",
      "page": 0,
      "main_container": 216,
      "sessions": [
        142,
        363
      ]
    },
    {
      "resource_id": "81251",
      "page": 0,
      "main_container": 236,
      "sessions": [
        348,
        624
      ]
    },
    {
      "resource_id": "81731",
      "page": 0,
      "main_container": 47,
      "sessions": [
        101,
        388
      ]
    },
    {
      "resource_id": "82025",
      "page": 0,
      "main_container": 102,
      "sessions": [
        43,
        158,
        316
      ]
    },
    {
      "resource_id": "82030",
      "page": 0,
      "main_container": 103,
      "sessions": [
        649,
        650,
        651
      ]
    },
    {
      "resource_id": "83474",
      "page": 0,
      "main_container": 237,
      "sessions": [
        2,
        9,
        17,
        23
      ]
    },
    {
      "resource_id": "83476",
      "page": 0,
      "main_container": 35,
      "sessions": [
        1,
        16
      ]
    },
    {
      "resource_id": "83477",
      "page": 0,
      "main_container": 151,
      "sessions": [
        8,
        22
      ]
    },
    {
      "resource_id": "87628",
      "page": 0,
      "main_container": 271,
      "sessions": [
        222
      ]
    },
    {
      "resource_id": "89442",
      "page": 0,
      "main_container": 118,
      "sessions": [
        432,
        445
      ]
    },
    {
      "resource_id": "9109",
      "page": 0,
      "main_container": 66,
      "sessions": [
        161
      ]
    },
    {
      "resource_id": "9111",
      "page": 0,
      "main_container": 70,
      "sessions": [
        64,
        231
      ]
    },
    {
      "resource_id": "9287",
      "page": 0,
      "main_container": 180,
      "sessions": [
        70,
        215
      ]
    },
    {
      "resource_id": "96156",
      "page": 0,
      "main_container": 7,
      "sessions": [
        175,
        255,
        325
      ]
    },
    {
      "resource_id": "96162",
      "page": 0,
      "main_container": 8,
      "sessions": [
        203,
        280,
        349
      ]
    },
    {
      "resource_id": "96166",
      "page": 0,
      "main_container": 9,
      "sessions": [
        450
      ]
    },
    {
      "resource_id": "96341",
      "page": 0,
      "main_container": 94,
      "sessions": [
        428,
        434,
        439
      ]
    },
    {
      "resource_id": "96347",
      "page": 0,
      "main_container": 95,
      "sessions": [
        429,
        440
      ]
    },
    {
      "resource_id": "96406",
      "page": 0,
      "main_container": 229,
      "sessions": [
        427,
        447
      ]
    }
  ]
}