{
  "pages": [
    {
      "resource_id": "12211",
      "page": 0,
      "main_container": 200,
      "sessions": [
        45,
        131
      ]
    },
    {
      "resource_id": "1249",
      "page": 0,
      "main_container": 1,
      "sessions": [
        99,
        332
      ]
    },
    {
      "resource_id": "1250",
      "page": 0,
      "main_container": 2,
      "sessions": [
        186,
        380
      ]
    },
    {
      "resource_id": "1259",
      "page": 0,
      "main_container": 3,
      "sessions": [
        111,
        325
      ]
    },
    {
      "resource_id": "1260",
      "page": 0,
      "main_container": 4,
      "sessions": [
        271,
        341
      ]
    },
    {
      "resource_id": "1316",
      "page": 0,
      "main_container": 6,
      "sessions": [
        31,
        46
      ]
    },
    {
      "resource_id": "1378",
      "page": 0,
      "main_container": 14,
      "sessions": [
        237,
        310
      ]
    },
    {
      "resource_id": "1396",
      "page": 0,
      "main_container": 17,
      "sessions": [
        38
      ]
    },
    {
      "resource_id": "1397",
      "page": 0,
      "main_container": 18,
      "sessions": [
        201
      ]
    },
    {
      "resource_id": "1421",
      "page": 0,
      "main_container": 25,
      "sessions": [
        454
      ]
    },
    {
      "resource_id": "1421",
      "page": 1,
      "main_container": 25,
      "sessions": []
    },
    {
      "resource_id": "1473",
      "page": 0,
      "main_container": 30,
      "sessions": [
        86,
        172
      ]
    },
    {
      "resource_id": "1474",
      "page": 0,
      "main_container": 31,
      "sessions": [
        309
      ]
    },
    {
      "resource_id": "1532",
      "page": 0,
      "main_container": 36,
      "sessions": [
        133,
        216
      ]
    },
    {
      "resource_id": "1557",
      "page": 0,
      "main_container": 37,
      "sessions": [
        10,
        24
      ]
    },
    {
      "resource_id": "1571",
      "page": 0,
      "main_container": 40,
      "sessions": [
        12,
        26
      ]
    },
    {
      "resource_id": "1577",
      "page": 0,
      "main_container": 43,
      "sessions": [
        14,
        27
      ]
    },
    {
      "resource_id": "1581",
      "page": 0,
      "main_container": 42,
      "sessions": [
        7
      ]
    },
    {
      "resource_id": "16095",
      "page": 0,
      "main_container": 82,
      "sessions": [
        228,
        258
      ]
    },
    {
      "resource_id": "1663",
      "page": 0,
      "main_container": 62,
      "sessions": [
        87,
        249,
        493,
        536
      ]
    },
    {
      "resource_id": "1663",
      "page": 1,
      "main_container": 62,
      "sessions": []
    },
    {
      "resource_id": "1665",
      "page": 0,
      "main_container": 63,
      "sessions": [
        169,
        314,
        513,
        557
      ]
    },
    {
      "resource_id": "1665",
      "page": 1,
      "main_container": 63,
      "sessions": []
    },
    {
      "resource_id": "1669",
      "page": 0,
      "main_container": 64,
      "sessions": [
        88,
        250,
        494,
        537
      ]
    },
    {
      "resource_id": "1669",
      "page": 1,
      "main_container": 64,
      "sessions": []
    },
    {
      "resource_id": "1688",
      "page": 0,
      "main_container": 65,
      "sessions": [
        139,
        292
      ]
    },
    {
      "resource_id": "1697",
      "page": 0,
      "main_container": 68,
      "sessions": [
        117,
        277
      ]
    },
    {
      "resource_id": "1701",
      "page": 0,
      "main_container": 69,
      "sessions": [
        49,
        213
      ]
    },
    {
      "resource_id": "17151",
      "page": 0,
      "main_container": 38,
      "sessions": [
        11,
        25
      ]
    },
    {
      "resource_id": "17329",
      "page": 0,
      "main_container": 159,
      "sessions": [
        33,
        135,
        544
      ]
    },
    {
      "resource_id": "17330",
      "page": 0,
      "main_container": 160,
      "sessions": [
        241,
        301,
        347
      ]
    },
    {
      "resource_id": "1747",
      "page": 0,
      "main_container": 71,
      "sessions": [
        187,
        333
      ]
    },
    {
      "resource_id": "1748",
      "page": 0,
      "main_container": 72,
      "sessions": [
        102,
        262,
        396
      ]
    },
    {
      "resource_id": "1750",
      "page": 0,
      "main_container": 73,
      "sessions": [
        233,
        305
      ]
    },
    {
      "resource_id": "1758",
      "page": 0,
      "main_container": 74,
      "sessions": [
        77,
        165
      ]
    },
    {
      "resource_id": "1762",
      "page": 0,
      "main_container": 75,
      "sessions": [
        205,
        369
      ]
    },
    {
      "resource_id": "1764",
      "page": 0,
      "main_container": 76,
      "sessions": [
        122,
        282
      ]
    },
    {
      "resource_id": "1766",
      "page": 0,
      "main_container": 77,
      "sessions": [
        152,
        306
      ]
    },
    {
      "resource_id": "1772",
      "page": 0,
      "main_container": 78,
      "sessions": [
        123,
        124,
        283,
        284
      ]
    },
    {
      "resource_id": "1776",
      "page": 0,
      "main_container": 79,
      "sessions": [
        64,
        147
      ]
    },
    {
      "resource_id": "1801",
      "page": 0,
      "main_container": 81,
      "sessions": [
        152,
        306
      ]
    },
    {
      "resource_id": "1830",
      "page": 0,
      "main_container": 83,
      "sessions": [
        125,
        487,
        503,
        506,
        523
      ]
    },
    {
      "resource_id": "1831",
      "page": 0,
      "main_container": 84,
      "sessions": [
        42,
        483,
        528
      ]
    },
    {
      "resource_id": "1832",
      "page": 0,
      "main_container": 85,
      "sessions": [
        30,
        148,
        219,
        498,
        517
      ]
    },
    {
      "resource_id": "1832",
      "page": 1,
      "main_container": 85,
      "sessions": []
    },
    {
      "resource_id": "1833",
      "page": 0,
      "main_container": 87,
      "sessions": [
        179,
        259,
        482,
        485,
        499,
        504,
        518,
        571
      ]
    },
    {
      "resource_id": "1834",
      "page": 0,
      "main_container": 88,
      "sessions": [
        52,
        486
      ]
    },
    {
      "resource_id": "1836",
      "page": 0,
      "main_container": 89,
      "sessions": [
        263,
        529
      ]
    },
    {
      "resource_id": "1839",
      "page": 0,
      "main_container": 90,
      "sessions": [
        188,
        540
      ]
    },
    {
      "resource_id": "1846",
      "page": 0,
      "main_container": 91,
      "sessions": [
        103,
        572
      ]
    },
    {
      "resource_id": "1849",
      "page": 0,
      "main_container": 92,
      "sessions": [
        206,
        521
      ]
    },
    {
      "resource_id": "2001",
      "page": 0,
      "main_container": 99,
      "sessions": [
        190,
        382
      ]
    },
    {
      "resource_id": "20343",
      "page": 0,
      "main_container": 21,
      "sessions": [
        132,
        200
      ]
    },
    {
      "resource_id": "20344",
      "page": 0,
      "main_container": 22,
      "sessions": [
        238,
        343
      ]
    },
    {
      "resource_id": "2074",
      "page": 0,
      "main_container": 105,
      "sessions": [
        260,
        490,
        491,
        492,
        525,
        530,
        541
      ]
    },
    {
      "resource_id": "2074",
      "page": 1,
      "main_container": 105,
      "sessions": [
        327,
        546,
        551,
        561
      ]
    },
    {
      "resource_id": "2075",
      "page": 0,
      "main_container": 106,
      "sessions": [
        118,
        181,
        279,
        328,
        501,
        515,
        543,
        562
      ]
    },
    {
      "resource_id": "2075",
      "page": 1,
      "main_container": 106,
      "sessions": []
    },
    {
      "resource_id": "2079",
      "page": 0,
      "main_container": 109,
      "sessions": [
        90,
        251,
        502,
        507,
        510,
        511,
        519,
        522,
        526,
        547,
        548
      ]
    },
    {
      "resource_id": "2079",
      "page": 1,
      "main_container": 109,
      "sessions": [
        552
      ]
    },
    {
      "resource_id": "2080",
      "page": 0,
      "main_container": 111,
      "sessions": [
        97,
        105,
        182,
        265,
        497,
        516
      ]
    },
    {
      "resource_id": "2080",
      "page": 1,
      "main_container": 111,
      "sessions": [
        329,
        563
      ]
    },
    {
      "resource_id": "2081",
      "page": 0,
      "main_container": 112,
      "sessions": [
        287,
        348,
        481,
        484,
        500,
        520,
        524,
        545,
        566
      ]
    },
    {
      "resource_id": "2083",
      "page": 0,
      "main_container": 113,
      "sessions": [
        4,
        19
      ]
    },
    {
      "resource_id": "2084",
      "page": 0,
      "main_container": 114,
      "sessions": [
        5,
        20
      ]
    },
    {
      "resource_id": "20864",
      "page": 0,
      "main_container": 180,
      "sessions": [
        70,
        155,
        236,
        308
      ]
    },
    {
      "resource_id": "21237",
      "page": 0,
      "main_container": 255,
      "sessions": [
        78,
        243
      ]
    },
    {
      "resource_id": "2143",
      "page": 0,
      "main_container": 118,
      "sessions": [
        78,
        243
      ]
    },
    {
      "resource_id": "2153",
      "page": 0,
      "main_container": 119,
      "sessions": [
        127,
        208,
        349
      ]
    },
    {
      "resource_id": "2173",
      "page": 0,
      "main_container": 120,
      "sessions": [
        106
      ]
    },
    {
      "resource_id": "2178",
      "page": 0,
      "main_container": 121,
      "sessions": [
        107,
        549
      ]
    },
    {
      "resource_id": "2179",
      "page": 0,
      "main_container": 122,
      "sessions": [
        383,
        567
      ]
    },
    {
      "resource_id": "2183",
      "page": 0,
      "main_container": 123,
      "sessions": [
        387
      ]
    },
    {
      "resource_id": "2184",
      "page": 0,
      "main_container": 124,
      "sessions": [
        191
      ]
    },
    {
      "resource_id": "2187",
      "page": 0,
      "main_container": 127,
      "sessions": [
        392,
        573
      ]
    },
    {
      "resource_id": "2202",
      "page": 0,
      "main_container": 128,
      "sessions": [
        334
      ]
    },
    {
      "resource_id": "2211",
      "page": 0,
      "main_container": 135,
      "sessions": [
        109
      ]
    },
    {
      "resource_id": "2215",
      "page": 0,
      "main_container": 129,
      "sessions": [
        295
      ]
    },
    {
      "resource_id": "2218",
      "page": 0,
      "main_container": 130,
      "sessions": [
        128,
        505
      ]
    },
    {
      "resource_id": "2219",
      "page": 0,
      "main_container": 131,
      "sessions": [
        108
      ]
    },
    {
      "resource_id": "2220",
      "page": 0,
      "main_container": 132,
      "sessions": [
        335
      ]
    },
    {
      "resource_id": "2222",
      "page": 0,
      "main_container": 133,
      "sessions": [
        192
      ]
    },
    {
      "resource_id": "2223",
      "page": 0,
      "main_container": 134,
      "sessions": [
        384
      ]
    },
    {
      "resource_id": "2266",
      "page": 0,
      "main_container": 136,
      "sessions": [
        91,
        252,
        495,
        538
      ]
    },
    {
      "resource_id": "2267",
      "page": 0,
      "main_container": 137,
      "sessions": [
        174,
        319,
        539,
        559
      ]
    },
    {
      "resource_id": "2316",
      "page": 0,
      "main_container": 138,
      "sessions": [
        79,
        388
      ]
    },
    {
      "resource_id": "2317",
      "page": 0,
      "main_container": 139,
      "sessions": [
        244,
        376
      ]
    },
    {
      "resource_id": "2324",
      "page": 0,
      "main_container": 140,
      "sessions": [
        154,
        365
      ]
    },
    {
      "resource_id": "2328",
      "page": 0,
      "main_container": 141,
      "sessions": [
        217
      ]
    },
    {
      "resource_id": "2336",
      "page": 0,
      "main_container": 142,
      "sessions": [
        220,
        366
      ]
    },
    {
      "resource_id": "23411",
      "page": 0,
      "main_container": 313,
      "sessions": [
        60,
        160,
        177,
        271,
        322
      ]
    },
    {
      "resource_id": "2349",
      "page": 0,
      "main_container": 143,
      "sessions": [
        433
      ]
    },
    {
      "resource_id": "2349",
      "page": 1,
      "main_container": 143,
      "sessions": []
    },
    {
      "resource_id": "2362",
      "page": 0,
      "main_container": 147,
      "sessions": [
        350
      ]
    },
    {
      "resource_id": "23919",
      "page": 0,
      "main_container": 155,
      "sessions": [
        399,
        405,
        408,
        413,
        414,
        418
      ]
    },
    {
      "resource_id": "23919",
      "page": 1,
      "main_container": 155,
      "sessions": []
    },
    {
      "resource_id": "2404",
      "page": 0,
      "main_container": 152,
      "sessions": [
        98,
        183,
        535
      ]
    },
    {
      "resource_id": "2405",
      "page": 0,
      "main_container": 153,
      "sessions": [
        311,
        568
      ]
    },
    {
      "resource_id": "2406",
      "page": 0,
      "main_container": 154,
      "sessions": [
        166,
        229,
        303
      ]
    },
    {
      "resource_id": "24515",
      "page": 0,
      "main_container": 145,
      "sessions": [
        435
      ]
    },
    {
      "resource_id": "24515",
      "page": 1,
      "main_container": 145,
      "sessions": []
    },
    {
      "resource_id": "24517",
      "page": 0,
      "main_container": 146,
      "sessions": [
        436
      ]
    },
    {
      "resource_id": "24517",
      "page": 1,
      "main_container": 146,
      "sessions": []
    },
    {
      "resource_id": "24520",
      "page": 0,
      "main_container": 144,
      "sessions": [
        434
      ]
    },
    {
      "resource_id": "24520",
      "page": 1,
      "main_container": 144,
      "sessions": []
    },
    {
      "resource_id": "2466",
      "page": 0,
      "main_container": 156,
      "sessions": [
        235,
        542
      ]
    },
    {
      "resource_id": "2499",
      "page": 0,
      "main_container": 157,
      "sessions": [
        114
      ]
    },
    {
      "resource_id": "2500",
      "page": 0,
      "main_container": 158,
      "sessions": [
        276
      ]
    },
    {
      "resource_id": "2505",
      "page": 0,
      "main_container": 103,
      "sessions": [
        50,
        134,
        354
      ]
    },
    {
      "resource_id": "2517",
      "page": 0,
      "main_container": 165,
      "sessions": [
        141,
        221,
        359
      ]
    },
    {
      "resource_id": "25230",
      "page": 0,
      "main_container": 32,
      "sessions": [
        62,
        227
      ]
    },
    {
      "resource_id": "25266",
      "page": 0,
      "main_container": 162,
      "sessions": [
        53,
        137
      ]
    },
    {
      "resource_id": "25298",
      "page": 0,
      "main_container": 19,
      "sessions": [
        76,
        317
      ]
    },
    {
      "resource_id": "25299",
      "page": 0,
      "main_container": 20,
      "sessions": [
        48,
        218
      ]
    },
    {
      "resource_id": "2551",
      "page": 0,
      "main_container": 173,
      "sessions": [
        184,
        330,
        564
      ]
    },
    {
      "resource_id": "2553",
      "page": 0,
      "main_container": 174,
      "sessions": [
        209,
        289,
        370
      ]
    },
    {
      "resource_id": "2555",
      "page": 0,
      "main_container": 176,
      "sessions": [
        57,
        144,
        302
      ]
    },
    {
      "resource_id": "2556",
      "page": 0,
      "main_container": 175,
      "sessions": [
        82,
        377
      ]
    },
    {
      "resource_id": "2564",
      "page": 0,
      "main_container": 178,
      "sessions": [
        136,
        293,
        355
      ]
    },
    {
      "resource_id": "2567",
      "page": 0,
      "main_container": 179,
      "sessions": [
        44,
        130,
        211,
        290
      ]
    },
    {
      "resource_id": "2622",
      "page": 0,
      "main_container": 181,
      "sessions": [
        58
      ]
    },
    {
      "resource_id": "2624",
      "page": 0,
      "main_container": 201,
      "sessions": [
        39,
        120
      ]
    },
    {
      "resource_id": "2627",
      "page": 0,
      "main_container": 182,
      "sessions": [
        324
      ]
    },
    {
      "resource_id": "2631",
      "page": 0,
      "main_container": 183,
      "sessions": [
        74
      ]
    },
    {
      "resource_id": "2632",
      "page": 0,
      "main_container": 184,
      "sessions": [
        160,
        321
      ]
    },
    {
      "resource_id": "2634",
      "page": 0,
      "main_container": 185,
      "sessions": [
        378
      ]
    },
    {
      "resource_id": "2635",
      "page": 0,
      "main_container": 186,
      "sessions": [
        85
      ]
    },
    {
      "resource_id": "2640",
      "page": 0,
      "main_container": 188,
      "sessions": [
        54
      ]
    },
    {
      "resource_id": "2646",
      "page": 0,
      "main_container": 189,
      "sessions": [
        177,
        389
      ]
    },
    {
      "resource_id": "2647",
      "page": 0,
      "main_container": 190,
      "sessions": [
        193,
        336
      ]
    },
    {
      "resource_id": "2648",
      "page": 0,
      "main_container": 191,
      "sessions": [
        95,
        322
      ]
    },
    {
      "resource_id": "2649",
      "page": 0,
      "main_container": 192,
      "sessions": [
        385
      ]
    },
    {
      "resource_id": "2650",
      "page": 0,
      "main_container": 193,
      "sessions": [
        60
      ]
    },
    {
      "resource_id": "2657",
      "page": 0,
      "main_container": 194,
      "sessions": [
        194,
        395
      ]
    },
    {
      "resource_id": "2661",
      "page": 0,
      "main_container": 195,
      "sessions": [
        247
      ]
    },
    {
      "resource_id": "2663",
      "page": 0,
      "main_container": 196,
      "sessions": [
        195,
        337
      ]
    },
    {
      "resource_id": "2664",
      "page": 0,
      "main_container": 197,
      "sessions": [
        167
      ]
    },
    {
      "resource_id": "2666",
      "page": 0,
      "main_container": 187,
      "sessions": [
        168,
        313
      ]
    },
    {
      "resource_id": "2668",
      "page": 0,
      "main_container": 199,
      "sessions": [
        145
      ]
    },
    {
      "resource_id": "2721",
      "page": 0,
      "main_container": 202,
      "sessions": [
        178,
        323
      ]
    },
    {
      "resource_id": "2817",
      "page": 0,
      "main_container": 203,
      "sessions": [
        73
      ]
    },
    {
      "resource_id": "2818",
      "page": 0,
      "main_container": 204,
      "sessions": [
        351
      ]
    },
    {
      "resource_id": "2819",
      "page": 0,
      "main_container": 205,
      "sessions": [
        59,
        368
      ]
    },
    {
      "resource_id": "28596",
      "page": 0,
      "main_container": 161,
      "sessions": [
        92,
        257,
        367,
        512
      ]
    },
    {
      "resource_id": "28770",
      "page": 0,
      "main_container": 33,
      "sessions": [
        146,
        364
      ]
    },
    {
      "resource_id": "28771",
      "page": 0,
      "main_container": 34,
      "sessions": [
        202,
        346
      ]
    },
    {
      "resource_id": "2880",
      "page": 0,
      "main_container": 213,
      "sessions": [
        410
      ]
    },
    {
      "resource_id": "2884",
      "page": 0,
      "main_container": 214,
      "sessions": [
        268,
        531,
        553,
        558
      ]
    },
    {
      "resource_id": "2887",
      "page": 0,
      "main_container": 215,
      "sessions": [
        83,
        496
      ]
    },
    {
      "resource_id": "2889",
      "page": 0,
      "main_container": 216,
      "sessions": [
        269,
        532
      ]
    },
    {
      "resource_id": "2890",
      "page": 0,
      "main_container": 218,
      "sessions": [
        197,
        570
      ]
    },
    {
      "resource_id": "2892",
      "page": 0,
      "main_container": 219,
      "sessions": [
        338,
        554
      ]
    },
    {
      "resource_id": "2893",
      "page": 0,
      "main_container": 217,
      "sessions": [
        196,
        508
      ]
    },
    {
      "resource_id": "2900",
      "page": 0,
      "main_container": 220,
      "sessions": [
        270,
        533
      ]
    },
    {
      "resource_id": "2901",
      "page": 0,
      "main_container": 221,
      "sessions": [
        110,
        488
      ]
    },
    {
      "resource_id": "2916",
      "page": 0,
      "main_container": 223,
      "sessions": [
        96,
        514
      ]
    },
    {
      "resource_id": "2917",
      "page": 0,
      "main_container": 224,
      "sessions": [
        71,
        527
      ]
    },
    {
      "resource_id": "2921",
      "page": 0,
      "main_container": 225,
      "sessions": [
        164,
        550
      ]
    },
    {
      "resource_id": "2927",
      "page": 0,
      "main_container": 226,
      "sessions": [
        393,
        574
      ]
    },
    {
      "resource_id": "2941",
      "page": 0,
      "main_container": 227,
      "sessions": [
        391,
        480
      ]
    },
    {
      "resource_id": "29538",
      "page": 0,
      "main_container": 125,
      "sessions": [
        394
      ]
    },
    {
      "resource_id": "2963",
      "page": 0,
      "main_container": 228,
      "sessions": [
        84,
        509,
        534
      ]
    },
    {
      "resource_id": "29649",
      "page": 0,
      "main_container": 104,
      "sessions": [
        180,
        326
      ]
    },
    {
      "resource_id": "2989",
      "page": 0,
      "main_container": 231,
      "sessions": [
        6,
        21
      ]
    },
    {
      "resource_id": "2990",
      "page": 0,
      "main_container": 232,
      "sessions": [
        15,
        28,
        29
      ]
    },
    {
      "resource_id": "33213",
      "page": 0,
      "main_container": 286,
      "sessions": [
        398,
        519,
        522,
        526
      ]
    },
    {
      "resource_id": "3339",
      "page": 0,
      "main_container": 328,
      "sessions": [
        407,
        416
      ]
    },
    {
      "resource_id": "3340",
      "page": 0,
      "main_container": 235,
      "sessions": [
        449,
        450
      ]
    },
    {
      "resource_id": "3341",
      "page": 0,
      "main_container": 249,
      "sessions": [
        286,
        437,
        441,
        443,
        446
      ]
    },
    {
      "resource_id": "3342",
      "page": 0,
      "main_container": 236,
      "sessions": [
        64,
        147,
        453
      ]
    },
    {
      "resource_id": "3343",
      "page": 0,
      "main_container": 237,
      "sessions": [
        44,
        72,
        130,
        165,
        211,
        234,
        285
      ]
    },
    {
      "resource_id": "3344",
      "page": 0,
      "main_container": 238,
      "sessions": [
        233,
        305
      ]
    },
    {
      "resource_id": "3345",
      "page": 0,
      "main_container": 239,
      "sessions": [
        77,
        122,
        152,
        282,
        306
      ]
    },
    {
      "resource_id": "3349",
      "page": 0,
      "main_container": 240,
      "sessions": [
        205,
        369
      ]
    },
    {
      "resource_id": "3350",
      "page": 0,
      "main_container": 241,
      "sessions": [
        49,
        63,
        213,
        226,
        452
      ]
    },
    {
      "resource_id": "3352",
      "page": 0,
      "main_container": 250,
      "sessions": [
        437,
        441,
        443,
        446
      ]
    },
    {
      "resource_id": "3353",
      "page": 0,
      "main_container": 251,
      "sessions": [
        43,
        126,
        153,
        207,
        290,
        307,
        446
      ]
    },
    {
      "resource_id": "3354",
      "page": 0,
      "main_container": 252,
      "sessions": [
        437,
        441,
        443,
        446
      ]
    },
    {
      "resource_id": "3355",
      "page": 0,
      "main_container": 242,
      "sessions": [
        82,
        377,
        463,
        474
      ]
    },
    {
      "resource_id": "3356",
      "page": 0,
      "main_container": 243,
      "sessions": [
        70,
        141,
        155,
        221,
        236,
        308,
        359,
        397
      ]
    },
    {
      "resource_id": "3358",
      "page": 0,
      "main_container": 244,
      "sessions": [
        50,
        134,
        209,
        289,
        354,
        370
      ]
    },
    {
      "resource_id": "3359",
      "page": 0,
      "main_container": 245,
      "sessions": [
        117,
        139,
        232,
        277,
        292
      ]
    },
    {
      "resource_id": "33629",
      "page": 0,
      "main_container": 207,
      "sessions": [
        51,
        115,
        294
      ]
    },
    {
      "resource_id": "3363",
      "page": 0,
      "main_container": 247,
      "sessions": [
        124,
        284,
        458,
        462,
        467,
        471,
        477
      ]
    },
    {
      "resource_id": "33636",
      "page": 0,
      "main_container": 210,
      "sessions": [
        37,
        113,
        291
      ]
    },
    {
      "resource_id": "3365",
      "page": 0,
      "main_container": 248,
      "sessions": [
        458,
        462,
        467,
        471,
        477
      ]
    },
    {
      "resource_id": "33684",
      "page": 0,
      "main_container": 15,
      "sessions": [
        214,
        362
      ]
    },
    {
      "resource_id": "33689",
      "page": 0,
      "main_container": 23,
      "sessions": [
        171,
        318
      ]
    },
    {
      "resource_id": "33691",
      "page": 0,
      "main_container": 24,
      "sessions": [
        61,
        278
      ]
    },
    {
      "resource_id": "3370",
      "page": 0,
      "main_container": 253,
      "sessions": [
        69,
        136,
        210,
        293,
        459,
        464,
        468
      ]
    },
    {
      "resource_id": "3370",
      "page": 1,
      "main_container": 253,
      "sessions": [
        350
      ]
    },
    {
      "resource_id": "3371",
      "page": 0,
      "main_container": 254,
      "sessions": [
        57,
        133,
        144,
        216,
        302,
        355,
        451
      ]
    },
    {
      "resource_id": "3380",
      "page": 0,
      "main_container": 256,
      "sessions": [
        127,
        208,
        349
      ]
    },
    {
      "resource_id": "3400",
      "page": 0,
      "main_container": 266,
      "sessions": [
        547
      ]
    },
    {
      "resource_id": "34059",
      "page": 0,
      "main_container": 39,
      "sessions": [
        3,
        18
      ]
    },
    {
      "resource_id": "3410",
      "page": 0,
      "main_container": 267,
      "sessions": [
        440,
        448
      ]
    },
    {
      "resource_id": "3410",
      "page": 1,
      "main_container": 267,
      "sessions": []
    },
    {
      "resource_id": "3411",
      "page": 0,
      "main_container": 275,
      "sessions": [
        98,
        311,
        405,
        507,
        535,
        568
      ]
    },
    {
      "resource_id": "3412",
      "page": 0,
      "main_container": 276,
      "sessions": [
        176,
        320,
        408,
        418,
        490,
        525
      ]
    },
    {
      "resource_id": "3414",
      "page": 0,
      "main_container": 268,
      "sessions": [
        2,
        9,
        17,
        23
      ]
    },
    {
      "resource_id": "3415",
      "page": 0,
      "main_container": 269,
      "sessions": [
        405,
        530,
        551
      ]
    },
    {
      "resource_id": "3416",
      "page": 0,
      "main_container": 274,
      "sessions": [
        13,
        314,
        557
      ]
    },
    {
      "resource_id": "3416",
      "page": 1,
      "main_container": 274,
      "sessions": []
    },
    {
      "resource_id": "3417",
      "page": 0,
      "main_container": 277,
      "sessions": [
        3,
        10,
        18,
        24,
        235,
        418,
        542
      ]
    },
    {
      "resource_id": "3417",
      "page": 1,
      "main_container": 277,
      "sessions": []
    },
    {
      "resource_id": "3418",
      "page": 0,
      "main_container": 278,
      "sessions": [
        88,
        169,
        239,
        250,
        330,
        494,
        513,
        537,
        564
      ]
    },
    {
      "resource_id": "3418",
      "page": 1,
      "main_container": 278,
      "sessions": []
    },
    {
      "resource_id": "3419",
      "page": 0,
      "main_container": 279,
      "sessions": [
        1,
        16,
        491,
        510
      ]
    },
    {
      "resource_id": "3420",
      "page": 0,
      "main_container": 280,
      "sessions": [
        87,
        256,
        493,
        511
      ]
    },
    {
      "resource_id": "3420",
      "page": 1,
      "main_container": 280,
      "sessions": []
    },
    {
      "resource_id": "3421",
      "page": 0,
      "main_container": 270,
      "sessions": [
        89,
        184,
        249,
        413,
        536
      ]
    },
    {
      "resource_id": "3421",
      "page": 1,
      "main_container": 270,
      "sessions": []
    },
    {
      "resource_id": "3422",
      "page": 0,
      "main_container": 271,
      "sessions": [
        183,
        399,
        408,
        413,
        414
      ]
    },
    {
      "resource_id": "3423",
      "page": 0,
      "main_container": 272,
      "sessions": [
        8,
        22,
        166,
        229,
        303,
        399,
        405,
        413,
        414
      ]
    },
    {
      "resource_id": "3423",
      "page": 1,
      "main_container": 272,
      "sessions": []
    },
    {
      "resource_id": "3424",
      "page": 0,
      "main_container": 273,
      "sessions": [
        93,
        254,
        552
      ]
    },
    {
      "resource_id": "34388",
      "page": 0,
      "main_container": 108,
      "sessions": [
        176,
        320
      ]
    },
    {
      "resource_id": "34392",
      "page": 0,
      "main_container": 107,
      "sessions": [
        89,
        256
      ]
    },
    {
      "resource_id": "3448",
      "page": 0,
      "main_container": 283,
      "sessions": [
        438,
        442,
        445
      ]
    },
    {
      "resource_id": "3449",
      "page": 0,
      "main_container": 284,
      "sessions": [
        118,
        472,
        501,
        546
      ]
    },
    {
      "resource_id": "3449",
      "page": 1,
      "main_container": 284,
      "sessions": []
    },
    {
      "resource_id": "3451",
      "page": 0,
      "main_container": 285,
      "sessions": [
        279,
        502,
        543,
        548
      ]
    },
    {
      "resource_id": "3452",
      "page": 0,
      "main_container": 287,
      "sessions": [
        102,
        262,
        396
      ]
    },
    {
      "resource_id": "3453",
      "page": 0,
      "main_container": 288,
      "sessions": [
        187,
        333
      ]
    },
    {
      "resource_id": "3454",
      "page": 0,
      "main_container": 289,
      "sessions": [
        492
      ]
    },
    {
      "resource_id": "3455",
      "page": 0,
      "main_container": 290,
      "sessions": [
        105,
        265
      ]
    },
    {
      "resource_id": "3456",
      "page": 0,
      "main_container": 291,
      "sessions": [
        105,
        265
      ]
    },
    {
      "resource_id": "3457",
      "page": 0,
      "main_container": 292,
      "sessions": [
        190,
        382,
        444,
        447
      ]
    },
    {
      "resource_id": "3458",
      "page": 0,
      "main_container": 293,
      "sessions": [
        403
      ]
    },
    {
      "resource_id": "3459",
      "page": 0,
      "main_container": 294,
      "sessions": [
        100,
        381,
        577
      ]
    },
    {
      "resource_id": "3460",
      "page": 0,
      "main_container": 295,
      "sessions": [
        190,
        382,
        444,
        447
      ]
    },
    {
      "resource_id": "3461",
      "page": 0,
      "main_container": 296,
      "sessions": [
        404,
        411
      ]
    },
    {
      "resource_id": "3462",
      "page": 0,
      "main_container": 297,
      "sessions": [
        100,
        381,
        577
      ]
    },
    {
      "resource_id": "3463",
      "page": 0,
      "main_container": 298,
      "sessions": [
        465,
        473,
        475
      ]
    },
    {
      "resource_id": "3463",
      "page": 1,
      "main_container": 298,
      "sessions": []
    },
    {
      "resource_id": "3464",
      "page": 0,
      "main_container": 299,
      "sessions": [
        465,
        473,
        475
      ]
    },
    {
      "resource_id": "3464",
      "page": 1,
      "main_container": 299,
      "sessions": []
    },
    {
      "resource_id": "3465",
      "page": 0,
      "main_container": 300,
      "sessions": [
        461,
        465,
        473,
        475,
        479
      ]
    },
    {
      "resource_id": "3465",
      "page": 1,
      "main_container": 300,
      "sessions": []
    },
    {
      "resource_id": "3466",
      "page": 0,
      "main_container": 301,
      "sessions": [
        461,
        465,
        473,
        475,
        479
      ]
    },
    {
      "resource_id": "3466",
      "page": 1,
      "main_container": 301,
      "sessions": []
    },
    {
      "resource_id": "3477",
      "page": 0,
      "main_container": 302,
      "sessions": [
        90,
        260,
        327,
        457,
        461,
        470,
        541,
        561,
        577
      ]
    },
    {
      "resource_id": "3477",
      "page": 1,
      "main_container": 302,
      "sessions": [
        479
      ]
    },
    {
      "resource_id": "3482",
      "page": 0,
      "main_container": 303,
      "sessions": [
        97,
        497
      ]
    },
    {
      "resource_id": "3482",
      "page": 1,
      "main_container": 303,
      "sessions": []
    },
    {
      "resource_id": "3484",
      "page": 0,
      "main_container": 319,
      "sessions": [
        41,
        65,
        76,
        119,
        140,
        158,
        171,
        218,
        238,
        278,
        296,
        317,
        342,
        353,
        362,
        379,
        409
      ]
    },
    {
      "resource_id": "3485",
      "page": 0,
      "main_container": 320,
      "sessions": [
        34,
        36,
        47,
        61,
        80,
        132,
        143,
        159,
        200,
        214,
        225,
        253,
        275,
        297,
        318,
        343,
        352,
        358,
        400,
        406
      ]
    },
    {
      "resource_id": "3491",
      "page": 0,
      "main_container": 257,
      "sessions": [
        162
      ]
    },
    {
      "resource_id": "3496",
      "page": 0,
      "main_container": 321,
      "sessions": [
        35,
        51,
        68,
        92,
        112,
        113,
        137,
        161,
        199,
        215,
        224,
        245,
        257,
        273,
        274,
        291,
        304,
        312,
        347,
        363,
        375,
        512
      ]
    },
    {
      "resource_id": "3496",
      "page": 1,
      "main_container": 321,
      "sessions": []
    },
    {
      "resource_id": "3497",
      "page": 0,
      "main_container": 322,
      "sessions": [
        48,
        59,
        115,
        138,
        151,
        212,
        241,
        294,
        301,
        315,
        344,
        368,
        374,
        401,
        412
      ]
    },
    {
      "resource_id": "3497",
      "page": 1,
      "main_container": 322,
      "sessions": []
    },
    {
      "resource_id": "3507",
      "page": 0,
      "main_container": 258,
      "sessions": [
        455
      ]
    },
    {
      "resource_id": "3508",
      "page": 0,
      "main_container": 259,
      "sessions": [
        237,
        310
      ]
    },
    {
      "resource_id": "3511",
      "page": 0,
      "main_container": 260,
      "sessions": [
        456,
        460,
        466,
        469,
        476
      ]
    },
    {
      "resource_id": "3512",
      "page": 0,
      "main_container": 323,
      "sessions": [
        32,
        40,
        56,
        86,
        135,
        146,
        202,
        288,
        346,
        364,
        544
      ]
    },
    {
      "resource_id": "3513",
      "page": 0,
      "main_container": 324,
      "sessions": [
        55,
        62,
        81,
        121,
        142,
        222,
        227,
        246,
        300,
        357,
        367,
        415
      ]
    },
    {
      "resource_id": "3514",
      "page": 0,
      "main_container": 325,
      "sessions": [
        37,
        53,
        75,
        116,
        182,
        223,
        242,
        299,
        329,
        356,
        371,
        478,
        516,
        563
      ]
    },
    {
      "resource_id": "3514",
      "page": 1,
      "main_container": 325,
      "sessions": []
    },
    {
      "resource_id": "35161",
      "page": 0,
      "main_container": 44,
      "sessions": [
        173
      ]
    },
    {
      "resource_id": "3527",
      "page": 0,
      "main_container": 326,
      "sessions": [
        33,
        163,
        203,
        281,
        372
      ]
    },
    {
      "resource_id": "3528",
      "page": 0,
      "main_container": 327,
      "sessions": [
        101,
        150,
        175,
        204,
        231,
        261,
        280,
        345,
        373
      ]
    },
    {
      "resource_id": "3534",
      "page": 0,
      "main_container": 261,
      "sessions": [
        170,
        198,
        220,
        248,
        272,
        316,
        340,
        366
      ]
    },
    {
      "resource_id": "3559",
      "page": 0,
      "main_container": 263,
      "sessions": [
        79,
        244,
        376,
        388
      ]
    },
    {
      "resource_id": "3562",
      "page": 0,
      "main_container": 265,
      "sessions": [
        31,
        46,
        154,
        180,
        326,
        365
      ]
    },
    {
      "resource_id": "3564",
      "page": 0,
      "main_container": 304,
      "sessions": [
        110,
        145,
        188,
        270,
        334,
        391,
        394,
        481,
        484,
        488,
        520,
        533,
        549
      ]
    },
    {
      "resource_id": "3565",
      "page": 0,
      "main_container": 305,
      "sessions": [
        52,
        71,
        95,
        194,
        295,
        337,
        410,
        500,
        527,
        553,
        567,
        571,
        572
      ]
    },
    {
      "resource_id": "3566",
      "page": 0,
      "main_container": 306,
      "sessions": [
        39,
        111,
        120,
        191,
        267,
        338,
        387,
        393,
        482,
        487,
        503,
        506,
        523,
        532,
        554,
        574
      ]
    },
    {
      "resource_id": "3567",
      "page": 0,
      "main_container": 307,
      "sessions": [
        42,
        85,
        168,
        219,
        269,
        335,
        378,
        385,
        480,
        483,
        499,
        504,
        517,
        528
      ]
    },
    {
      "resource_id": "3567",
      "page": 1,
      "main_container": 307,
      "sessions": []
    },
    {
      "resource_id": "3568",
      "page": 0,
      "main_container": 308,
      "sessions": [
        54,
        107,
        128,
        195,
        258,
        325,
        341,
        384,
        389,
        392,
        486,
        505,
        508,
        521,
        529,
        573
      ]
    },
    {
      "resource_id": "3569",
      "page": 0,
      "main_container": 309,
      "sessions": [
        30,
        58,
        84,
        129,
        148,
        173,
        263,
        321,
        386,
        518,
        524,
        534
      ]
    },
    {
      "resource_id": "3569",
      "page": 1,
      "main_container": 309,
      "sessions": []
    },
    {
      "resource_id": "3570",
      "page": 0,
      "main_container": 310,
      "sessions": [
        30,
        74,
        108,
        193,
        206,
        228,
        268,
        324,
        383,
        498,
        531,
        545,
        566
      ]
    },
    {
      "resource_id": "3575",
      "page": 0,
      "main_container": 314,
      "sessions": [
        106,
        336
      ]
    },
    {
      "resource_id": "3576",
      "page": 0,
      "main_container": 315,
      "sessions": [
        164,
        570
      ]
    },
    {
      "resource_id": "3577",
      "page": 0,
      "main_container": 316,
      "sessions": [
        109,
        196,
        313,
        540,
        575,
        578,
        579,
        581,
        583
      ]
    },
    {
      "resource_id": "3578",
      "page": 0,
      "main_container": 317,
      "sessions": [
        45,
        66,
        99,
        131,
        149,
        186,
        247,
        332,
        380,
        390,
        395
      ]
    },
    {
      "resource_id": "3583",
      "page": 0,
      "main_container": 331,
      "sessions": [
        167,
        230,
        298,
        361
      ]
    },
    {
      "resource_id": "3588",
      "page": 0,
      "main_container": 332,
      "sessions": [
        96,
        514
      ]
    },
    {
      "resource_id": "3589",
      "page": 0,
      "main_container": 333,
      "sessions": [
        157,
        489,
        509,
        558
      ]
    },
    {
      "resource_id": "3590",
      "page": 0,
      "main_container": 334,
      "sessions": [
        550
      ]
    },
    {
      "resource_id": "3607",
      "page": 0,
      "main_container": 335,
      "sessions": [
        38,
        73,
        114,
        172,
        201,
        276,
        309,
        360
      ]
    },
    {
      "resource_id": "3609",
      "page": 0,
      "main_container": 336,
      "sessions": [
        67
      ]
    },
    {
      "resource_id": "36287",
      "page": 0,
      "main_container": 208,
      "sessions": [
        75,
        274,
        363
      ]
    },
    {
      "resource_id": "36289",
      "page": 0,
      "main_container": 211,
      "sessions": [
        161,
        222,
        304
      ]
    },
    {
      "resource_id": "36298",
      "page": 0,
      "main_container": 212,
      "sessions": [
        245,
        375
      ]
    },
    {
      "resource_id": "37348",
      "page": 0,
      "main_container": 110,
      "sessions": [
        93,
        239,
        254
      ]
    },
    {
      "resource_id": "41309",
      "page": 0,
      "main_container": 168,
      "sessions": [
        199,
        273,
        315
      ]
    },
    {
      "resource_id": "41310",
      "page": 0,
      "main_container": 166,
      "sessions": [
        80,
        159,
        342
      ]
    },
    {
      "resource_id": "41311",
      "page": 0,
      "main_container": 169,
      "sessions": [
        32,
        55,
        297
      ]
    },
    {
      "resource_id": "41508",
      "page": 0,
      "main_container": 16,
      "sessions": [
        47,
        296
      ]
    },
    {
      "resource_id": "41777",
      "page": 0,
      "main_container": 29,
      "sessions": [
        35,
        215,
        353
      ]
    },
    {
      "resource_id": "42159",
      "page": 0,
      "main_container": 67,
      "sessions": [
        232
      ]
    },
    {
      "resource_id": "42227",
      "page": 0,
      "main_container": 264,
      "sessions": [
        419,
        421,
        422
      ]
    },
    {
      "resource_id": "42606",
      "page": 0,
      "main_container": 45,
      "sessions": [
        66,
        149
      ]
    },
    {
      "resource_id": "43831",
      "page": 0,
      "main_container": 167,
      "sessions": [
        65,
        230,
        361
      ]
    },
    {
      "resource_id": "43832",
      "page": 0,
      "main_container": 171,
      "sessions": [
        112,
        242,
        379
      ]
    },
    {
      "resource_id": "43834",
      "page": 0,
      "main_container": 170,
      "sessions": [
        36,
        119,
        253
      ]
    },
    {
      "resource_id": "44441",
      "page": 0,
      "main_container": 86,
      "sessions": [
        386,
        489
      ]
    },
    {
      "resource_id": "45872",
      "page": 0,
      "main_container": 282,
      "sessions": [
        178,
        323
      ]
    },
    {
      "resource_id": "47407",
      "page": 0,
      "main_container": 13,
      "sessions": [
        424,
        426,
        428,
        430,
        432
      ]
    },
    {
      "resource_id": "48690",
      "page": 0,
      "main_container": 172,
      "sessions": [
        34,
        81,
        223
      ]
    },
    {
      "resource_id": "50856",
      "page": 0,
      "main_container": 164,
      "sessions": [
        143,
        288
      ]
    },
    {
      "resource_id": "50857",
      "page": 0,
      "main_container": 163,
      "sessions": [
        246,
        312
      ]
    },
    {
      "resource_id": "51903",
      "page": 0,
      "main_container": 10,
      "sessions": [
        162
      ]
    },
    {
      "resource_id": "51909",
      "page": 0,
      "main_container": 11,
      "sessions": [
        419,
        421,
        422
      ]
    },
    {
      "resource_id": "51910",
      "page": 0,
      "main_container": 12,
      "sessions": [
        423,
        425,
        427,
        429,
        431
      ]
    },
    {
      "resource_id": "5207",
      "page": 0,
      "main_container": 80,
      "sessions": [
        234,
        285
      ]
    },
    {
      "resource_id": "54690",
      "page": 0,
      "main_container": 115,
      "sessions": [
        158,
        225,
        352
      ]
    },
    {
      "resource_id": "54899",
      "page": 0,
      "main_container": 281,
      "sessions": [
        439
      ]
    },
    {
      "resource_id": "55714",
      "page": 0,
      "main_container": 50,
      "sessions": [
        56,
        142,
        300
      ]
    },
    {
      "resource_id": "55716",
      "page": 0,
      "main_container": 51,
      "sessions": [
        163,
        203
      ]
    },
    {
      "resource_id": "55717",
      "page": 0,
      "main_container": 53,
      "sessions": [
        67,
        224
      ]
    },
    {
      "resource_id": "57548",
      "page": 0,
      "main_container": 28,
      "sessions": [
        401,
        412
      ]
    },
    {
      "resource_id": "57896",
      "page": 0,
      "main_container": 52,
      "sessions": [
        40,
        357
      ]
    },
    {
      "resource_id": "57898",
      "page": 0,
      "main_container": 54,
      "sessions": [
        275,
        344
      ]
    },
    {
      "resource_id": "58472",
      "page": 0,
      "main_container": 233,
      "sessions": [
        185,
        331,
        565
      ]
    },
    {
      "resource_id": "61796",
      "page": 0,
      "main_container": 116,
      "sessions": [
        140,
        298,
        358
      ]
    },
    {
      "resource_id": "62596",
      "page": 0,
      "main_container": 55,
      "sessions": [
        121,
        360
      ]
    },
    {
      "resource_id": "62597",
      "page": 0,
      "main_container": 56,
      "sessions": [
        175,
        372
      ]
    },
    {
      "resource_id": "62598",
      "page": 0,
      "main_container": 59,
      "sessions": [
        150,
        280
      ]
    },
    {
      "resource_id": "62599",
      "page": 0,
      "main_container": 60,
      "sessions": [
        41,
        204
      ]
    },
    {
      "resource_id": "62602",
      "page": 0,
      "main_container": 57,
      "sessions": [
        68,
        231
      ]
    },
    {
      "resource_id": "64688",
      "page": 0,
      "main_container": 58,
      "sessions": [
        101,
        261
      ]
    },
    {
      "resource_id": "65521",
      "page": 0,
      "main_container": 95,
      "sessions": [
        560
      ]
    },
    {
      "resource_id": "6881",
      "page": 0,
      "main_container": 100,
      "sessions": [
        126,
        207,
        286,
        397
      ]
    },
    {
      "resource_id": "68995",
      "page": 0,
      "main_container": 46,
      "sessions": [
        157
      ]
    },
    {
      "resource_id": "69017",
      "page": 0,
      "main_container": 61,
      "sessions": [
        151,
        281
      ]
    },
    {
      "resource_id": "69026",
      "page": 0,
      "main_container": 48,
      "sessions": [
        240,
        345
      ]
    },
    {
      "resource_id": "69795",
      "page": 0,
      "main_container": 126,
      "sessions": [
        266
      ]
    },
    {
      "resource_id": "71194",
      "page": 0,
      "main_container": 49,
      "sessions": [
        373
      ]
    },
    {
      "resource_id": "71531",
      "page": 0,
      "main_container": 198,
      "sessions": [
        267,
        390
      ]
    },
    {
      "resource_id": "72449",
      "page": 0,
      "main_container": 337,
      "sessions": [
        104,
        189,
        264
      ]
    },
    {
      "resource_id": "73842",
      "page": 0,
      "main_container": 96,
      "sessions": [
        104
      ]
    },
    {
      "resource_id": "73843",
      "page": 0,
      "main_container": 97,
      "sessions": [
        189
      ]
    },
    {
      "resource_id": "73844",
      "page": 0,
      "main_container": 98,
      "sessions": [
        264
      ]
    },
    {
      "resource_id": "74145",
      "page": 0,
      "main_container": 41,
      "sessions": [
        13
      ]
    },
    {
      "resource_id": "79827",
      "page": 0,
      "main_container": 26,
      "sessions": [
        400,
        409
      ]
    },
    {
      "resource_id": "79828",
      "page": 0,
      "main_container": 27,
      "sessions": [
        406,
        415
      ]
    },
    {
      "resource_id": "79833",
      "page": 0,
      "main_container": 206,
      "sessions": [
        212,
        374
      ]
    },
    {
      "resource_id": "79870",
      "page": 0,
      "main_container": 5,
      "sessions": [
        116,
        299,
        371
      ]
    },
    {
      "resource_id": "79910",
      "page": 0,
      "main_container": 151,
      "sessions": [
        129
      ]
    },
    {
      "resource_id": "79942",
      "page": 0,
      "main_container": 149,
      "sessions": [
        94,
        556
      ]
    },
    {
      "resource_id": "79944",
      "page": 0,
      "main_container": 150,
      "sessions": [
        255,
        569
      ]
    },
    {
      "resource_id": "81163",
      "page": 0,
      "main_container": 209,
      "sessions": [
        138,
        356
      ]
    },
    {
      "resource_id": "81251",
      "page": 0,
      "main_container": 229,
      "sessions": [
        339,
        555
      ]
    },
    {
      "resource_id": "81731",
      "page": 0,
      "main_container": 47,
      "sessions": [
        100,
        381
      ]
    },
    {
      "resource_id": "82025",
      "page": 0,
      "main_container": 101,
      "sessions": [
        43,
        153,
        307
      ]
    },
    {
      "resource_id": "82030",
      "page": 0,
      "main_container": 102,
      "sessions": [
        576,
        580,
        582
      ]
    },
    {
      "resource_id": "83474",
      "page": 0,
      "main_container": 230,
      "sessions": [
        2,
        9,
        17,
        23
      ]
    },
    {
      "resource_id": "83476",
      "page": 0,
      "main_container": 35,
      "sessions": [
        1,
        16
      ]
    },
    {
      "resource_id": "83477",
      "page": 0,
      "main_container": 148,
      "sessions": [
        8,
        22
      ]
    },
    {
      "resource_id": "87628",
      "page": 0,
      "main_container": 262,
      "sessions": [
        217
      ]
    },
    {
      "resource_id": "89442",
      "page": 0,
      "main_container": 117,
      "sessions": [
        407,
        416
      ]
    },
    {
      "resource_id": "9109",
      "page": 0,
      "main_container": 66,
      "sessions": [
        156
      ]
    },
    {
      "resource_id": "9111",
      "page": 0,
      "main_container": 70,
      "sessions": [
        63,
        226
      ]
    },
    {
      "resource_id": "9287",
      "page": 0,
      "main_container": 177,
      "sessions": [
        69,
        210
      ]
    },
    {
      "resource_id": "96156",
      "page": 0,
      "main_container": 7,
      "sessions": [
        170,
        248,
        316
      ]
    },
    {
      "resource_id": "96162",
      "page": 0,
      "main_container": 8,
      "sessions": [
        198,
        272,
        340
      ]
    },
    {
      "resource_id": "96166",
      "page": 0,
      "main_container": 9,
      "sessions": [
        420
      ]
    },
    {
      "resource_id": "96341",
      "page": 0,
      "main_container": 93,
      "sessions": [
        403
      ]
    },
    {
      "resource_id": "96347",
      "page": 0,
      "main_container": 94,
      "sessions": [
        404,
        411
      ]
    },
    {
      "resource_id": "96406",
      "page": 0,
      "main_container": 222,
      "sessions": [
        402,
        417
      ]
    }
  ]
}