{
  "pages": [
    {
      "resource_id": "12211",
      "page": 0,
      "main_container": 165,
      "sessions": [
        193,
        259
      ]
    },
    {
      "resource_id": "1249",
      "page": 0,
      "main_container": 1,
      "sessions": [
        92,
        263
      ]
    },
    {
      "resource_id": "1250",
      "page": 0,
      "main_container": 2,
      "sessions": [
        119,
        167
      ]
    },
    {
      "resource_id": "1259",
      "page": 0,
      "main_container": 3,
      "sessions": [
        76,
        504
      ]
    },
    {
      "resource_id": "1260",
      "page": 0,
      "main_container": 4,
      "sessions": [
        290,
        509
      ]
    },
    {
      "resource_id": "1316",
      "page": 0,
      "main_container": 6,
      "sessions": [
        3,
        98
      ]
    },
    {
      "resource_id": "13430",
      "page": 0,
      "main_container": 208,
      "sessions": [
        13,
        86,
        161,
        235,
        297
      ]
    },
    {
      "resource_id": "1378",
      "page": 0,
      "main_container": 10,
      "sessions": [
        197,
        265
      ]
    },
    {
      "resource_id": "1395",
      "page": 0,
      "main_container": 11,
      "sessions": [
        12,
        85,
        162,
        234,
        296
      ]
    },
    {
      "resource_id": "1396",
      "page": 0,
      "main_container": 12,
      "sessions": [
        9
      ]
    },
    {
      "resource_id": "1397",
      "page": 0,
      "main_container": 13,
      "sessions": [
        159
      ]
    },
    {
      "resource_id": "1473",
      "page": 0,
      "main_container": 18,
      "sessions": [
        48,
        122
      ]
    },
    {
      "resource_id": "1474",
      "page": 0,
      "main_container": 19,
      "sessions": [
        261
      ]
    },
    {
      "resource_id": "16095",
      "page": 0,
      "main_container": 46,
      "sessions": [
        211,
        333
      ]
    },
    {
      "resource_id": "1663",
      "page": 0,
      "main_container": 34,
      "sessions": [
        45,
        204,
        486
      ]
    },
    {
      "resource_id": "1665",
      "page": 0,
      "main_container": 35,
      "sessions": [
        216,
        471
      ]
    },
    {
      "resource_id": "1667",
      "page": 0,
      "main_container": 36,
      "sessions": [
        257,
        497
      ]
    },
    {
      "resource_id": "1669",
      "page": 0,
      "main_container": 37,
      "sessions": [
        450
      ]
    },
    {
      "resource_id": "1712",
      "page": 0,
      "main_container": 38,
      "sessions": [
        8
      ]
    },
    {
      "resource_id": "1714",
      "page": 0,
      "main_container": 39,
      "sessions": [
        101,
        311
      ]
    },
    {
      "resource_id": "17329",
      "page": 0,
      "main_container": 122,
      "sessions": [
        1,
        177,
        329,
        496
      ]
    },
    {
      "resource_id": "17329",
      "page": 1,
      "main_container": 122,
      "sessions": []
    },
    {
      "resource_id": "17330",
      "page": 0,
      "main_container": 123,
      "sessions": [
        195,
        254,
        325
      ]
    },
    {
      "resource_id": "1746",
      "page": 0,
      "main_container": 40,
      "sessions": [
        134,
        276,
        432,
        487
      ]
    },
    {
      "resource_id": "1746",
      "page": 1,
      "main_container": 40,
      "sessions": []
    },
    {
      "resource_id": "1748",
      "page": 0,
      "main_container": 41,
      "sessions": [
        59,
        210,
        400,
        459
      ]
    },
    {
      "resource_id": "1748",
      "page": 1,
      "main_container": 41,
      "sessions": []
    },
    {
      "resource_id": "1762",
      "page": 0,
      "main_container": 42,
      "sessions": [
        35,
        165,
        300
      ]
    },
    {
      "resource_id": "1766",
      "page": 0,
      "main_container": 43,
      "sessions": [
        187,
        246,
        316
      ]
    },
    {
      "resource_id": "1776",
      "page": 0,
      "main_container": 44,
      "sessions": [
        31,
        111
      ]
    },
    {
      "resource_id": "1801",
      "page": 0,
      "main_container": 45,
      "sessions": [
        188,
        247,
        317
      ]
    },
    {
      "resource_id": "1830",
      "page": 0,
      "main_container": 47,
      "sessions": [
        144,
        389,
        390,
        397
      ]
    },
    {
      "resource_id": "1831",
      "page": 0,
      "main_container": 48,
      "sessions": [
        66,
        407,
        412,
        510
      ]
    },
    {
      "resource_id": "1832",
      "page": 0,
      "main_container": 49,
      "sessions": [
        112,
        181,
        440
      ]
    },
    {
      "resource_id": "1833",
      "page": 0,
      "main_container": 51,
      "sessions": [
        135,
        212,
        408,
        413,
        416,
        417,
        448,
        476
      ]
    },
    {
      "resource_id": "1833",
      "page": 1,
      "main_container": 51,
      "sessions": []
    },
    {
      "resource_id": "1834",
      "page": 0,
      "main_container": 52,
      "sessions": [
        283,
        394,
        401
      ]
    },
    {
      "resource_id": "1835",
      "page": 0,
      "main_container": 53,
      "sessions": [
        304,
        500
      ]
    },
    {
      "resource_id": "1836",
      "page": 0,
      "main_container": 54,
      "sessions": [
        217,
        424,
        429
      ]
    },
    {
      "resource_id": "1839",
      "page": 0,
      "main_container": 55,
      "sessions": [
        145,
        456
      ]
    },
    {
      "resource_id": "1846",
      "page": 0,
      "main_container": 56,
      "sessions": [
        326,
        426
      ]
    },
    {
      "resource_id": "1849",
      "page": 0,
      "main_container": 57,
      "sessions": [
        344,
        457
      ]
    },
    {
      "resource_id": "1855",
      "page": 0,
      "main_container": 58,
      "sessions": [
        205,
        477
      ]
    },
    {
      "resource_id": "2001",
      "page": 0,
      "main_container": 64,
      "sessions": [
        60,
        213,
        402,
        460
      ]
    },
    {
      "resource_id": "2001",
      "page": 1,
      "main_container": 64,
      "sessions": []
    },
    {
      "resource_id": "2072",
      "page": 0,
      "main_container": 71,
      "sessions": [
        137,
        277,
        434,
        489
      ]
    },
    {
      "resource_id": "2072",
      "page": 1,
      "main_container": 71,
      "sessions": []
    },
    {
      "resource_id": "2074",
      "page": 0,
      "main_container": 72,
      "sessions": [
        123,
        267,
        388,
        391,
        406,
        409,
        414,
        442,
        445,
        451,
        466,
        468
      ]
    },
    {
      "resource_id": "2074",
      "page": 1,
      "main_container": 72,
      "sessions": []
    },
    {
      "resource_id": "2075",
      "page": 0,
      "main_container": 73,
      "sessions": [
        89,
        138,
        139,
        182,
        250,
        278,
        293,
        435,
        441,
        452,
        461,
        465
      ]
    },
    {
      "resource_id": "2075",
      "page": 1,
      "main_container": 73,
      "sessions": [
        478,
        490,
        491
      ]
    },
    {
      "resource_id": "2079",
      "page": 0,
      "main_container": 75,
      "sessions": [
        49,
        199,
        411,
        418,
        423,
        427,
        443,
        446,
        469,
        473,
        479
      ]
    },
    {
      "resource_id": "2079",
      "page": 1,
      "main_container": 75,
      "sessions": []
    },
    {
      "resource_id": "2080",
      "page": 0,
      "main_container": 77,
      "sessions": [
        58,
        140,
        209,
        279,
        399,
        436,
        458,
        492
      ]
    },
    {
      "resource_id": "2080",
      "page": 1,
      "main_container": 77,
      "sessions": []
    },
    {
      "resource_id": "2081",
      "page": 0,
      "main_container": 78,
      "sessions": [
        239,
        305
      ]
    },
    {
      "resource_id": "20864",
      "page": 0,
      "main_container": 143,
      "sessions": [
        21,
        97,
        171,
        243,
        309
      ]
    },
    {
      "resource_id": "20864",
      "page": 1,
      "main_container": 143,
      "sessions": [
        309
      ]
    },
    {
      "resource_id": "2173",
      "page": 0,
      "main_container": 81,
      "sessions": [
        284
      ]
    },
    {
      "resource_id": "2178",
      "page": 0,
      "main_container": 82,
      "sessions": [
        68
      ]
    },
    {
      "resource_id": "2179",
      "page": 0,
      "main_container": 83,
      "sessions": [
        336
      ]
    },
    {
      "resource_id": "2183",
      "page": 0,
      "main_container": 84,
      "sessions": [
        345
      ]
    },
    {
      "resource_id": "2184",
      "page": 0,
      "main_container": 85,
      "sessions": [
        219
      ]
    },
    {
      "resource_id": "2187",
      "page": 0,
      "main_container": 88,
      "sessions": [
        69,
        415
      ]
    },
    {
      "resource_id": "2193",
      "page": 0,
      "main_container": 89,
      "sessions": [
        337
      ]
    },
    {
      "resource_id": "2202",
      "page": 0,
      "main_container": 90,
      "sessions": [
        285
      ]
    },
    {
      "resource_id": "2211",
      "page": 0,
      "main_container": 94,
      "sessions": [
        148
      ]
    },
    {
      "resource_id": "2216",
      "page": 0,
      "main_container": 91,
      "sessions": [
        70
      ]
    },
    {
      "resource_id": "2218",
      "page": 0,
      "main_container": 92,
      "sessions": [
        348
      ]
    },
    {
      "resource_id": "2227",
      "page": 0,
      "main_container": 93,
      "sessions": [
        46
      ]
    },
    {
      "resource_id": "2266",
      "page": 0,
      "main_container": 95,
      "sessions": [
        51,
        201,
        395,
        453
      ]
    },
    {
      "resource_id": "2266",
      "page": 1,
      "main_container": 95,
      "sessions": []
    },
    {
      "resource_id": "2267",
      "page": 0,
      "main_container": 96,
      "sessions": [
        124,
        268,
        454,
        484
      ]
    },
    {
      "resource_id": "2267",
      "page": 1,
      "main_container": 96,
      "sessions": []
    },
    {
      "resource_id": "2324",
      "page": 0,
      "main_container": 97,
      "sessions": [
        128,
        269
      ]
    },
    {
      "resource_id": "2349",
      "page": 0,
      "main_container": 98,
      "sessions": [
        384
      ]
    },
    {
      "resource_id": "2349",
      "page": 1,
      "main_container": 98,
      "sessions": []
    },
    {
      "resource_id": "2362",
      "page": 0,
      "main_container": 102,
      "sessions": [
        18,
        93,
        240,
        306
      ]
    },
    {
      "resource_id": "2404",
      "page": 0,
      "main_container": 108,
      "sessions": [
        125,
        270,
        430,
        485
      ]
    },
    {
      "resource_id": "2404",
      "page": 1,
      "main_container": 108,
      "sessions": []
    },
    {
      "resource_id": "2405",
      "page": 0,
      "main_container": 109,
      "sessions": [
        202,
        319,
        501
      ]
    },
    {
      "resource_id": "2406",
      "page": 0,
      "main_container": 110,
      "sessions": [
        396
      ]
    },
    {
      "resource_id": "2406",
      "page": 1,
      "main_container": 110,
      "sessions": []
    },
    {
      "resource_id": "2409",
      "page": 0,
      "main_container": 111,
      "sessions": [
        126,
        271,
        506,
        507
      ]
    },
    {
      "resource_id": "2409",
      "page": 1,
      "main_container": 111,
      "sessions": []
    },
    {
      "resource_id": "2414",
      "page": 0,
      "main_container": 112,
      "sessions": [
        455
      ]
    },
    {
      "resource_id": "2414",
      "page": 1,
      "main_container": 112,
      "sessions": []
    },
    {
      "resource_id": "2425",
      "page": 0,
      "main_container": 113,
      "sessions": [
        156,
        334,
        502
      ]
    },
    {
      "resource_id": "2447",
      "page": 0,
      "main_container": 114,
      "sessions": [
        62,
        141,
        403
      ]
    },
    {
      "resource_id": "2448",
      "page": 0,
      "main_container": 115,
      "sessions": [
        462
      ]
    },
    {
      "resource_id": "2448",
      "page": 1,
      "main_container": 115,
      "sessions": []
    },
    {
      "resource_id": "2449",
      "page": 0,
      "main_container": 116,
      "sessions": [
        77,
        222
      ]
    },
    {
      "resource_id": "24515",
      "page": 0,
      "main_container": 100,
      "sessions": [
        386
      ]
    },
    {
      "resource_id": "24515",
      "page": 1,
      "main_container": 100,
      "sessions": []
    },
    {
      "resource_id": "24517",
      "page": 0,
      "main_container": 101,
      "sessions": [
        387
      ]
    },
    {
      "resource_id": "24517",
      "page": 1,
      "main_container": 101,
      "sessions": []
    },
    {
      "resource_id": "24520",
      "page": 0,
      "main_container": 99,
      "sessions": [
        385
      ]
    },
    {
      "resource_id": "24520",
      "page": 1,
      "main_container": 99,
      "sessions": []
    },
    {
      "resource_id": "2458",
      "page": 0,
      "main_container": 117,
      "sessions": [
        63,
        280,
        493
      ]
    },
    {
      "resource_id": "2467",
      "page": 0,
      "main_container": 118,
      "sessions": [
        166,
        301,
        498
      ]
    },
    {
      "resource_id": "2471",
      "page": 0,
      "main_container": 119,
      "sessions": [
        72,
        335,
        508
      ]
    },
    {
      "resource_id": "2471",
      "page": 1,
      "main_container": 119,
      "sessions": []
    },
    {
      "resource_id": "2499",
      "page": 0,
      "main_container": 120,
      "sessions": [
        84
      ]
    },
    {
      "resource_id": "2500",
      "page": 0,
      "main_container": 121,
      "sessions": [
        233
      ]
    },
    {
      "resource_id": "2505",
      "page": 0,
      "main_container": 70,
      "sessions": [
        61,
        136,
        214
      ]
    },
    {
      "resource_id": "2517",
      "page": 0,
      "main_container": 128,
      "sessions": [
        23,
        102,
        174
      ]
    },
    {
      "resource_id": "2519",
      "page": 0,
      "main_container": 129,
      "sessions": [
        15,
        163,
        237
      ]
    },
    {
      "resource_id": "25230",
      "page": 0,
      "main_container": 20,
      "sessions": [
        30,
        180
      ]
    },
    {
      "resource_id": "25265",
      "page": 0,
      "main_container": 127,
      "sessions": [
        117,
        241,
        499
      ]
    },
    {
      "resource_id": "25266",
      "page": 0,
      "main_container": 125,
      "sessions": [
        14,
        90,
        230,
        439
      ]
    },
    {
      "resource_id": "25266",
      "page": 1,
      "main_container": 125,
      "sessions": []
    },
    {
      "resource_id": "2553",
      "page": 0,
      "main_container": 137,
      "sessions": [
        11,
        160
      ]
    },
    {
      "resource_id": "2555",
      "page": 0,
      "main_container": 139,
      "sessions": [
        27,
        121,
        307
      ]
    },
    {
      "resource_id": "2556",
      "page": 0,
      "main_container": 138,
      "sessions": [
        47,
        103,
        258
      ]
    },
    {
      "resource_id": "2564",
      "page": 0,
      "main_container": 141,
      "sessions": [
        149,
        223,
        286
      ]
    },
    {
      "resource_id": "2567",
      "page": 0,
      "main_container": 142,
      "sessions": [
        20,
        96,
        170,
        242,
        308
      ]
    },
    {
      "resource_id": "2622",
      "page": 0,
      "main_container": 144,
      "sessions": [
        108
      ]
    },
    {
      "resource_id": "2624",
      "page": 0,
      "main_container": 171,
      "sessions": [
        64,
        287
      ]
    },
    {
      "resource_id": "2627",
      "page": 0,
      "main_container": 145,
      "sessions": [
        73
      ]
    },
    {
      "resource_id": "2631",
      "page": 0,
      "main_container": 146,
      "sessions": [
        132
      ]
    },
    {
      "resource_id": "2632",
      "page": 0,
      "main_container": 147,
      "sessions": [
        291
      ]
    },
    {
      "resource_id": "2634",
      "page": 0,
      "main_container": 148,
      "sessions": [
        208,
        480
      ]
    },
    {
      "resource_id": "2635",
      "page": 0,
      "main_container": 149,
      "sessions": [
        79
      ]
    },
    {
      "resource_id": "2640",
      "page": 0,
      "main_container": 151,
      "sessions": [
        55
      ]
    },
    {
      "resource_id": "2646",
      "page": 0,
      "main_container": 152,
      "sessions": [
        192
      ]
    },
    {
      "resource_id": "2647",
      "page": 0,
      "main_container": 153,
      "sessions": [
        142,
        281
      ]
    },
    {
      "resource_id": "2648",
      "page": 0,
      "main_container": 154,
      "sessions": [
        346
      ]
    },
    {
      "resource_id": "2649",
      "page": 0,
      "main_container": 155,
      "sessions": [
        340
      ]
    },
    {
      "resource_id": "2650",
      "page": 0,
      "main_container": 156,
      "sessions": [
        129
      ]
    },
    {
      "resource_id": "2655",
      "page": 0,
      "main_container": 157,
      "sessions": [
        91,
        303
      ]
    },
    {
      "resource_id": "2657",
      "page": 0,
      "main_container": 158,
      "sessions": [
        74,
        347
      ]
    },
    {
      "resource_id": "2661",
      "page": 0,
      "main_container": 159,
      "sessions": [
        339,
        342,
        398,
        431
      ]
    },
    {
      "resource_id": "2663",
      "page": 0,
      "main_container": 160,
      "sessions": [
        133,
        513
      ]
    },
    {
      "resource_id": "2664",
      "page": 0,
      "main_container": 161,
      "sessions": [
        150,
        481
      ]
    },
    {
      "resource_id": "2666",
      "page": 0,
      "main_container": 150,
      "sessions": [
        80,
        229
      ]
    },
    {
      "resource_id": "2668",
      "page": 0,
      "main_container": 162,
      "sessions": [
        207
      ]
    },
    {
      "resource_id": "2670",
      "page": 0,
      "main_container": 163,
      "sessions": [
        115,
        273
      ]
    },
    {
      "resource_id": "2671",
      "page": 0,
      "main_container": 164,
      "sessions": [
        37,
        175
      ]
    },
    {
      "resource_id": "2717",
      "page": 0,
      "main_container": 172,
      "sessions": [
        274
      ]
    },
    {
      "resource_id": "2721",
      "page": 0,
      "main_container": 173,
      "sessions": [
        130
      ]
    },
    {
      "resource_id": "2817",
      "page": 0,
      "main_container": 174,
      "sessions": [
        41
      ]
    },
    {
      "resource_id": "2818",
      "page": 0,
      "main_container": 175,
      "sessions": [
        194
      ]
    },
    {
      "resource_id": "2819",
      "page": 0,
      "main_container": 176,
      "sessions": [
        28,
        320
      ]
    },
    {
      "resource_id": "28596",
      "page": 0,
      "main_container": 124,
      "sessions": [
        52,
        275,
        330,
        425
      ]
    },
    {
      "resource_id": "28596",
      "page": 1,
      "main_container": 124,
      "sessions": []
    },
    {
      "resource_id": "28597",
      "page": 0,
      "main_container": 126,
      "sessions": [
        25,
        106,
        173,
        444
      ]
    },
    {
      "resource_id": "28770",
      "page": 0,
      "main_container": 21,
      "sessions": [
        110,
        315
      ]
    },
    {
      "resource_id": "28771",
      "page": 0,
      "main_container": 22,
      "sessions": [
        164,
        299
      ]
    },
    {
      "resource_id": "2880",
      "page": 0,
      "main_container": 185,
      "sessions": [
        360
      ]
    },
    {
      "resource_id": "2884",
      "page": 0,
      "main_container": 187,
      "sessions": [
        224,
        449,
        463
      ]
    },
    {
      "resource_id": "2885",
      "page": 0,
      "main_container": 188,
      "sessions": [
        151,
        421,
        437
      ]
    },
    {
      "resource_id": "2887",
      "page": 0,
      "main_container": 189,
      "sessions": [
        338,
        404
      ]
    },
    {
      "resource_id": "2889",
      "page": 0,
      "main_container": 190,
      "sessions": [
        225,
        464
      ]
    },
    {
      "resource_id": "2890",
      "page": 0,
      "main_container": 191,
      "sessions": [
        4,
        152
      ]
    },
    {
      "resource_id": "2892",
      "page": 0,
      "main_container": 192,
      "sessions": [
        288,
        470
      ]
    },
    {
      "resource_id": "2898",
      "page": 0,
      "main_container": 193,
      "sessions": [
        289,
        495
      ]
    },
    {
      "resource_id": "2899",
      "page": 0,
      "main_container": 195,
      "sessions": [
        153,
        438
      ]
    },
    {
      "resource_id": "2901",
      "page": 0,
      "main_container": 194,
      "sessions": [
        75,
        405
      ]
    },
    {
      "resource_id": "2916",
      "page": 0,
      "main_container": 198,
      "sessions": [
        29,
        393
      ]
    },
    {
      "resource_id": "2917",
      "page": 0,
      "main_container": 199,
      "sessions": [
        54,
        511
      ]
    },
    {
      "resource_id": "2918",
      "page": 0,
      "main_container": 200,
      "sessions": [
        109,
        428
      ]
    },
    {
      "resource_id": "2921",
      "page": 0,
      "main_container": 201,
      "sessions": [
        131,
        447,
        512
      ]
    },
    {
      "resource_id": "2922",
      "page": 0,
      "main_container": 202,
      "sessions": [
        39,
        419
      ]
    },
    {
      "resource_id": "2924",
      "page": 0,
      "main_container": 203,
      "sessions": [
        226,
        505
      ]
    },
    {
      "resource_id": "2939",
      "page": 0,
      "main_container": 204,
      "sessions": [
        154,
        422
      ]
    },
    {
      "resource_id": "2941",
      "page": 0,
      "main_container": 205,
      "sessions": [
        227,
        482
      ]
    },
    {
      "resource_id": "29538",
      "page": 0,
      "main_container": 86,
      "sessions": [
        349
      ]
    },
    {
      "resource_id": "33629",
      "page": 0,
      "main_container": 179,
      "sessions": [
        24,
        81,
        87,
        249
      ]
    },
    {
      "resource_id": "33636",
      "page": 0,
      "main_container": 182,
      "sessions": [
        7,
        83,
        245
      ]
    },
    {
      "resource_id": "34392",
      "page": 0,
      "main_container": 74,
      "sessions": [
        198,
        248,
        410,
        472
      ]
    },
    {
      "resource_id": "36289",
      "page": 0,
      "main_container": 183,
      "sessions": [
        107,
        176,
        256
      ]
    },
    {
      "resource_id": "36298",
      "page": 0,
      "main_container": 184,
      "sessions": [
        33,
        184
      ]
    },
    {
      "resource_id": "36308",
      "page": 0,
      "main_container": 196,
      "sessions": [
        355,
        362
      ]
    },
    {
      "resource_id": "36310",
      "page": 0,
      "main_container": 197,
      "sessions": [
        367,
        369
      ]
    },
    {
      "resource_id": "37348",
      "page": 0,
      "main_container": 76,
      "sessions": [
        50,
        200,
        420,
        467,
        474
      ]
    },
    {
      "resource_id": "40690",
      "page": 0,
      "main_container": 206,
      "sessions": [
        383
      ]
    },
    {
      "resource_id": "41291",
      "page": 0,
      "main_container": 178,
      "sessions": [
        6,
        183
      ]
    },
    {
      "resource_id": "41292",
      "page": 0,
      "main_container": 181,
      "sessions": [
        158,
        231,
        236,
        314
      ]
    },
    {
      "resource_id": "41309",
      "page": 0,
      "main_container": 132,
      "sessions": [
        157,
        228,
        264
      ]
    },
    {
      "resource_id": "41310",
      "page": 0,
      "main_container": 130,
      "sessions": [
        43,
        118,
        294
      ]
    },
    {
      "resource_id": "41311",
      "page": 0,
      "main_container": 133,
      "sessions": [
        95,
        302
      ]
    },
    {
      "resource_id": "41443",
      "page": 0,
      "main_container": 167,
      "sessions": [
        38,
        260
      ]
    },
    {
      "resource_id": "43831",
      "page": 0,
      "main_container": 131,
      "sessions": [
        26,
        178,
        312
      ]
    },
    {
      "resource_id": "43832",
      "page": 0,
      "main_container": 135,
      "sessions": [
        78,
        196,
        331
      ]
    },
    {
      "resource_id": "43834",
      "page": 0,
      "main_container": 134,
      "sessions": [
        57,
        127,
        203
      ]
    },
    {
      "resource_id": "44441",
      "page": 0,
      "main_container": 50,
      "sessions": [
        343,
        392
      ]
    },
    {
      "resource_id": "44469",
      "page": 0,
      "main_container": 166,
      "sessions": [
        22,
        244
      ]
    },
    {
      "resource_id": "47407",
      "page": 0,
      "main_container": 9,
      "sessions": [
        374,
        376,
        378,
        380,
        382
      ]
    },
    {
      "resource_id": "48690",
      "page": 0,
      "main_container": 136,
      "sessions": [
        44,
        272
      ]
    },
    {
      "resource_id": "50971",
      "page": 0,
      "main_container": 17,
      "sessions": [
        2,
        341
      ]
    },
    {
      "resource_id": "51909",
      "page": 0,
      "main_container": 7,
      "sessions": [
        370,
        371,
        372
      ]
    },
    {
      "resource_id": "51910",
      "page": 0,
      "main_container": 8,
      "sessions": [
        373,
        375,
        377,
        379,
        381
      ]
    },
    {
      "resource_id": "52501",
      "page": 0,
      "main_container": 169,
      "sessions": [
        359
      ]
    },
    {
      "resource_id": "54690",
      "page": 0,
      "main_container": 79,
      "sessions": [
        116,
        179
      ]
    },
    {
      "resource_id": "55714",
      "page": 0,
      "main_container": 25,
      "sessions": [
        42,
        99,
        262
      ]
    },
    {
      "resource_id": "55716",
      "page": 0,
      "main_container": 26,
      "sessions": [
        114,
        168
      ]
    },
    {
      "resource_id": "55717",
      "page": 0,
      "main_container": 28,
      "sessions": [
        185,
        321,
        350
      ]
    },
    {
      "resource_id": "55721",
      "page": 0,
      "main_container": 103,
      "sessions": [
        220,
        327
      ]
    },
    {
      "resource_id": "57548",
      "page": 0,
      "main_container": 16,
      "sessions": [
        354,
        363
      ]
    },
    {
      "resource_id": "57896",
      "page": 0,
      "main_container": 27,
      "sessions": [
        16,
        251,
        351
      ]
    },
    {
      "resource_id": "58472",
      "page": 0,
      "main_container": 207,
      "sessions": [
        143,
        282,
        494
      ]
    },
    {
      "resource_id": "58955",
      "page": 0,
      "main_container": 170,
      "sessions": [
        368
      ]
    },
    {
      "resource_id": "61796",
      "page": 0,
      "main_container": 80,
      "sessions": [
        105,
        252
      ]
    },
    {
      "resource_id": "62596",
      "page": 0,
      "main_container": 29,
      "sessions": [
        100,
        266,
        313
      ]
    },
    {
      "resource_id": "62598",
      "page": 0,
      "main_container": 32,
      "sessions": [
        120,
        238
      ]
    },
    {
      "resource_id": "62599",
      "page": 0,
      "main_container": 33,
      "sessions": [
        17,
        169
      ]
    },
    {
      "resource_id": "62602",
      "page": 0,
      "main_container": 30,
      "sessions": [
        34,
        186
      ]
    },
    {
      "resource_id": "62621",
      "page": 0,
      "main_container": 186,
      "sessions": [
        352,
        361
      ]
    },
    {
      "resource_id": "64688",
      "page": 0,
      "main_container": 31,
      "sessions": [
        65,
        215
      ]
    },
    {
      "resource_id": "65521",
      "page": 0,
      "main_container": 60,
      "sessions": [
        433,
        483,
        488
      ]
    },
    {
      "resource_id": "65521",
      "page": 1,
      "main_container": 60,
      "sessions": []
    },
    {
      "resource_id": "65820",
      "page": 0,
      "main_container": 59,
      "sessions": [
        56
      ]
    },
    {
      "resource_id": "68316",
      "page": 0,
      "main_container": 168,
      "sessions": [
        366
      ]
    },
    {
      "resource_id": "6879",
      "page": 0,
      "main_container": 66,
      "sessions": [
        189
      ]
    },
    {
      "resource_id": "6881",
      "page": 0,
      "main_container": 67,
      "sessions": [
        5,
        82,
        232
      ]
    },
    {
      "resource_id": "69026",
      "page": 0,
      "main_container": 23,
      "sessions": [
        40,
        292,
        295
      ]
    },
    {
      "resource_id": "69795",
      "page": 0,
      "main_container": 87,
      "sessions": [
        147
      ]
    },
    {
      "resource_id": "71194",
      "page": 0,
      "main_container": 24,
      "sessions": [
        10,
        155,
        323
      ]
    },
    {
      "resource_id": "71201",
      "page": 0,
      "main_container": 104,
      "sessions": [
        71,
        221
      ]
    },
    {
      "resource_id": "73842",
      "page": 0,
      "main_container": 61,
      "sessions": [
        67
      ]
    },
    {
      "resource_id": "73843",
      "page": 0,
      "main_container": 62,
      "sessions": [
        146
      ]
    },
    {
      "resource_id": "73844",
      "page": 0,
      "main_container": 63,
      "sessions": [
        218
      ]
    },
    {
      "resource_id": "79827",
      "page": 0,
      "main_container": 14,
      "sessions": [
        353,
        358
      ]
    },
    {
      "resource_id": "79828",
      "page": 0,
      "main_container": 15,
      "sessions": [
        356,
        364
      ]
    },
    {
      "resource_id": "79833",
      "page": 0,
      "main_container": 177,
      "sessions": [
        172,
        328,
        332
      ]
    },
    {
      "resource_id": "79850",
      "page": 0,
      "main_container": 65,
      "sessions": [
        357,
        365
      ]
    },
    {
      "resource_id": "79870",
      "page": 0,
      "main_container": 5,
      "sessions": [
        88,
        253,
        324
      ]
    },
    {
      "resource_id": "79910",
      "page": 0,
      "main_container": 107,
      "sessions": [
        94
      ]
    },
    {
      "resource_id": "79942",
      "page": 0,
      "main_container": 105,
      "sessions": [
        53,
        475
      ]
    },
    {
      "resource_id": "79944",
      "page": 0,
      "main_container": 106,
      "sessions": [
        206,
        503
      ]
    },
    {
      "resource_id": "81163",
      "page": 0,
      "main_container": 180,
      "sessions": [
        104,
        298,
        310
      ]
    },
    {
      "resource_id": "82025",
      "page": 0,
      "main_container": 68,
      "sessions": [
        32,
        113,
        255,
        318
      ]
    },
    {
      "resource_id": "82030",
      "page": 0,
      "main_container": 69,
      "sessions": [
        36,
        190,
        322
      ]
    },
    {
      "resource_id": "9287",
      "page": 0,
      "main_container": 140,
      "sessions": [
        19,
        191
      ]
    }
  ]
}