d25723aa-aa04-4376-a837-c8c091ae8ebf
0c60cd17-9815-4c03-90eb-ecbe71e01c9c
31f2be84-65ee-4193-9e42-b24f9b3ce5b5
02cf7ef1-e950-4217-918c-58f6a157581a
46635504-f6c6-4d24-928e-712118023d7e
caba7108-af52-4f4f-aeae-8d52a378a853
