7c077d58-603e-430b-869a-4d89740d82f0
4b93520b-4efc-4d3b-8e98-1394f64a52bc
54c9b50b-4662-4bbc-a2d3-2ee36c3c4e89
828f4028-5e0d-41fc-b68f-5fbc8f1ad53a
f882e50a-93fb-4dc4-92d3-8d93420a5ff2
d42899cc-4a60-451a-ab43-429eec680726
e1ed95d2-60c7-4cea-80ab-116900bbf0ba
fcd3bee3-b23b-4b62-bc67-78be51c9cfd5
a2203ee8-4ea7-4efb-a360-424df75eb47e
89a3fd22-7872-49ca-8ae9-8ba0016126b4
a9810305-1885-4fd5-b02e-0a0dc2a9516d
eb84d5fb-e5af-49ec-bed0-d9f57e29911a
b54b74be-5a4e-4e77-941b-fc3b7bf13176
e0cb5b5e-a7e8-43bf-9e7f-9cb5e97c41ce
cccdfec0-f314-4a55-a786-cfe4338be4d3
86460c23-c395-4270-997e-8dfe3d8e5522
20aee169-99f4-47a4-8879-7b2e46642223
4f4c5a6b-8f37-47bc-9cbc-0eb33835734e
dc39ef3c-50e8-4472-840b-15106e28e851
59a9f630-0d10-45f6-b1bf-29ae6a0cb5b0
08593de4-595b-4650-859f-53391de71730
2b45d671-328c-414a-9d9c-4d0420a766e7
86d3bcd9-2802-4b6a-a258-fcd076a6ad03
037731de-ddd7-49a1-86e9-2a3a9c1629e4
dbb42e51-b5a7-4879-9ece-8b926a0a3006
897fcdb9-49c9-417c-aa5c-1a836f634c5e
697bda10-1727-4250-9563-14d9b950eb2c
03226f4d-9cf3-43ef-a337-c0de42fcaeba
c3941085-906c-4022-9598-e25aeff465fb
1e3370d1-0d0d-4253-9481-bfb75d545e05
3805db7c-a362-4e33-baf8-b0306f3a3bb5
f444b5ca-7b04-40e8-aa4f-bc2241c79c4f
