' ALT + D

@startuml
Client -> SIP: Identification\n{ "type" : "id", "id" : "<UUID>"}
Client <- SIP: Heartbeat\n{"type" : "heartbeat" , "heartbeat" : <unixtimestamp>}

Client -> SIP: ZLiC Request\nWAV-Format
SIP -> Client: ZLiC Response\nWAV-Format

Client <- SIP: Heartbeat\n{"type" : "heartbeat" , "heartbeat" : <unixtimestamp>}
@enduml

