-1 -1 -1 -1 -1 -1 -1 -1 -1 -1 -1 -1  0
 0  0  0  0  0  0  0  2  2  2  2  2  2
 2  2 13 13 13 13 13 13 13 13 14 14 14
14 14 14 14 14 15 15 15 15 15 15 15 15
16 16 16 16 16 16 16 16 17 17 17 17 17
17 17 17 18 18 18 18 18 18 18 18 19 19
19 19 19 19 19 19 20 20 20 20 20 20 20
20 21 21 21 21 21 21 21 21 24 24 24 24
24 24 24 24 29 29 29 29 29 29 29 29 31
31 31 31 31 31 31 31 33 33 33 33 33 33
33 33 34 34 34 34 34 34 34 34 35 35 35
35 35 35 35 35 43 43 43 43 43 43 43 43
44 44 44 44 44 44 44 44 45 45 45 45 45
45 45 45 46 46 46 46 46 46 46 46 47 47
47 47 47 47 47 47 48 48 48 48 48 48 48
48 49 49 49 49 49 49 49 49 50 50 50 50
50 50 50 50 55 55 55 55 55 55 55 55 56
56 56 56 56 56 56 56 57 57 57 57 57 57
57 57 58 58 58 58 58 58 58 58 59 59 59
59 59 59 59 59 60 60 60 60 60 60 60 60
61 61 61 61 61 61 61 61 62 62 62 62 62
62 62 62 63 63 63 63 63 63 63 63 64 64
64 64 64 64 64 64 66 66 66 66 66 66 66
66 68 68 68 68 68 68 68 68 69 69 69 69
69 69 69 69 70 70 70 70 70 70 70 70 71
71 71 71 71 71 71 71 72 72 72 72 72 72
72 72 73 73 73 73 73 73 73 73 74 74 74
74 74 74 74 74 76 76 76 76 76 76 76 76
78 78 78 78 78 78 78 78 85 85 85 85 85
85 85 85 86 86 86 86 86 86 86 86 87 87
87 87 87 87 87 87 88 88 88 88 88 88 88
88 89 89 89 89 89 89 89 89 90 90 90 90
90 90 90 90 91 91 91 91 91 91 91 91 92
92 92 92 92 92 92 92 96 96 96 96 96 96
96 96 100 100 100 100 100 100 100 100 
101 101 101 101 101 101 101 101