{
    "useConfigFiles": true,
    "plugins": {
        "@hperchec/vue-cli-plugin-scorpion-ui": {
            "prompts": true,
            "version": "latest"
        },
        "@vue/cli-plugin-pwa": {
            "version": "~5.0.8"
        },
        "@vue/cli-plugin-babel": {
            "version": "~5.0.8"
        },
        "@vue/cli-plugin-eslint": {
            "version": "~5.0.8",
            "config": "standard",
            "lintOn": [
                "save"
            ]
      },
      "@vue/cli-plugin-unit-jest": {
        "version": "~5.0.8"
      },
      "@vue/cli-plugin-e2e-cypress": {
        "version": "~5.0.8"
      }
    },
    "vueVersion": "2",
    "cssPreprocessor": "dart-sass"
}