{
  "APP_NAME": "Scorpion UI Example",
  "SOCIAL": {
    "FACEBOOK_URL": "",
    "TWITTER_URL": "",
    "DISCORD_SERVER_ID": "972997305739395092",
    "DISCORD_INVITE_LINK": "https://discord.gg/AWTgVAVKaR"
  },
  "THEMES": {
    "LIGHT": {
      "PRIMARY"         :    "#7C77BB",
      "SECONDARY"       :    "#36393F",
      "TERTIARY"        :    "#202225",
      "ACTION"          :    "#7C77BB",
      "SUCCESS"         :    "#1ABC9C",
      "WARNING"         :    "#F0B132",
      "ERROR"           :    "#F65D6C",
      "INFO"            :    "#5450F4",
      "TEXT_PRIMARY"    :    "#000000",
      "TEXT_SECONDARY"  :    "#101010",
      "ALABASTER"       :    "#FAFAFA",
      "WHITE_SMOKE"     :    "#F5F5F5"
    },
    "DARK": {
      "PRIMARY"         :    "#7C77BB",
      "SECONDARY"       :    "#36393F",
      "TERTIARY"        :    "#202225",
      "ACTION"          :    "#7C77BB",
      "SUCCESS"         :    "#1ABC9C",
      "WARNING"         :    "#F0B132",
      "ERROR"           :    "#F65D6C",
      "INFO"            :    "#5450F4",
      "TEXT_PRIMARY"    :    "#DBDEE1",
      "TEXT_SECONDARY"  :    "#F0F0F0",
      "HAITI"           :    "#190743",
      "BLACK_ROCK"      :    "#030206",
      "MIRAGE"          :    "#130C30",
      "JAGUAR"          :    "#070110"
    }
  },
  "BREAKPOINTS": {
    "2XL"   :    1536,
    "XL"    :    1280,
    "LG"    :    1024,
    "MD"    :    768,
    "SM"    :    640
  },
  "MODALS": {
    "Z_INDEX_BASE": 500
  }
}
