%%{
    init: {
        'theme': 'base',
        'themeVariables': {
            'background': 'transparent',
            'mainBkg': '#fff',
            'secondBkg': '#ffffde',
            'textColor': '#333',
            'fontFamily': 'Arial, sans-serif',
            'fontSize': '16px',
            'primaryColor': '#F65D6C',
            'primaryTextColor': '#fff',
            'primaryBorderColor': '#F65D6C',
            'secondaryColor': '#F9A17C',
            'secondaryTextColor': '#fff',
            'secondaryBorderColor': '#F9A17C',
            'tertiaryColor': '#C79650',
            'tertiaryTextColor': '#fff',
            'tertiaryBorderColor': '#C79650',
            'lineColor': '#F9A17C',
            'noteBorderColor': '#fff5ad',
            'noteBkgColor': '#fff5ad',
            'noteTextColor': '#333',
            'arrowheadColor': 'red',
            'labelBackground': '#e8e8e8',

            'nodeBkg': '#F65D6C',
            'nodeBorder': '#F65D6C',
            'clusterBkg': '#FEEEF0',
            'clusterBorder': 'none',
            'defaultLinkColor': '#F9A17C',
            'titleColor': '#F65D6C',
            'edgeLabelBackground': '#C79650'
        },
        'flowchart': {
            'titleTopMargin': 25,
            'diagramPadding': 8,
            'nodeSpacing': 40,
            'rankSpacing': 30
        }
    }
}%%
flowchart TB

    %% Core
    Core("<svg version='1.1' width='40' height='40' xmlns='http://www.w3.org/2000/svg' xmlns:xlink='http://www.w3.org/1999/xlink' x='0px' y='0px' viewBox='0 0 1200 1200' enable-background='new 0 0 1200 1200' xml:space='preserve'><g><g><g><linearGradient id='SVGID_1_' gradientUnits='userSpaceOnUse' x1='1703.8506' y1='199.5737' x2='984.5436' y2='1058.8916' gradientTransform='matrix(-0.91 0.4147 0.4147 0.91 1482.0361 -461.2266)'><stop  offset='0' style='stop-color:#FCDF8A'/><stop  offset='0.4916' style='stop-color:#F9A17C'/><stop  offset='1' style='stop-color:#F65D6C'/></linearGradient><path style='fill:url(#SVGID_1_)' d='M565.418,718.28c-7.933,16.874-29.095,26.496-47.026,21.383L413.74,709.821c-17.931-5.113-38.287-23.454-45.235-40.757l-22.793-56.764c-6.948-17.303-17.978-17.171-24.511,0.293l-27.329,73.058c-6.533,17.464-3.922,44.771,5.801,60.681l64.219,105.079c9.723,15.91,31.582,35.209,48.574,42.886l49.161,22.212c16.992,7.677,37.503,27.708,45.581,44.514l31.418,65.372c8.077,16.806-0.51,29.203-19.083,27.549l-66.472-5.919c-18.572-1.653-20.975,5.304-5.338,15.462l179.42,116.555c15.637,10.158,13.174,18.422-5.472,18.364l-206.528-0.635c-18.646-0.058-46.837-8.192-62.647-18.077l-131.726-82.355c-15.811-9.885-27.72-33.193-26.466-51.798l42.454-629.73c1.254-18.604-2.775-48.219-8.953-65.812l-52.771-150.265c-6.178-17.592,0.232-42.05,14.245-54.351L335.167,17.333c14.013-12.301,37.814-13.388,52.89-2.417l191.75,139.539c15.076,10.972,32.373,34.375,38.436,52.007l26.642,77.472c6.063,17.632-1.251,23-16.253,11.928L437.029,154.461c-15.003-11.072-20.661-6.385-12.574,10.417l35.857,74.496c8.087,16.801,26.869,39.753,41.738,51.004l507.186,383.791c14.869,11.251,24.651,35.525,21.739,53.942l-24.267,153.446c-2.912,18.417-15.269,45.029-27.458,59.14L844.237,1096.98c-12.189,14.109-20.042,10.547-17.45-7.918l29.746-211.878c2.592-18.465-4.235-21.216-15.172-6.114l-39.143,54.05c-10.937,15.102-25.927,13.449-33.312-3.672l-28.724-66.598c-7.385-17.121-9.046-45.743-3.692-63.604l15.49-51.674c5.354-17.861,5.129-47.019-0.499-64.795l-37.175-117.405c-5.628-17.776-24.524-37.661-41.99-44.188l-73.066-27.305c-17.466-6.527-24.802,1.71-16.301,18.306l27.887,54.442c8.501,16.595,8.965,43.979,1.032,60.854L565.418,718.28z'/></g></g></g></svg><div>Core</div>"):::transparentNode
    %% Core init method
    initMethod(["<div style='display: inline; font-family:monospace; background-color:#362F2D !important; border-radius: 4px; padding: 4px; color:#FAFAFA !important;'><span style='color:#FCDF8A !important;'>init()</span></div> method"]):::purpleNode
    %% Core registerService method
    registerServiceMethod(["<div style='display: inline; font-family:monospace; background-color:#362F2D !important; border-radius: 4px; padding: 4px; color:#FAFAFA !important;'><span style='color:#FCDF8A !important;'>registerService()</span></div> method"]):::purpleNode
    %% Core setup method
    setupMethod(["Core <div style='display: inline; font-family:monospace; background-color:#362F2D !important; border-radius: 4px; padding: 4px; color:#FAFAFA !important;'><span style='color:#FCDF8A !important;'>setup()</span></div> method"]):::purpleNode

    %% Core --> init method
    Core --- initMethod
    %% Core --> registerService method
    Core -.- registerServiceMethod

    %% Service registering
    subgraph SrvRegistering ["fa:fa-cubes Service registering"]
        registerMethodCall("calls <div style='display: inline; font-family:monospace; background-color:#362F2D !important; border-radius: 4px; padding: 4px; color:#FAFAFA !important;'><span style='color:#FCDF8A !important;'>register()</span></div> service method"):::primaryNode
    end

    %% Init method |auto register built in services| SrvRegistering
    initMethod --- |"<div style='color:inherit; padding:0 !important;'>fa:fa-lightbulb Auto register built-in services</div>"| SrvRegistering
    %% registerService method --> SrvRegistering
    registerServiceMethod -.- |"<div style='color:inherit; padding:0 !important;'>fa:fa-plus Register additional service"| SrvRegistering

    SrvRegistering --- setupMethod

    %% Service creation
    subgraph SrvCreation ["fa:fa-hammer Service creation"]
        direction TB
        onBeforeCreateServiceCall{{"<b>BEFORE_CREATE_SERVICE</b> hook"}}:::purpleInvertedNode
        createMethodCall("calls <div style='display: inline; font-family:monospace; background-color:#362F2D !important; border-radius: 4px; padding: 4px; color:#FAFAFA !important;'><span style='color:#FCDF8A !important;'>create()</span></div> service method"):::primaryNode
        onServiceCreated{{"<b>SERVICE_CREATED</b> hook"}}:::purpleInvertedNode
        onBeforeCreateServiceCall --- createMethodCall
        createMethodCall --- onServiceCreated
    end

    %% setup method |Throws services creation| SrvCreation
    setupMethod --- |"Throws services creation"| SrvCreation

    SrvCreation --- SrvIsCreated(["Service is created fa:fa-check"]):::greenNode

    %% Custom style classes

    %% Nodes
    classDef primaryNode fill:#F65D6C, stroke:none, color:#FAFAFA;
    classDef purpleNode fill:#B170FA, stroke:none, color:white;
    classDef purpleInvertedNode fill:transparent, stroke:#B170FA, color:#B170FA;
    classDef greenNode fill:#40C794, stroke:none, color:white;
    classDef transparentNode fill:transparent, stroke-width:0, color:inherit;

    %% Overwrites link edges: add padding, round corners and lower font size
    classDef edgeLabel padding:4px, display:block, border-radius:4px, font-size: 0.8rem;
    %% Overwrites cluster (subgraphs): round corners
    classDef cluster rx: 8px, ry: 8px;
    %% Overwrites cluster-label: increase line-height
    classDef nodeLabel line-height:32px;
