[{
        "constant": true,
        "inputs": [],
        "name": "totalSupply",
        "outputs": [{
            "name": "",
            "type": "uint256"
        }],
        "payable": false,
        "stateMutability": "view",
        "type": "function"
    },
    {
        "constant": true,
        "inputs": [{
            "name": "account",
            "type": "address"
        }],
        "name": "balanceOf",
        "outputs": [{
            "name": "",
            "type": "uint256"
        }],
        "payable": false,
        "stateMutability": "view",
        "type": "function"
    },
    {
        "inputs": [{
            "name": "storageAddr",
            "type": "address"
        }],
        "payable": false,
        "stateMutability": "nonpayable",
        "type": "constructor"
    },
    {
        "anonymous": false,
        "inputs": [{
                "indexed": true,
                "name": "to",
                "type": "address"
            },
            {
                "indexed": false,
                "name": "amount",
                "type": "uint256"
            },
            {
                "indexed": false,
                "name": "ref",
                "type": "bytes32"
            }
        ],
        "name": "Deposit",
        "type": "event"
    },
    {
        "anonymous": false,
        "inputs": [{
                "indexed": true,
                "name": "from",
                "type": "address"
            },
            {
                "indexed": false,
                "name": "amount",
                "type": "uint256"
            },
            {
                "indexed": false,
                "name": "ref",
                "type": "bytes32"
            },
            {
                "indexed": false,
                "name": "feeType",
                "type": "bytes32"
            }
        ],
        "name": "Withdraw",
        "type": "event"
    },
    {
        "anonymous": false,
        "inputs": [{
                "indexed": true,
                "name": "from",
                "type": "address"
            },
            {
                "indexed": true,
                "name": "to",
                "type": "address"
            },
            {
                "indexed": false,
                "name": "value",
                "type": "uint256"
            }
        ],
        "name": "Transfer",
        "type": "event"
    },
    {
        "constant": true,
        "inputs": [],
        "name": "version",
        "outputs": [{
            "name": "",
            "type": "uint256"
        }],
        "payable": false,
        "stateMutability": "pure",
        "type": "function"
    },
    {
        "constant": true,
        "inputs": [],
        "name": "name",
        "outputs": [{
            "name": "",
            "type": "string"
        }],
        "payable": false,
        "stateMutability": "view",
        "type": "function"
    },
    {
        "constant": true,
        "inputs": [],
        "name": "symbol",
        "outputs": [{
            "name": "",
            "type": "string"
        }],
        "payable": false,
        "stateMutability": "view",
        "type": "function"
    },
    {
        "constant": true,
        "inputs": [],
        "name": "decimals",
        "outputs": [{
            "name": "",
            "type": "uint8"
        }],
        "payable": false,
        "stateMutability": "pure",
        "type": "function"
    },
    {
        "constant": true,
        "inputs": [{
            "name": "account",
            "type": "address"
        }],
        "name": "balanceOfAndSymbol",
        "outputs": [{
                "name": "balance_",
                "type": "uint256"
            },
            {
                "name": "symbol_",
                "type": "string"
            }
        ],
        "payable": false,
        "stateMutability": "view",
        "type": "function"
    },
    {
        "constant": true,
        "inputs": [{
                "name": "sig",
                "type": "bytes4"
            },
            {
                "name": "amount",
                "type": "uint256"
            }
        ],
        "name": "estimateCosts",
        "outputs": [{
            "name": "cost",
            "type": "uint256"
        }],
        "payable": false,
        "stateMutability": "view",
        "type": "function"
    },
    {
        "constant": false,
        "inputs": [{
                "name": "account",
                "type": "address"
            },
            {
                "name": "amount",
                "type": "uint256"
            },
            {
                "name": "ref",
                "type": "bytes32"
            }
        ],
        "name": "deposit",
        "outputs": [{
            "name": "",
            "type": "bool"
        }],
        "payable": false,
        "stateMutability": "nonpayable",
        "type": "function"
    },
    {
        "constant": false,
        "inputs": [{
                "name": "amount",
                "type": "uint256"
            },
            {
                "name": "ref",
                "type": "bytes32"
            }
        ],
        "name": "withdrawWireUS",
        "outputs": [{
            "name": "",
            "type": "bool"
        }],
        "payable": false,
        "stateMutability": "nonpayable",
        "type": "function"
    },
    {
        "constant": false,
        "inputs": [{
                "name": "amount",
                "type": "uint256"
            },
            {
                "name": "ref",
                "type": "bytes32"
            }
        ],
        "name": "withdrawWireInt",
        "outputs": [{
            "name": "",
            "type": "bool"
        }],
        "payable": false,
        "stateMutability": "nonpayable",
        "type": "function"
    },
    {
        "constant": false,
        "inputs": [{
                "name": "amount",
                "type": "uint256"
            },
            {
                "name": "ref",
                "type": "bytes32"
            }
        ],
        "name": "withdrawAchUS",
        "outputs": [{
            "name": "",
            "type": "bool"
        }],
        "payable": false,
        "stateMutability": "nonpayable",
        "type": "function"
    }
]
