<svg width="24" height="24" viewBox="0 0 24 24" fill="none" xmlns="http://www.w3.org/2000/svg">
<g clip-path="url(#clip0)">
<path d="M16.9266 4.08856C17.0203 4.15607 17.0834 4.25806 17.102 4.3721C17.1206 4.48613 17.0931 4.60287 17.0256 4.69664C16.9581 4.7904 16.8561 4.8535 16.742 4.87206C16.628 4.89063 16.5113 4.86313 16.4175 4.79562C14.9789 3.75073 13.2461 3.18863 11.4681 3.19005C6.72316 3.19005 2.87023 7.13218 2.87023 12.0011C2.87023 16.87 6.72316 20.8122 11.4681 20.8122C16.213 20.8122 20.0681 16.87 20.0681 12.0011C20.0681 11.8857 20.1139 11.775 20.1955 11.6934C20.2771 11.6118 20.3878 11.566 20.5032 11.566C20.6186 11.566 20.7293 11.6118 20.8109 11.6934C20.8925 11.775 20.9383 11.8857 20.9383 12.0011C20.9383 17.3465 16.7003 21.6824 11.4681 21.6824C6.23583 21.6824 2 17.3465 2 12.0011C2 6.65574 6.23801 2.31983 11.4681 2.31983C13.4287 2.31848 15.3394 2.93762 16.9266 4.08856Z" fill="#22096c"/>
<path d="M12.0079 14.0355L21.254 4.57611C21.3348 4.4936 21.4451 4.44656 21.5605 4.44534C21.676 4.44411 21.7872 4.48881 21.8697 4.56959C21.9522 4.65037 21.9993 4.76061 22.0005 4.87608C22.0017 4.99154 21.957 5.10276 21.8762 5.18527L12.3037 14.9623C12.2632 15.0037 12.2148 15.0366 12.1614 15.0591C12.108 15.0816 12.0506 15.0932 11.9926 15.0932C11.9347 15.0932 11.8773 15.0816 11.8239 15.0591C11.7704 15.0366 11.7221 15.0037 11.6815 14.9623L7.43917 10.6177C7.3959 10.5777 7.3612 10.5293 7.33716 10.4756C7.31313 10.4218 7.30027 10.3637 7.29937 10.3047C7.29846 10.2458 7.30953 10.1874 7.3319 10.1329C7.35426 10.0784 7.38747 10.029 7.42949 9.98768C7.47152 9.94639 7.52149 9.91407 7.57638 9.89267C7.63127 9.87127 7.68993 9.86124 7.74881 9.86318C7.8077 9.86513 7.86557 9.87902 7.91892 9.904C7.97228 9.92898 8.02001 9.96453 8.05921 10.0085L12.0079 14.0355Z" fill="#22096c"/>
</g>
<defs>
<clipPath id="clip0">
<rect x="2" y="2.31982" width="20" height="19.3626" fill="white"/>
</clipPath>
</defs>
</svg>
