<svg width="24" height="24" viewBox="0 0 24 24" fill="none" xmlns="http://www.w3.org/2000/svg">
<path fill-rule="evenodd" clip-rule="evenodd" d="M11.9759 2.88934C8.47631 2.88934 5.63934 5.72631 5.63934 9.22588C5.63934 12.7255 8.47631 15.5624 11.9759 15.5624C15.4755 15.5624 18.3124 12.7255 18.3124 9.22588C18.3124 5.72631 15.4755 2.88934 11.9759 2.88934ZM4.75 9.22588C4.75 5.23514 7.98514 2 11.9759 2C15.9666 2 19.2018 5.23514 19.2018 9.22588C19.2018 13.2166 15.9666 16.4518 11.9759 16.4518C7.98514 16.4518 4.75 13.2166 4.75 9.22588Z" fill="#0d6eff"/>
<path fill-rule="evenodd" clip-rule="evenodd" d="M11.2324 5.81233C11.502 5.4018 12.0534 5.28759 12.4639 5.55724C12.5655 5.62395 12.6523 5.71077 12.719 5.81233L13.4904 6.98679C13.5757 7.11654 13.7035 7.21251 13.8518 7.25814L15.1823 7.66738C15.6518 7.81178 15.9153 8.30941 15.7709 8.77888C15.7415 8.87459 15.6961 8.96464 15.6367 9.04523L15.2788 8.78133L15.6367 9.04523L14.7653 10.2269C14.6772 10.3464 14.6315 10.4919 14.6354 10.6403L14.6743 12.1157C14.6872 12.6067 14.2997 13.0152 13.8087 13.0281C13.6952 13.0311 13.5823 13.0124 13.4759 12.9729L12.2077 12.5024C12.058 12.4468 11.8934 12.4468 11.7437 12.5024L10.4755 12.9729C10.015 13.1438 9.50323 12.909 9.33237 12.4485C9.29289 12.3421 9.27414 12.2291 9.27713 12.1157L9.31602 10.6403C9.31993 10.4919 9.2742 10.3464 9.18608 10.2269L8.31473 9.04523C8.02323 8.64992 8.10738 8.09314 8.5027 7.80164C8.58329 7.74221 8.67334 7.69682 8.76905 7.66738L10.0995 7.25814C10.2479 7.21251 10.3757 7.11654 10.461 6.98679L11.2324 5.81233ZM11.9757 6.30057L11.2043 7.47503C11.0054 7.77778 10.7072 8.00169 10.361 8.10818L9.03051 8.51742L9.90186 9.69907C10.1075 9.97792 10.2142 10.3174 10.205 10.6638L10.1662 12.1391L11.4343 11.6686C11.7836 11.539 12.1678 11.539 12.5171 11.6686L13.7852 12.1391L13.7463 10.6638C13.7372 10.3174 13.8439 9.97792 14.0495 9.69907L14.9209 8.51742L13.5904 8.10818C13.2442 8.00169 12.946 7.77778 12.7471 7.47503L11.9757 6.30057Z" fill="#0d6eff"/>
<path fill-rule="evenodd" clip-rule="evenodd" d="M8.15582 14.6791C8.39827 14.7182 8.56311 14.9464 8.52401 15.1889L7.61044 20.853C7.60347 20.8962 7.60941 20.9406 7.62753 20.9804C7.67834 21.0922 7.81015 21.1416 7.92194 21.0908L11.2207 19.5914C11.6299 19.4054 12.0995 19.4054 12.5087 19.5914L15.8075 21.0908C15.8473 21.1089 15.8917 21.1149 15.9349 21.1079C16.0561 21.0884 16.1385 20.9742 16.119 20.853L15.2054 15.1889C15.1663 14.9464 15.3311 14.7182 15.5736 14.6791C15.816 14.64 16.0443 14.8048 16.0834 15.0473L16.997 20.7114C17.0947 21.3175 16.6826 21.8881 16.0765 21.9859C15.8604 22.0208 15.6388 21.991 15.4395 21.9004L12.1407 20.401C11.9653 20.3213 11.7641 20.3213 11.5887 20.401L8.28995 21.9004C7.73102 22.1545 7.07196 21.9074 6.81791 21.3484C6.72732 21.1491 6.69759 20.9275 6.73245 20.7114L7.64602 15.0473C7.68512 14.8048 7.91337 14.64 8.15582 14.6791Z" fill="#0d6eff"/>
</svg>
