<svg width="68" height="48" viewBox="0 0 68 48" fill="none" xmlns="http://www.w3.org/2000/svg">
<path fill-rule="evenodd" clip-rule="evenodd" d="M1.51851e-05 15.9485L0.163526 43.3847C0.165078 43.6477 0.28653 43.8957 0.493382 44.0582C0.700167 44.2208 0.969804 44.28 1.22567 44.2192C5.38351 43.2312 29.0699 37.6028 33.2106 36.6189C33.2565 36.608 33.3049 36.6185 33.3421 36.6476C33.3793 36.6765 33.4014 36.7209 33.4021 36.7681C33.4316 38.7974 33.5236 45.1124 33.5532 47.1495C33.5571 47.4125 33.6806 47.6594 33.8888 47.8202C34.097 47.9809 34.3671 48.0379 34.6224 47.9749C38.8629 46.9295 63.4641 40.8644 66.8542 40.0286C67.2397 39.9336 67.5106 39.5877 67.5106 39.1906C67.5106 36.9354 67.5106 25.849 67.5106 24.7785C67.5106 24.6852 67.4955 24.5925 67.4658 24.504C67.2642 23.9028 65.9689 20.0391 65.6488 19.0841C65.6349 19.0426 65.6391 18.9971 65.6603 18.9589C65.7736 18.7554 65.964 18.4132 66.1797 18.0256C67.0525 16.4575 67.5106 14.6925 67.5106 12.8978C67.5106 10.417 67.5106 6.66316 67.5106 3.74947C67.5106 2.60051 66.9839 1.51494 66.0816 0.803985C65.1794 0.0930317 64.001 -0.164791 62.8844 0.104373C49.0221 3.44608 5.26091 13.9953 0.660674 15.1043C0.271273 15.1981 -0.00234768 15.5478 1.51851e-05 15.9485V15.9485ZM0.707188 15.9442C0.706783 15.872 0.756133 15.809 0.826344 15.792C5.42658 14.6831 49.1878 4.13381 63.0501 0.792171C63.956 0.573774 64.912 0.782922 65.644 1.35973C66.3761 1.93654 66.8034 2.81729 66.8034 3.74947C66.8034 6.66316 66.8034 10.417 66.8034 12.8978C66.8034 14.5721 66.3761 16.2187 65.5619 17.6814C65.3461 18.0691 65.1557 18.4112 65.0425 18.6147C64.9244 18.8268 64.9011 19.0788 64.9783 19.309C65.2985 20.264 66.5937 24.1277 66.7953 24.729C66.8006 24.7449 66.8034 24.7617 66.8034 24.7785C66.8034 25.849 66.8034 36.9354 66.8034 39.1906C66.8034 39.2623 66.7545 39.3246 66.6851 39.3417C63.2949 40.1775 38.6937 46.2426 34.4532 47.288C34.4071 47.2994 34.3584 47.2891 34.3209 47.2601C34.2834 47.2311 34.2611 47.1866 34.2603 47.1392C34.2307 45.1021 34.1388 38.7871 34.1092 36.7578C34.1054 36.496 33.983 36.2501 33.7766 36.0893C33.57 35.9285 33.3018 35.8701 33.0472 35.9306C28.9065 36.9145 5.22007 42.5429 1.06223 43.5309C1.01612 43.5419 0.967509 43.5312 0.930176 43.5019C0.89291 43.4726 0.870969 43.4279 0.870699 43.3804L0.707188 15.9442V15.9442Z" fill="#EAEBF9"/>
<path d="M7.853 39.1729C7.853 39.4086 7.69138 39.6135 7.46232 39.6683C6.62964 39.8676 4.67413 40.3357 3.66451 40.5774C3.51288 40.6137 3.35302 40.5785 3.23062 40.4819C3.10822 40.3853 3.03687 40.238 3.03687 40.082C3.03687 36.6426 3.03687 20.5273 3.03687 17.77C3.03687 17.5343 3.19842 17.3294 3.42755 17.2746C5.40811 16.8005 14.2454 14.6852 14.2454 14.6852C16.5027 14.1449 17.6312 15.0914 17.6312 17.5247V23.3646C17.6312 27.7445 15.1988 30.5167 10.3341 31.6811C10.3341 31.6811 8.94249 32.0142 8.24368 32.1815C8.01455 32.2363 7.853 32.4412 7.853 32.6769C7.853 33.9519 7.853 37.8979 7.853 39.1729V39.1729ZM25.3484 26.6273C25.1192 26.6821 24.9577 26.887 24.9577 27.1227C24.9577 27.8829 24.9577 29.5374 24.9577 30.4551C24.9577 30.611 25.029 30.7584 25.1514 30.855C25.2738 30.9516 25.4337 30.9867 25.5853 30.9505C27.0132 30.6087 30.4912 29.7762 31.9191 29.4344C32.0707 29.3981 32.2306 29.4333 32.353 29.5299C32.4753 29.6265 32.5467 29.7738 32.5467 29.9298C32.5467 30.8475 32.5467 32.502 32.5467 33.2622C32.5467 33.4979 32.3852 33.7028 32.1561 33.7576C30.3707 34.185 22.9803 35.954 20.7692 36.4832C20.6176 36.5195 20.4577 36.4843 20.3353 36.3877C20.2129 36.2911 20.1415 36.1437 20.1415 35.9878C20.1415 32.5484 20.1415 16.4331 20.1415 13.6757C20.1415 13.4401 20.3031 13.2352 20.5322 13.1804C22.3175 12.753 29.708 10.984 31.9191 10.4548C32.0707 10.4185 32.2306 10.4537 32.353 10.5503C32.4753 10.6469 32.5467 10.7943 32.5467 10.9502C32.5467 11.8679 32.5467 13.5224 32.5467 14.2826C32.5467 14.5183 32.3852 14.7232 32.1561 14.778C30.8513 15.0903 26.6531 16.0952 25.3484 16.4075C25.1192 16.4623 24.9577 16.6672 24.9577 16.9029C24.9577 17.8978 24.9577 20.4828 24.9577 21.6953C24.9577 21.8512 25.029 21.9986 25.1514 22.0952C25.2738 22.1917 25.4337 22.227 25.5853 22.1906C26.8905 21.8782 29.8842 21.1617 31.1894 20.8493C31.341 20.813 31.5009 20.8481 31.6233 20.9447C31.7456 21.0413 31.817 21.1887 31.817 21.3446C31.817 22.2623 31.817 23.9168 31.817 24.6771C31.817 24.9127 31.6555 25.1176 31.4263 25.1725C30.2189 25.4615 26.5558 26.3383 25.3484 26.6273V26.6273ZM40.2785 23.0536C40.0493 23.1085 39.8878 23.3133 39.8878 23.549C39.8878 24.3092 39.8878 25.9637 39.8878 26.8814C39.8878 27.0374 39.9591 27.1847 40.0815 27.2813C40.2039 27.3779 40.3638 27.4131 40.5154 27.3768C41.9433 27.035 45.4213 26.2025 46.8492 25.8607C47.0008 25.8244 47.1607 25.8596 47.2831 25.9562C47.4054 26.0528 47.4768 26.2002 47.4768 26.3561C47.4768 27.2738 47.4768 28.9283 47.4768 29.6885C47.4768 29.9242 47.3153 30.1291 47.0861 30.1839C45.3008 30.6112 37.9104 32.3802 35.6993 32.9095C35.5477 32.9458 35.3878 32.9106 35.2654 32.814C35.143 32.7174 35.0716 32.5701 35.0716 32.4141C35.0716 28.9747 35.0716 12.8594 35.0716 10.1021C35.0716 9.86639 35.2332 9.66156 35.4623 9.60668C37.2476 9.17934 44.6381 7.41036 46.8492 6.88114C47.0008 6.84482 47.1607 6.87999 47.2831 6.9766C47.4054 7.07321 47.4768 7.22052 47.4768 7.37647C47.4768 8.29421 47.4768 9.94869 47.4768 10.7089C47.4768 10.9446 47.3153 11.1494 47.0861 11.2043C45.7814 11.5166 41.5832 12.5215 40.2785 12.8338C40.0493 12.8886 39.8878 13.0935 39.8878 13.3292C39.8878 14.3241 39.8878 16.9091 39.8878 18.1216C39.8878 18.2775 39.9591 18.4249 40.0815 18.5214C40.2039 18.6181 40.3638 18.6532 40.5154 18.617C41.8206 18.3045 44.8143 17.588 46.1195 17.2755C46.2711 17.2393 46.431 17.2745 46.5534 17.3711C46.6757 17.4677 46.7471 17.615 46.7471 17.7709C46.7471 18.6887 46.7471 20.3432 46.7471 21.1034C46.7471 21.339 46.5856 21.5439 46.3564 21.5988C45.149 21.8878 41.4859 22.7646 40.2785 23.0536V23.0536ZM64.4143 25.4625C64.4609 25.5983 64.448 25.7474 64.3788 25.8732C64.3097 25.999 64.1907 26.0897 64.0511 26.1231C63.0609 26.3602 60.9841 26.8572 60.0689 27.0763C59.8139 27.1374 59.5543 26.9947 59.469 26.7467C59.0493 25.527 57.869 22.0965 57.4493 20.8768C57.364 20.6287 57.1044 20.4861 56.8494 20.5471C56.3808 20.6593 55.6539 20.8333 55.2085 20.9399C54.9794 20.9947 54.8179 21.1996 54.8179 21.4353C54.8179 22.7104 54.8179 26.6563 54.8179 27.9314C54.8179 28.167 54.6562 28.3719 54.4272 28.4267C53.5945 28.6261 51.6389 29.0941 50.6294 29.3358C50.4777 29.3721 50.3179 29.3369 50.1955 29.2403C50.0731 29.1437 50.0017 28.9964 50.0017 28.8404C50.0017 25.401 50.0017 9.28573 50.0017 6.5284C50.0017 6.29272 50.1633 6.08783 50.3923 6.03301C52.3729 5.55895 61.2102 3.44364 61.2102 3.44364C63.4674 2.90335 64.5961 3.84985 64.5961 6.28313V12.123C64.5961 14.6319 63.7995 16.6137 62.2062 18.0687C62.0552 18.2051 62 18.4184 62.0661 18.611C62.4744 19.8049 63.9049 23.977 64.4143 25.4625V25.4625ZM10.3341 27.3012C11.9881 26.9053 12.8151 25.9773 12.8151 24.5174C12.8151 24.5174 12.8151 21.4273 12.8151 20.0531C12.8151 19.8971 12.7437 19.7498 12.6213 19.6532C12.4989 19.5566 12.3391 19.5214 12.1874 19.5577C11.1482 19.8064 9.09992 20.2967 8.24368 20.5017C8.01455 20.5566 7.853 20.7615 7.853 20.9971C7.853 22.1994 7.853 25.7759 7.853 27.2494C7.853 27.4054 7.92443 27.5527 8.04682 27.6494C8.16915 27.746 8.32909 27.7811 8.48065 27.7448C9.2157 27.5689 10.3341 27.3012 10.3341 27.3012V27.3012ZM57.2989 16.0596C58.953 15.6637 59.78 14.7358 59.78 13.2758C59.78 13.2758 59.78 10.1857 59.78 8.81154C59.78 8.65559 59.7085 8.50821 59.5861 8.41161C59.4637 8.315 59.3039 8.27983 59.1522 8.31615C58.1131 8.56486 56.0648 9.05518 55.2085 9.26015C54.9794 9.31497 54.8179 9.51986 54.8179 9.75547C54.8179 10.9578 54.8179 14.5343 54.8179 16.0079C54.8179 16.1638 54.8892 16.3112 55.0116 16.4078C55.134 16.5044 55.2939 16.5395 55.4455 16.5032C56.1805 16.3273 57.2989 16.0596 57.2989 16.0596V16.0596Z" fill="url(#paint0_linear)"/>
<path d="M40.8033 44.2761L37.5177 45.1028C36.5697 45.3414 36.0957 44.9497 36.0957 43.9277V37.1826C36.0957 36.1607 36.5697 35.5304 37.5177 35.2918L40.8033 34.4651C41.7513 34.2265 42.2254 34.6182 42.2254 35.6402V37.0408C42.2254 37.1186 42.1725 37.1865 42.0971 37.2055C41.7574 37.2909 40.8326 37.5236 40.4137 37.629C40.363 37.6418 40.3092 37.6304 40.2679 37.5983C40.2267 37.5661 40.2026 37.5167 40.2026 37.4644C40.2026 37.2414 40.2026 36.8966 40.2026 36.6736C40.2026 36.6212 40.1785 36.5719 40.1372 36.5397C40.096 36.5075 40.0422 36.4961 39.9915 36.5089C39.5614 36.6171 38.5952 36.8603 38.2468 36.9479C38.1714 36.9669 38.1185 37.0348 38.1185 37.1126C38.1185 37.8947 38.1185 41.9105 38.1185 42.8944C38.1185 42.9467 38.1426 42.9961 38.1839 43.0282C38.2251 43.0604 38.2789 43.0718 38.3296 43.059C38.7597 42.9508 39.7258 42.7076 40.0742 42.62C40.1497 42.601 40.2026 42.5332 40.2026 42.4553C40.2026 42.1418 40.2026 41.3512 40.2026 40.9659C40.2026 40.9136 40.1785 40.8642 40.1372 40.832C40.096 40.7999 40.0422 40.7885 39.9915 40.8013C39.8109 40.8467 39.5522 40.9118 39.3717 40.9572C39.321 40.97 39.2671 40.9586 39.2259 40.9264C39.1846 40.8943 39.1605 40.8449 39.1605 40.7926C39.1605 40.4073 39.1605 39.6167 39.1605 39.3031C39.1605 39.2253 39.2134 39.1575 39.2888 39.1385C39.7636 39.0191 41.4231 38.6014 42.0142 38.4526C42.065 38.4399 42.1187 38.4512 42.16 38.4834C42.2012 38.5156 42.2254 38.565 42.2254 38.6173C42.2254 39.45 42.2254 42.3853 42.2254 42.3853C42.2254 43.4073 41.7513 44.0375 40.8033 44.2761V44.2761ZM47.3459 40.9764C47.3374 40.9303 47.3102 40.8897 47.2707 40.8644C47.2312 40.8391 47.1831 40.8312 47.1376 40.8426C46.6937 40.9543 45.5356 41.2457 45.177 41.336C45.1117 41.3524 45.0623 41.4059 45.051 41.4723C44.9939 41.8104 44.8204 42.8369 44.7632 43.175C44.7519 43.2414 44.7025 43.2949 44.6372 43.3114C44.3198 43.3912 43.38 43.6277 42.9226 43.7428C42.8666 43.7569 42.8073 43.7416 42.7651 43.7021C42.723 43.6626 42.7038 43.6044 42.7142 43.5476C42.987 42.0565 44.3489 34.6139 44.5288 33.6301C44.5409 33.5646 44.5899 33.5122 44.6544 33.496C45.1298 33.3764 47.0691 32.8884 47.6614 32.7393C47.7064 32.7279 47.7541 32.7356 47.7934 32.7604C47.8326 32.7851 47.86 32.8249 47.8692 32.8704C48.1054 34.0424 49.458 40.7539 49.6839 41.8747C49.7018 41.9635 49.6468 42.0508 49.5589 42.0729C49.1789 42.1685 48.2116 42.4119 47.8133 42.5122C47.7679 42.5236 47.7197 42.5157 47.6802 42.4904C47.6407 42.465 47.6135 42.4245 47.605 42.3784C47.5427 42.0413 47.4082 41.3135 47.3459 40.9764V40.9764ZM53.9067 39.8016C53.8173 39.8241 53.7264 39.7711 53.7017 39.6823C53.5439 39.1129 52.9994 37.1472 52.6388 35.8458C52.6161 35.764 52.5365 35.7114 52.4524 35.7229C52.3682 35.7343 52.3055 35.8062 52.3055 35.8912C52.3055 37.6276 52.3055 40.6342 52.3055 41.2985C52.3055 41.3763 52.2526 41.4442 52.1772 41.4631C51.862 41.5425 51.0471 41.7476 50.6594 41.8451C50.6086 41.8579 50.5548 41.8465 50.5136 41.8143C50.4723 41.7822 50.4482 41.7328 50.4482 41.6805C50.4482 40.3442 50.4482 33.2767 50.4482 32.2195C50.4482 32.1418 50.5011 32.0738 50.5765 32.0549C51.0207 31.9431 52.4924 31.5728 52.9839 31.4491C53.0735 31.4265 53.1647 31.4799 53.189 31.5691C53.3686 32.2283 54.0546 34.7471 54.3808 35.9448C54.4012 36.0196 54.4696 36.0711 54.5471 36.0699C54.6247 36.0687 54.6916 36.0151 54.7096 35.9397C55.04 34.5605 55.7968 31.4008 55.941 30.799C55.9557 30.7375 56.0034 30.6893 56.0647 30.6739C56.4576 30.575 57.9042 30.211 58.4509 30.0734C58.5016 30.0607 58.5554 30.072 58.5966 30.1042C58.6379 30.1364 58.662 30.1858 58.662 30.2381C58.662 31.5744 58.662 38.6418 58.662 39.699C58.662 39.7768 58.6091 39.8446 58.5337 39.8637C58.2184 39.943 57.4037 40.148 57.0158 40.2456C56.9651 40.2583 56.9113 40.247 56.8701 40.2149C56.8288 40.1827 56.8047 40.1333 56.8047 40.0809C56.8047 39.3025 56.8047 36.6142 56.8047 34.9271C56.8047 34.8411 56.7405 34.7687 56.6552 34.7585C56.5699 34.7483 56.4904 34.8034 56.4701 34.8869C56.0921 36.4414 55.5132 38.8223 55.3885 39.3353C55.3735 39.3965 55.326 39.4444 55.2649 39.4598C54.9938 39.528 54.2391 39.7179 53.9067 39.8016V39.8016ZM61.5815 35.3347C61.5061 35.3536 61.4532 35.4215 61.4532 35.4993C61.4532 35.8129 61.4532 36.6035 61.4532 36.9887C61.4532 37.0411 61.4774 37.0905 61.5186 37.1226C61.5599 37.1548 61.6136 37.1662 61.6644 37.1534C62.2432 37.0077 63.8507 36.6033 64.4295 36.4576C64.4802 36.4448 64.5341 36.4562 64.5753 36.4884C64.6166 36.5205 64.6407 36.5699 64.6407 36.6222C64.6407 37.0075 64.6407 37.7981 64.6407 38.1116C64.6407 38.1895 64.5878 38.2573 64.5123 38.2763C63.8184 38.451 60.5132 39.2826 59.6416 39.502C59.5909 39.5147 59.5371 39.5034 59.4958 39.4712C59.4546 39.439 59.4305 39.3896 59.4305 39.3373C59.4305 38.001 59.4305 30.9337 59.4305 29.8764C59.4305 29.7986 59.4833 29.7308 59.5587 29.7118C60.2527 29.5371 63.5579 28.7054 64.4295 28.4861C64.4802 28.4733 64.5341 28.4846 64.5753 28.5168C64.6166 28.549 64.6407 28.5984 64.6407 28.6508C64.6407 29.036 64.6407 29.8266 64.6407 30.1402C64.6407 30.218 64.5878 30.2858 64.5123 30.3049C63.9988 30.4341 62.095 30.9131 61.5815 31.0423C61.5061 31.0613 61.4532 31.1292 61.4532 31.207C61.4532 31.6081 61.4532 32.8128 61.4532 33.3096C61.4532 33.3619 61.4774 33.4113 61.5186 33.4435C61.5599 33.4757 61.6136 33.487 61.6644 33.4743C62.197 33.3402 63.5905 32.9896 64.123 32.8555C64.1737 32.8428 64.2276 32.8541 64.2688 32.8863C64.3101 32.9185 64.3342 32.9679 64.3342 33.0202C64.3342 33.4055 64.3342 34.1961 64.3342 34.5096C64.3342 34.5875 64.2813 34.6553 64.2059 34.6743C63.7286 34.7944 62.0588 35.2146 61.5815 35.3347V35.3347ZM46.8339 39.0795C46.9206 39.0576 46.9756 38.9721 46.9594 38.8841C46.8309 38.1848 46.3125 35.364 46.2421 34.9811C46.24 34.97 46.2335 34.9601 46.2239 34.954C46.2144 34.9478 46.2027 34.9459 46.1917 34.9487C46.1916 34.9487 46.1916 34.9488 46.1915 34.9488C46.1653 34.9553 46.1455 34.9769 46.141 35.0035C46.0751 35.3952 45.5866 38.2991 45.4375 39.1855C45.428 39.242 45.4477 39.2995 45.4897 39.3384C45.5319 39.3773 45.5907 39.3923 45.6463 39.3783C45.98 39.2943 46.5585 39.1487 46.8339 39.0795V39.0795Z" fill="#EAEBF9"/>
<defs>
<linearGradient id="paint0_linear" x1="45.4384" y1="-18.9416" x2="46.9655" y2="55.6846" gradientUnits="userSpaceOnUse">
<stop stop-color="white"/>
<stop offset="0.24" stop-color="#FFFDF6"/>
<stop offset="0.32" stop-color="#FFF9E1"/>
<stop offset="0.4" stop-color="#FFF5CC"/>
<stop offset="1" stop-color="#C9509D"/>
</linearGradient>
</defs>
</svg>
