<?xml version="1.0" encoding="UTF-8"?>
<svg xmlns="http://www.w3.org/2000/svg" xmlns:xlink="http://www.w3.org/1999/xlink" width="150px" height="px" viewBox="0 0 150 120" version="1.1">
<g id="surface1">
<path style=" stroke:none;fill-rule:nonzero;fill:rgb(0%,0%,0%);fill-opacity:1;" d="M 24.375 22.5 L 13.125 22.5 C 10.019531 22.5 7.5 25.03125 7.5 28.125 L 7.5 52.5 C 3.359375 52.5 0 55.851562 0 60 C 0 64.140625 3.359375 67.5 7.289062 67.5 L 7.5 91.875 C 7.5 94.992188 10.019531 97.5 13.125 97.5 L 24.375 97.5 C 27.492188 97.5 30 94.992188 30 91.875 L 30 28.125 C 30 25.03125 27.492188 22.5 24.375 22.5 Z M 106.875 7.5 L 95.625 7.5 C 92.53125 7.5 90 10.019531 90 13.125 L 90 52.5 L 60 52.5 L 60 13.125 C 60 10.019531 57.492188 7.5 54.375 7.5 L 43.125 7.5 C 40.03125 7.5 37.5 10.019531 37.5 13.125 L 37.5 106.875 C 37.5 109.992188 40.03125 112.5 43.125 112.5 L 54.375 112.5 C 57.492188 112.5 60 109.992188 60 106.875 L 60 67.5 L 90 67.5 L 90 106.875 C 90 109.980469 92.519531 112.5 95.625 112.5 L 106.875 112.5 C 109.980469 112.5 112.5 109.980469 112.5 106.875 L 112.5 13.125 C 112.5 10.019531 109.992188 7.5 106.875 7.5 Z M 142.5 52.5 L 142.5 28.125 C 142.5 25.03125 139.992188 22.5 136.875 22.5 L 125.625 22.5 C 122.53125 22.5 120 25.03125 120 28.125 L 120 91.875 C 120 94.980469 122.519531 97.5 125.625 97.5 L 136.875 97.5 C 139.980469 97.5 142.5 94.980469 142.5 91.875 L 142.5 67.5 C 146.640625 67.5 150 64.140625 150 60 C 150 55.851562 146.648438 52.5 142.5 52.5 Z M 142.5 52.5 "/>
</g>
</svg>
