<?xml version="1.0" encoding="UTF-8"?>
<svg xmlns="http://www.w3.org/2000/svg" xmlns:xlink="http://www.w3.org/1999/xlink" width="150px" height="px" viewBox="0 0 150 150" version="1.1">
<g id="surface1">
<path style=" stroke:none;fill-rule:nonzero;fill:rgb(0%,0%,0%);fill-opacity:1;" d="M 93.75 98.4375 C 93.75 101.027344 91.652344 103.125 89.0625 103.125 L 60.9375 103.125 C 58.359375 103.125 56.25 101.015625 56.25 98.4375 L 56.25 84.375 L 0 84.375 L 0 126.5625 C 0 134.0625 6.566406 140.625 14.0625 140.625 L 135.9375 140.625 C 143.433594 140.625 150 134.058594 150 126.5625 L 150 84.375 L 93.75 84.375 Z M 135.9375 28.125 L 112.5 28.125 L 112.5 14.0625 C 112.5 6.566406 105.9375 0 98.4375 0 L 51.5625 0 C 44.0625 0 37.5 6.566406 37.5 14.0625 L 37.5 28.125 L 14.0625 28.125 C 6.566406 28.125 0 34.6875 0 42.1875 L 0 75 L 150 75 L 150 42.1875 C 150 34.6875 143.4375 28.125 135.9375 28.125 Z M 98.4375 28.125 L 51.5625 28.125 L 51.5625 14.0625 L 98.4375 14.0625 Z M 98.4375 28.125 "/>
</g>
</svg>
