<?xml version="1.0" encoding="UTF-8"?>
<svg xmlns="http://www.w3.org/2000/svg" xmlns:xlink="http://www.w3.org/1999/xlink" width="150px" height="px" viewBox="0 0 150 150" version="1.1">
<g id="surface1">
<path style=" stroke:none;fill-rule:nonzero;fill:rgb(0%,0%,0%);fill-opacity:1;" d="M 135.671875 9.375 L 13.800781 9.375 C 6.296875 9.375 0 15.671875 0 23.4375 L 0 126.5625 C 0 134.328125 6.296875 140.625 13.796875 140.625 L 135.671875 140.625 C 143.441406 140.625 149.734375 134.328125 149.734375 126.5625 L 149.734375 23.4375 C 149.734375 15.671875 143.703125 9.375 135.671875 9.375 Z M 32.546875 119.53125 C 32.546875 120.824219 31.5 121.875 30.203125 121.875 L 16.140625 121.875 C 14.847656 121.875 13.796875 120.824219 13.796875 119.53125 L 13.796875 105.46875 C 13.796875 104.175781 14.847656 103.125 16.140625 103.125 L 29.941406 103.125 C 31.234375 103.125 32.285156 104.175781 32.285156 105.46875 Z M 32.546875 82.03125 C 32.546875 83.324219 31.5 84.375 30.203125 84.375 L 16.140625 84.375 C 14.847656 84.375 13.796875 83.324219 13.796875 82.03125 L 13.796875 67.96875 C 13.796875 66.675781 14.847656 65.625 16.140625 65.625 L 29.941406 65.625 C 31.234375 65.625 32.285156 66.675781 32.285156 67.96875 L 32.285156 82.03125 Z M 32.546875 44.53125 C 32.546875 45.824219 31.5 46.875 30.203125 46.875 L 16.140625 46.875 C 14.847656 46.875 13.796875 45.824219 13.796875 44.53125 L 13.796875 30.46875 C 13.796875 29.175781 14.847656 28.125 16.140625 28.125 L 29.941406 28.125 C 31.234375 28.125 32.285156 29.175781 32.285156 30.46875 Z M 102.859375 117.1875 C 102.859375 119.777344 100.761719 121.875 98.171875 121.875 L 51.296875 121.875 C 48.710938 121.875 46.609375 119.777344 46.609375 117.1875 L 46.609375 89.0625 C 46.609375 86.472656 48.710938 84.375 51.296875 84.375 L 98.171875 84.375 C 100.761719 84.375 102.859375 86.472656 102.859375 89.0625 Z M 102.859375 60.9375 C 102.859375 63.527344 100.761719 65.625 98.171875 65.625 L 51.296875 65.625 C 48.710938 65.625 46.609375 63.527344 46.609375 60.9375 L 46.609375 32.8125 C 46.609375 30.222656 48.710938 28.125 51.296875 28.125 L 98.171875 28.125 C 100.761719 28.125 102.859375 30.222656 102.859375 32.8125 Z M 135.671875 119.53125 C 135.671875 120.824219 134.625 121.875 133.328125 121.875 L 119.53125 121.875 C 118.238281 121.875 117.453125 120.824219 117.453125 119.53125 L 117.453125 105.46875 C 117.453125 104.175781 118.5 103.125 119.796875 103.125 L 133.59375 103.125 C 134.886719 103.125 135.9375 104.175781 135.9375 105.46875 L 135.9375 119.53125 Z M 135.671875 82.03125 C 135.671875 83.324219 134.625 84.375 133.328125 84.375 L 119.53125 84.375 C 118.238281 84.375 117.1875 83.324219 117.1875 82.03125 L 117.1875 67.96875 C 117.1875 66.675781 118.238281 65.625 119.53125 65.625 L 133.328125 65.625 C 134.625 65.625 135.671875 66.675781 135.671875 67.96875 Z M 135.671875 44.53125 C 135.671875 45.824219 134.625 46.875 133.328125 46.875 L 119.53125 46.875 C 118.238281 46.875 117.1875 45.824219 117.1875 44.53125 L 117.1875 30.46875 C 117.1875 29.175781 118.238281 28.125 119.265625 28.125 L 133.066406 28.125 C 134.359375 28.125 135.410156 29.175781 135.410156 30.46875 L 135.410156 44.53125 Z M 135.671875 44.53125 "/>
</g>
</svg>
