<?xml version="1.0" encoding="UTF-8"?>
<svg xmlns="http://www.w3.org/2000/svg" xmlns:xlink="http://www.w3.org/1999/xlink" width="150px" height="px" viewBox="0 0 150 171" version="1.1">
<g id="surface1">
<path style=" stroke:none;fill-rule:nonzero;fill:rgb(0%,0%,0%);fill-opacity:1;" d="M 138.550781 149.324219 L 85.714844 149.625 L 85.714844 160.308594 C 85.714844 166.222656 80.960938 171 75.035156 171 C 69.117188 171 64.285156 166.21875 64.285156 160.316406 L 64.285156 149.632812 L 11.082031 149.628906 C 1.539062 149.628906 -3.546875 138.109375 2.816406 130.792969 L 25.910156 104.210938 L 20.832031 104.210938 C 12.324219 104.210938 7.722656 94.257812 13.242188 87.800781 L 33.46875 64.136719 L 29.871094 64.136719 C 22.746094 64.136719 18.863281 56.625 23.414062 51.675781 L 68.546875 2.75 C 72.03125 -1.023438 77.996094 -1.023438 81.480469 2.746094 L 126.644531 51.675781 C 131.207031 56.621094 127.316406 64.136719 120.191406 64.136719 L 116.585938 64.136719 L 136.792969 87.804688 C 142.300781 94.261719 137.699219 104.207031 129.199219 104.207031 L 124.109375 104.207031 L 147.203125 130.789062 C 153.582031 138.167969 148.359375 149.324219 138.550781 149.324219 Z M 138.550781 149.324219 "/>
</g>
</svg>
