  0 SNES Function norm 122.396 
    0 KSP Residual norm 122.396 
    1 KSP Residual norm 10.5879 
    2 KSP Residual norm 4.47644 
    3 KSP Residual norm 0.430378 
    4 KSP Residual norm 0.169764 
    5 KSP Residual norm 0.0144873 
    6 KSP Residual norm 0.00124148 
    7 KSP Residual norm 3.25675e-05 
    8 KSP Residual norm 8.83885e-07 
    9 KSP Residual norm 2.71426e-08 
   10 KSP Residual norm 8.602e-10 
  Linear solve converged due to CONVERGED_RTOL iterations 10
  1 SNES Function norm 8.602e-10 
Nonlinear solve converged due to CONVERGED_FNORM_RELATIVE iterations 1
DM Object: Mesh (ex56_) 4 MPI processes
  type: plex
Mesh in 3 dimensions:
  0-cells: 8 8 8 8
  1-cells: 12 12 12 12
  2-cells: 6 6 6 6
  3-cells: 1 1 1 1
Labels:
  depth: 4 strata with value/size (0 (8), 1 (12), 2 (6), 3 (1))
  marker: 1 strata with value/size (1 (15))
  Face Sets: 4 strata with value/size (1 (1), 2 (1), 3 (1), 6 (1))
  boundary: 1 strata with value/size (1 (23))
Field deformation:
  adjacency FEM
  0 SNES Function norm 49.7106 
    0 KSP Residual norm 49.7106 
    1 KSP Residual norm 23.7057 
    2 KSP Residual norm 7.45749 
    3 KSP Residual norm 2.4817 
    4 KSP Residual norm 0.704292 
    5 KSP Residual norm 0.190909 
    6 KSP Residual norm 0.0502739 
    7 KSP Residual norm 0.012723 
    8 KSP Residual norm 0.00409053 
    9 KSP Residual norm 0.0011966 
   10 KSP Residual norm 0.000357392 
   11 KSP Residual norm 0.000106264 
   12 KSP Residual norm 2.83195e-05 
   13 KSP Residual norm 7.418e-06 
   14 KSP Residual norm 2.10676e-06 
   15 KSP Residual norm 5.97565e-07 
   16 KSP Residual norm 1.5725e-07 
   17 KSP Residual norm 5.45591e-08 
   18 KSP Residual norm 1.7807e-08 
   19 KSP Residual norm 4.7093e-09 
   20 KSP Residual norm 1.25723e-09 
   21 KSP Residual norm 3.015e-10 
  Linear solve converged due to CONVERGED_RTOL iterations 21
  1 SNES Function norm 3.015e-10 
Nonlinear solve converged due to CONVERGED_FNORM_RELATIVE iterations 1
DM Object: Mesh (ex56_) 4 MPI processes
  type: plex
Mesh in 3 dimensions:
  0-cells: 27 27 27 27
  1-cells: 54 54 54 54
  2-cells: 36 36 36 36
  3-cells: 8 8 8 8
Labels:
  depth: 4 strata with value/size (0 (27), 1 (54), 2 (36), 3 (8))
  marker: 1 strata with value/size (1 (69))
  Face Sets: 4 strata with value/size (1 (9), 2 (9), 3 (9), 6 (9))
  boundary: 1 strata with value/size (1 (77))
Field deformation:
  adjacency FEM
[0] 1) N=         441, max displ=5.5560415e+01, disp diff= 1.19e+01, error=4.415e+00, rate=1.9
