NUTS_ID,Y_2050
AT,392747
BE,606860
BG,141110
CY,15132
CZ,171673
DE,2581479
DK,126281
EE,9006
ES,1230040
FI,134955
FR,2210722
GR,188265
HR,23406
HU,76137
IE,225504
IT,2967391
LT,33851
LU,46523
LV,15716
MT,5952
NL,464405
PL,635142
PT,266762
RO,248588
SE,477099
SI,31954
SK,48257
UK,2979541
