{
  "zenodoId": 4687329,
  "doi": "10.5281/zenodo.4687329",
  "name": "potential_solarthermal_collectors_open_field",
  "profile": "raster-data-resource",
  "datapackage_version": "1.0",
  "version": "0.15.0",
  "created": "2019-01-29 00:38:22",
  "title": "Restricted solar thermal energy open field energy potential for the EU28 + Switzerland, Norway and Iceland for the year 2012",
  "description": "The map shows the estimated restricted solor thermal energy potential using open field collector fields in each hectare cell with MWh heat/ha (MWh heat /10.000 m2) unit",
  "keywords": [
    "EU28",
    "EUROPE",
    "heated density map",
    "raster"
  ],
  "licenses": [
    {
      "id": "CC-BY-4.0",
      "title": "Creative Commons Attribution 4.0 International",
      "url": "https://creativecommons.org/licenses/by/4.0/legalcode"
    }
  ],
  "sources": [
    {
      "path": "",
      "name": ""
    }
  ],
  "contributors": [
    {
      "organization": "e-think / tu wien",
      "role": "author",
      "email": "mueller@e-think.ac.at",
      "title": "Andreas Mueller"
    }
  ],
  "id": "acd6f6b4-a6d8-3669-a2d1-233534288e13",
  "resources": [
    {
      "name": "potential_solarthermal_collectors_open_field",
      "title": "Restricted solar thermal energy open field energy potential for the EU28 + Switzerland, Norway and Iceland for the year 2012",
      "path": "data/potential_solarthermal_collectors_open_field.tif",
      "unit": "MWh heat/ha (MWh heat /10.000 m2)",
      "description": "The map shows the estimated restricted solor thermal energy potential using open field collector fields in each hectare cell with MWh heat/ha (MWh heat /10.000 m2) unit",
      "temporal": {
        "start": "2012-01-01 00:00:00",
        "end": "2012-12-31 24:00:00"
      },
      "format": "tif",
      "bytes": "519587569",
      "raster": {
        "epsg": "3035",
        "num_of_bands": 1,
        "extent": {
          "minx": 944000.0,
          "miny": 938000.0,
          "maxx": 6528000.0,
          "maxy": 5414000.0
        },
        "resolution": {
          "yRes": -100.0,
          "xRes": 100.0
        },
        "dimension": {
          "rows": 44760,
          "columns": 55840
        },
        "origin": [
          944000.0,
          5414000.0
        ],
        "transformation": {
          "operator": "*",
          "value": 1.0
        },
        "nodata": 0.0,
        "band1": {
          "statistics": {
            "max": 2132.07177734375,
            "mean": 1297.4590751303544,
            "Stdev": 351.625139302972,
            "min": 0.008562370203435421
          }
        }
      }
    }
  ]
}