{
  "zenodoId": 4687554,
  "doi": "10.5281/zenodo.4687554",
  "name": "potential_solar_building_footprint",
  "title": "Energy Potential of solar radiation on building footprint",
  "description": "Data show the total energy potential of solar radiation in the EU28. Raster data with the global radiation on optimally inclined surfaces are presented and then aggregated at NUTS3 level, through the building footprint in Grass GIS. The values at NUTS3 are the median value of each area.",
  "version": "0.1",
  "created": "2017-11-16",
  "profile": "raster-data-resource",
  "keywords": [
    "potential",
    "solar"
  ],
  "licenses": [
    {
      "id": "CC-BY-4.0",
      "title": "Creative Commons Attribution 4.0 International",
      "url": "https://creativecommons.org/licenses/by/4.0/legalcode"
    }
  ],
  "sources": [
    {
      "name": "pvgis",
      "title": "PVGIS",
      "owner": "European Commission - Institute for Energy and Trasport",
      "path": "http://re.jrc.ec.europa.eu/pvgis/apps4/pvest.php#"
    },
    {
      "name": "esm10m_2016",
      "title": "ESM 10m 2016",
      "owner": "Copernicus Services",
      "path": "http://land.copernicus.eu/pan-european/GHSL/european-settlement-map/EU%20GHSL%202014"
    }
  ],
  "contributors": [
    {
      "title": "Giulia Garegnani",
      "email": "Giulia.Garegnani@eurac.edu",
      "role": "author",
      "organization": "Eurac Research"
    },
    {
      "title": "Chiara Scaramuzzino",
      "email": "Chiara.Scaramuzzino@eurac.edu",
      "role": "author",
      "organization": "Eurac Research"
    }
  ],
  "resources": [
    {
      "name": "potential_solar",
      "title": "potential_solar.tif",
      "path": "data/potential_solar.tif",
      "description": "The data show the potential of solar radiation in the EU28.",
      "note": "Potential from solar radiation. We don't account for energy conversion",
      "unit": "kWh/m2",
      "format": "tif",
      "raster": {
        "epsg": "3035"
      }
    }
  ],
  "id": "37b66eae-ad17-47cc-bf62-2b7d7765b0d4"
}
