{
  "zenodoId": 4687247,
  "doi": "10.5281/zenodo.4687247",
  "name": "hotmaps_task_2.7_load_profile_tertiary_cooling_generic",
  "profile": "tabular-data-resource",
  "datapackage_version": [
    "1.0-beta"
  ],
  "title": "load_profile_tertiary_cooling_generic",
  "description": "In this repository the generic load profile for the sector tertiary and the subsector cooling, modelled as part of WP 2.7, is published",
  "version": "0.1.0",
  "id": "36c34c9b-cb2f-4325-92f4-c7ba924089e3",
  "created": "2018-03-07",
  "keywords": [
    " processes",
    "energy system analysis",
    "load profile"
  ],
  "licenses": [
    {
      "id": "CC-BY-4.0",
      "title": "Creative Commons Attribution 4.0 International",
      "url": "https://creativecommons.org/licenses/by/4.0/legalcode"
    }
  ],
  "sources": [
    {
      "name": "[Harmonised European time use surveys](http://ec.europa.eu/eurostat/web/products-manuals-and-guidelines/-/KS-RA-08-014) Eurostat, 2009, checked on 2/1/2018.",
      "path": "http://ec.europa.eu/eurostat/web/products-manuals-and-guidelines/-/KS-RA-08-014"
    }
  ],
  "contributors": [
    {
      "title": "Tobias Fleiter",
      "email": "tobias.fleiter@isi.fraunhofer.de",
      "role": "author",
      "organization": "fraunhofer isi"
    },
    {
      "title": "Matthias Kuehnbach",
      "email": "matthias.kuehnbach@isi.fraunhofer.de",
      "role": "author",
      "organization": "fraunhofer isi"
    },
    {
      "title": "Simon Marwitz",
      "email": "simon.marwitz@isi.fraunhofer.de",
      "role": "author",
      "organization": "fraunhofer isi"
    },
    {
      "title": "Anna-Lena Klingler",
      "email": "anna-lena.klingler@isi.fraunhofer.de",
      "role": "author",
      "organization": "fraunhofer isi"
    }
  ],
  "resources": [
    {
      "name": "lp_tertiary_cooling_generic",
      "title": "load_profile_tertiary_cooling_generic",
      "path": "data/hotmaps_task_2.7_load_profile_tertiary_cooling_generic.csv",
      "description": "In this repository the generic load profile for the sector tertiary and the subsector cooling, modelled as part of WP 2.7, is published",
      "format": "csv",
      "bytes": "52200",
      "encoding": "utf-8",
      "spatial_resolution": "NUTS2",
      "temporal_resolution": "hour",
      "spatial_key_field": "NUTS2_code",
      "schema": {
        "fields": [
          {
            "name": "NUTS2_code",
            "type": "string",
            "unit": ""
          },
          {
            "name": "process",
            "type": "string",
            "unit": ""
          },
          {
            "name": "season",
            "type": "string",
            "unit": ""
          },
          {
            "name": "daytype",
            "type": "int",
            "unit": ""
          },
          {
            "name": "hour",
            "type": "int",
            "unit": ""
          },
          {
            "name": "load",
            "type": "double",
            "unit": ""
          },
          {
            "name": "temperature",
            "type": "int",
            "unit": "degree celcius"
          }
        ]
      },
      "dialect": {
        "delimiter": ",",
        "doubleQuote": true
      }
    }
  ]
}