{
  "zenodoId": 4687257,
  "doi": "10.5281/zenodo.4687257",
  "name": "hotmaps_task_2.7_load_profile_residential_shw_and_heating_yearlong_2010",
  "profile": "tabular-data-resource",
  "datapackage_version": [
    "1.0-beta"
  ],
  "title": "load_profile_residential_shw_and_heating_yearlong_2010",
  "description": "In this repository the yearlong_2010 load profile for the sector residential and the subsector shw_and_heating, modelled as part of WP 2.7, is published",
  "version": "0.1.0",
  "id": "7958848d-dafe-41c5-98e5-d1aa021b481b",
  "created": "2018-03-07",
  "keywords": [
    "residential processes",
    "energy system analysis",
    "load profile"
  ],
  "licenses": [
    {
      "id": "CC-BY-4.0",
      "title": "Creative Commons Attribution 4.0 International",
      "url": "https://creativecommons.org/licenses/by/4.0/legalcode"
    }
  ],
  "sources": [
    {
      "name": "[Harmonised European time use surveys](http://ec.europa.eu/eurostat/web/products-manuals-and-guidelines/-/KS-RA-08-014) Eurostat, 2009, checked on 2/1/2018.",
      "path": "http://ec.europa.eu/eurostat/web/products-manuals-and-guidelines/-/KS-RA-08-014"
    },
    {
      "name": "[Synthetic load profile heat pump](https://www.swm-infrastruktur.de/strom/netzzugang/bedingungen/waermepumpe.html)(https://www.trust-ee.eu/files/otherfiles/0000/0008/TrustEE_D1_1.pdf) Munich City Utilities, 2012, checked on 5/10/2018.",
      "path": "https://www.swm-infrastruktur.de/strom/netzzugang/bedingungen/waermepumpe.html"
    }
  ],
  "contributors": [
    {
      "title": "Tobias Fleiter",
      "email": "tobias.fleiter@isi.fraunhofer.de",
      "role": "author",
      "organization": "fraunhofer isi"
    },
    {
      "title": "Matthias Kuehnbach",
      "email": "matthias.kuehnbach@isi.fraunhofer.de",
      "role": "author",
      "organization": "fraunhofer isi"
    },
    {
      "title": "Simon Marwitz",
      "email": "simon.marwitz@isi.fraunhofer.de",
      "role": "author",
      "organization": "fraunhofer isi"
    },
    {
      "title": "Anna-Lena Klingler",
      "email": "anna-lena.klingler@isi.fraunhofer.de",
      "role": "author",
      "organization": "fraunhofer isi"
    }
  ],
  "resources": [
    {
      "name": "lp_residential_shw_and_heating_yearlong_2010",
      "title": "load_profile_residential_shw_and_heating_yearlong_2010",
      "path": "data/hotmaps_task_2.7_load_profile_residential_shw_and_heating_yearlong_2010.csv",
      "description": "In this repository the yearlong_2010 load profile for the sector residential and the subsector shw_and_heating, modelled as part of WP 2.7, is published",
      "format": "csv",
      "bytes": "52200",
      "encoding": "utf-8",
      "spatial_resolution": "NUTS2",
      "temporal_resolution": "hour",
      "spatial_key_field": "NUTS2_code",
      "schema": {
        "fields": [
          {
            "name": "NUTS2_code",
            "type": "string",
            "unit": ""
          },
          {
            "name": "process",
            "type": "string",
            "unit": ""
          },
          {
            "name": "year",
            "type": "integer",
            "unit": ""
          },
          {
            "name": "hour",
            "type": "integer",
            "unit": ""
          },
          {
            "name": "load",
            "type": "double",
            "unit": "MW"
          },
          {
            "name": "datetime",
            "type": "datetime",
            "unit": ""
          }
        ]
      },
      "dialect": {
        "delimiter": ",",
        "doubleQuote": true
      }
    }
  ]
}