{
  "zenodoId": 4687155,
  "doi": "10.5281/zenodo.4687155",
  "name": "hourly_CO2_emission_factors",
  "profile": "tabular-data-resource",
  "datapackage_version": [
    "1.0-beta"
  ],
  "title": "hourly CO2 emission factors for electricity on NUTS 0",
  "description": "The repository contains hourly CO2 emission factors on nuts 0 level for the year 2015 - in this first version only monthly data was used.",
  "version": "0.1.0",
  "id": "64f19e2e-0ce1-11e8-ba89-0ed5f89f718b",
  "created": "2018-01-30",
  "keywords": [
    "electricity",
    "emissions",
    "nuts 0"
  ],
  "licenses": [
    {
      "id": "CC-BY-4.0",
      "title": "Creative Commons Attribution 4.0 International",
      "url": "https://creativecommons.org/licenses/by/4.0/legalcode"
    }
  ],
  "sources": [
    {
      "name": "ENTSO-E Transparency database",
      "path": "https://transparency.entsoe.eu/load-domain/r2/totalLoadR2/show"
    }
  ],
  "contributors": [
    {
      "title": "Michael Hartner",
      "email": "hartner@eeg.tuwien.ac.at",
      "role": "author",
      "organization": "TU Wien"
    }
  ],
  "resources": [
    {
      "name": "Emissions_hourly.csv",
      "title": "hourly CO2 emissions on nuts 0 level",
      "temporal": {
        "start": "2015-01-01 00:00:00",
        "end": "2015-12-31 24:00:00"
      },
      "path": "data/Emissions_hourly.csv",
      "description": "The repository contains hourly CO2 emission factors on nuts 0 level for the year 2015 - in this first version only monthly data was used.",
      "format": "csv",
      "bytes": "4838",
      "encoding": "utf-8",
      "spatial_resolution": "NUTS0",
      "temporal_resolution": "hour",
      "spatial_key_field": "NUTS0_code",
      "schema": {
        "fields": [
          {
            "name": "NUTS0_code",
            "type": "string",
            "unit": ""
          },
          {
            "name": "datetime",
            "type": "datetime",
            "unit": ""
          },
          {
            "name": "emission_factor",
            "type": "float",
            "unit": "kg/MWh"
          }
        ]
      },
      "dialect": {
        "delimiter": ",",
        "doubleQuote": true
      }
    }
  ]
}