Capacity;Year;CHP_Internal_combustion_engine_natural_gas;CHP_gas_turbine;CHP_combined_cycle_gas_turbine;CHP_Internal_combustion_engine_liquid_biofuels;CHP_Fuel_Cell;SHP_Boiler_Natural_gas;SHP_Boiler_Hard_coal;SHP_Boiler_Light_fuel_oil;SHP_Boiler_Biomass;SHP_Heat_pump_sorption;SHP_Heat_pump_electricity;SHP_district_heating;CHP_Internal_combustion_engine_light_fuel_oil;SHP_Other;SHP_Boiler_Waste;SHP_Boiler_Electricity;CHP_steam_turbine_light_fuel_oil;CHP_steam_turbine_biomass;CHP_steam_turbine_natural_gas;CHP_steam_turbine_hard_coal;CHP_steam_turbine_waste;SHP_Geothermal_Heat_pump_electricity;SHP_Solar_district_heat
1000;2015;0.82;0.46;1.11;0.82;0.7;0;0;0;0;0;0;0;0.82;0;0;0;0.18;0.18;0.18;0.18;0.18;0;0
5000;2015;0.99;0.65;1.15;0.99;0.7;0;0;0;0;0;0;0;0.99;0;0;0;0.25;0.25;0.25;0.25;0.25;0;0
10000;2015;1.08;0.76;1.17;1.08;0.7;0;0;0;0;0;0;0;1.08;0;0;0;0.29;0.29;0.29;0.29;0.29;0;0
20000;2015;1.17;0.88;1.18;1.17;0.7;0;0;0;0;0;0;0;1.17;0;0;0;0.34;0.34;0.34;0.34;0.34;0;0
50000;2015;1.3;1.07;1.2;1.3;0.7;0;0;0;0;0;0;0;1.3;0;0;0;0.41;0.41;0.41;0.41;0.41;0;0
1000;2030;0.82;0.46;1.11;0.82;0.7;0;0;0;0;0;0;0;0.82;0;0;0;0.18;0.18;0.18;0.18;0.18;0;0
5000;2030;0.99;0.65;1.15;0.99;0.7;0;0;0;0;0;0;0;0.99;0;0;0;0.25;0.25;0.25;0.25;0.25;0;0
10000;2030;1.08;0.76;1.17;1.08;0.7;0;0;0;0;0;0;0;1.08;0;0;0;0.29;0.29;0.29;0.29;0.29;0;0
20000;2030;1.17;0.88;1.18;1.17;0.7;0;0;0;0;0;0;0;1.17;0;0;0;0.34;0.34;0.34;0.34;0.34;0;0
50000;2030;1.3;1.07;1.2;1.3;0.7;0;0;0;0;0;0;0;1.3;0;0;0;0.41;0.41;0.41;0.41;0.41;0;0
1000;2050;0.82;0.46;1.11;0.82;0.7;0;0;0;0;0;0;0;0.82;0;0;0;0.18;0.18;0.18;0.18;0.18;0;0
5000;2050;0.99;0.65;1.15;0.99;0.7;0;0;0;0;0;0;0;0.99;0;0;0;0.25;0.25;0.25;0.25;0.25;0;0
10000;2050;1.08;0.76;1.17;1.08;0.7;0;0;0;0;0;0;0;1.08;0;0;0;0.29;0.29;0.29;0.29;0.29;0;0
20000;2050;1.17;0.88;1.18;1.17;0.7;0;0;0;0;0;0;0;1.17;0;0;0;0.34;0.34;0.34;0.34;0.34;0;0
50000;2050;1.3;1.07;1.2;1.3;0.7;0;0;0;0;0;0;0;1.3;0;0;0;0.41;0.41;0.41;0.41;0.41;0;0
1000;2015;0.82;0.46;1.11;0.82;0.7;0;0;0;0;0;0;0;0.82;0;0;0;0.18;0.18;0.18;0.18;0.18;0;0
5000;2015;0.99;0.65;1.15;0.99;0.7;0;0;0;0;0;0;0;0.99;0;0;0;0.25;0.25;0.25;0.25;0.25;0;0
10000;2015;1.08;0.76;1.17;1.08;0.7;0;0;0;0;0;0;0;1.08;0;0;0;0.29;0.29;0.29;0.29;0.29;0;0
20000;2015;1.17;0.88;1.18;1.17;0.7;0;0;0;0;0;0;0;1.17;0;0;0;0.34;0.34;0.34;0.34;0.34;0;0
50000;2015;1.3;1.07;1.2;1.3;0.7;0;0;0;0;0;0;0;1.3;0;0;0;0.41;0.41;0.41;0.41;0.41;0;0
1000;2030;0.82;0.46;1.11;0.82;0.7;0;0;0;0;0;0;0;0.82;0;0;0;0.18;0.18;0.18;0.18;0.18;0;0
5000;2030;0.99;0.65;1.15;0.99;0.7;0;0;0;0;0;0;0;0.99;0;0;0;0.25;0.25;0.25;0.25;0.25;0;0
10000;2030;1.08;0.76;1.17;1.08;0.7;0;0;0;0;0;0;0;1.08;0;0;0;0.29;0.29;0.29;0.29;0.29;0;0
20000;2030;1.17;0.88;1.18;1.17;0.7;0;0;0;0;0;0;0;1.17;0;0;0;0.34;0.34;0.34;0.34;0.34;0;0
50000;2030;1.3;1.07;1.2;1.3;0.7;0;0;0;0;0;0;0;1.3;0;0;0;0.41;0.41;0.41;0.41;0.41;0;0
1000;2050;0.82;0.46;1.11;0.82;0.7;0;0;0;0;0;0;0;0.82;0;0;0;0.18;0.18;0.18;0.18;0.18;0;0
5000;2050;0.99;0.65;1.15;0.99;0.7;0;0;0;0;0;0;0;0.99;0;0;0;0.25;0.25;0.25;0.25;0.25;0;0
10000;2050;1.08;0.76;1.17;1.08;0.7;0;0;0;0;0;0;0;1.08;0;0;0;0.29;0.29;0.29;0.29;0.29;0;0
20000;2050;1.17;0.88;1.18;1.17;0.7;0;0;0;0;0;0;0;1.17;0;0;0;0.34;0.34;0.34;0.34;0.34;0;0
50000;2050;1.3;1.07;1.2;1.3;0.7;0;0;0;0;0;0;0;1.3;0;0;0;0.41;0.41;0.41;0.41;0.41;0;0
1000;2015;0.82;0.46;1.11;0.82;0.7;0;0;0;0;0;0;0;0.82;0;0;0;0.18;0.18;0.18;0.18;0.18;0;0
5000;2015;0.99;0.65;1.15;0.99;0.7;0;0;0;0;0;0;0;0.99;0;0;0;0.25;0.25;0.25;0.25;0.25;0;0
10000;2015;1.08;0.76;1.17;1.08;0.7;0;0;0;0;0;0;0;1.08;0;0;0;0.29;0.29;0.29;0.29;0.29;0;0
20000;2015;1.17;0.88;1.18;1.17;0.7;0;0;0;0;0;0;0;1.17;0;0;0;0.34;0.34;0.34;0.34;0.34;0;0
50000;2015;1.3;1.07;1.2;1.3;0.7;0;0;0;0;0;0;0;1.3;0;0;0;0.41;0.41;0.41;0.41;0.41;0;0
1000;2030;0.82;0.46;1.11;0.82;0.7;0;0;0;0;0;0;0;0.82;0;0;0;0.18;0.18;0.18;0.18;0.18;0;0
5000;2030;0.99;0.65;1.15;0.99;0.7;0;0;0;0;0;0;0;0.99;0;0;0;0.25;0.25;0.25;0.25;0.25;0;0
10000;2030;1.08;0.76;1.17;1.08;0.7;0;0;0;0;0;0;0;1.08;0;0;0;0.29;0.29;0.29;0.29;0.29;0;0
20000;2030;1.17;0.88;1.18;1.17;0.7;0;0;0;0;0;0;0;1.17;0;0;0;0.34;0.34;0.34;0.34;0.34;0;0
50000;2030;1.3;1.07;1.2;1.3;0.7;0;0;0;0;0;0;0;1.3;0;0;0;0.41;0.41;0.41;0.41;0.41;0;0
1000;2050;0.82;0.46;1.11;0.82;0.7;0;0;0;0;0;0;0;0.82;0;0;0;0.18;0.18;0.18;0.18;0.18;0;0
5000;2050;0.99;0.65;1.15;0.99;0.7;0;0;0;0;0;0;0;0.99;0;0;0;0.25;0.25;0.25;0.25;0.25;0;0
10000;2050;1.08;0.76;1.17;1.08;0.7;0;0;0;0;0;0;0;1.08;0;0;0;0.29;0.29;0.29;0.29;0.29;0;0
20000;2050;1.17;0.88;1.18;1.17;0.7;0;0;0;0;0;0;0;1.17;0;0;0;0.34;0.34;0.34;0.34;0.34;0;0
50000;2050;1.3;1.07;1.2;1.3;0.7;0;0;0;0;0;0;0;1.3;0;0;0;0.41;0.41;0.41;0.41;0.41;0;0
1000;2015;0.82;0.46;1.11;0.82;0.7;0;0;0;0;0;0;0;0.82;0;0;0;0.18;0.18;0.18;0.18;0.18;0;0
5000;2015;0.99;0.65;1.15;0.99;0.7;0;0;0;0;0;0;0;0.99;0;0;0;0.25;0.25;0.25;0.25;0.25;0;0
10000;2015;1.08;0.76;1.17;1.08;0.7;0;0;0;0;0;0;0;1.08;0;0;0;0.29;0.29;0.29;0.29;0.29;0;0
20000;2015;1.17;0.88;1.18;1.17;0.7;0;0;0;0;0;0;0;1.17;0;0;0;0.34;0.34;0.34;0.34;0.34;0;0
50000;2015;1.3;1.07;1.2;1.3;0.7;0;0;0;0;0;0;0;1.3;0;0;0;0.41;0.41;0.41;0.41;0.41;0;0
1000;2030;0.82;0.46;1.11;0.82;0.7;0;0;0;0;0;0;0;0.82;0;0;0;0.18;0.18;0.18;0.18;0.18;0;0
5000;2030;0.99;0.65;1.15;0.99;0.7;0;0;0;0;0;0;0;0.99;0;0;0;0.25;0.25;0.25;0.25;0.25;0;0
10000;2030;1.08;0.76;1.17;1.08;0.7;0;0;0;0;0;0;0;1.08;0;0;0;0.29;0.29;0.29;0.29;0.29;0;0
20000;2030;1.17;0.88;1.18;1.17;0.7;0;0;0;0;0;0;0;1.17;0;0;0;0.34;0.34;0.34;0.34;0.34;0;0
50000;2030;1.3;1.07;1.2;1.3;0.7;0;0;0;0;0;0;0;1.3;0;0;0;0.41;0.41;0.41;0.41;0.41;0;0
1000;2050;0.82;0.46;1.11;0.82;0.7;0;0;0;0;0;0;0;0.82;0;0;0;0.18;0.18;0.18;0.18;0.18;0;0
5000;2050;0.99;0.65;1.15;0.99;0.7;0;0;0;0;0;0;0;0.99;0;0;0;0.25;0.25;0.25;0.25;0.25;0;0
10000;2050;1.08;0.76;1.17;1.08;0.7;0;0;0;0;0;0;0;1.08;0;0;0;0.29;0.29;0.29;0.29;0.29;0;0
20000;2050;1.17;0.88;1.18;1.17;0.7;0;0;0;0;0;0;0;1.17;0;0;0;0.34;0.34;0.34;0.34;0.34;0;0
50000;2050;1.3;1.07;1.2;1.3;0.7;0;0;0;0;0;0;0;1.3;0;0;0;0.41;0.41;0.41;0.41;0.41;0;0
1000;2015;0.82;0.46;1.11;0.82;0.7;0;0;0;0;0;0;0;0.82;0;0;0;0.18;0.18;0.18;0.18;0.18;0;0
5000;2015;0.99;0.65;1.15;0.99;0.7;0;0;0;0;0;0;0;0.99;0;0;0;0.25;0.25;0.25;0.25;0.25;0;0
10000;2015;1.08;0.76;1.17;1.08;0.7;0;0;0;0;0;0;0;1.08;0;0;0;0.29;0.29;0.29;0.29;0.29;0;0
20000;2015;1.17;0.88;1.18;1.17;0.7;0;0;0;0;0;0;0;1.17;0;0;0;0.34;0.34;0.34;0.34;0.34;0;0
50000;2015;1.3;1.07;1.2;1.3;0.7;0;0;0;0;0;0;0;1.3;0;0;0;0.41;0.41;0.41;0.41;0.41;0;0
1000;2030;0.82;0.46;1.11;0.82;0.7;0;0;0;0;0;0;0;0.82;0;0;0;0.18;0.18;0.18;0.18;0.18;0;0
5000;2030;0.99;0.65;1.15;0.99;0.7;0;0;0;0;0;0;0;0.99;0;0;0;0.25;0.25;0.25;0.25;0.25;0;0
10000;2030;1.08;0.76;1.17;1.08;0.7;0;0;0;0;0;0;0;1.08;0;0;0;0.29;0.29;0.29;0.29;0.29;0;0
20000;2030;1.17;0.88;1.18;1.17;0.7;0;0;0;0;0;0;0;1.17;0;0;0;0.34;0.34;0.34;0.34;0.34;0;0
50000;2030;1.3;1.07;1.2;1.3;0.7;0;0;0;0;0;0;0;1.3;0;0;0;0.41;0.41;0.41;0.41;0.41;0;0
1000;2050;0.82;0.46;1.11;0.82;0.7;0;0;0;0;0;0;0;0.82;0;0;0;0.18;0.18;0.18;0.18;0.18;0;0
5000;2050;0.99;0.65;1.15;0.99;0.7;0;0;0;0;0;0;0;0.99;0;0;0;0.25;0.25;0.25;0.25;0.25;0;0
10000;2050;1.08;0.76;1.17;1.08;0.7;0;0;0;0;0;0;0;1.08;0;0;0;0.29;0.29;0.29;0.29;0.29;0;0
20000;2050;1.17;0.88;1.18;1.17;0.7;0;0;0;0;0;0;0;1.17;0;0;0;0.34;0.34;0.34;0.34;0.34;0;0
50000;2050;1.3;1.07;1.2;1.3;0.7;0;0;0;0;0;0;0;1.3;0;0;0;0.41;0.41;0.41;0.41;0.41;0;0
1000;2015;0.82;0.46;1.11;0.82;0.7;0;0;0;0;0;0;0;0.82;0;0;0;0.18;0.18;0.18;0.18;0.18;0;0
5000;2015;0.99;0.65;1.15;0.99;0.7;0;0;0;0;0;0;0;0.99;0;0;0;0.25;0.25;0.25;0.25;0.25;0;0
10000;2015;1.08;0.76;1.17;1.08;0.7;0;0;0;0;0;0;0;1.08;0;0;0;0.29;0.29;0.29;0.29;0.29;0;0
20000;2015;1.17;0.88;1.18;1.17;0.7;0;0;0;0;0;0;0;1.17;0;0;0;0.34;0.34;0.34;0.34;0.34;0;0
50000;2015;1.3;1.07;1.2;1.3;0.7;0;0;0;0;0;0;0;1.3;0;0;0;0.41;0.41;0.41;0.41;0.41;0;0
1000;2030;0.82;0.46;1.11;0.82;0.7;0;0;0;0;0;0;0;0.82;0;0;0;0.18;0.18;0.18;0.18;0.18;0;0
5000;2030;0.99;0.65;1.15;0.99;0.7;0;0;0;0;0;0;0;0.99;0;0;0;0.25;0.25;0.25;0.25;0.25;0;0
10000;2030;1.08;0.76;1.17;1.08;0.7;0;0;0;0;0;0;0;1.08;0;0;0;0.29;0.29;0.29;0.29;0.29;0;0
20000;2030;1.17;0.88;1.18;1.17;0.7;0;0;0;0;0;0;0;1.17;0;0;0;0.34;0.34;0.34;0.34;0.34;0;0
50000;2030;1.3;1.07;1.2;1.3;0.7;0;0;0;0;0;0;0;1.3;0;0;0;0.41;0.41;0.41;0.41;0.41;0;0
1000;2050;0.82;0.46;1.11;0.82;0.7;0;0;0;0;0;0;0;0.82;0;0;0;0.18;0.18;0.18;0.18;0.18;0;0
5000;2050;0.99;0.65;1.15;0.99;0.7;0;0;0;0;0;0;0;0.99;0;0;0;0.25;0.25;0.25;0.25;0.25;0;0
10000;2050;1.08;0.76;1.17;1.08;0.7;0;0;0;0;0;0;0;1.08;0;0;0;0.29;0.29;0.29;0.29;0.29;0;0
20000;2050;1.17;0.88;1.18;1.17;0.7;0;0;0;0;0;0;0;1.17;0;0;0;0.34;0.34;0.34;0.34;0.34;0;0
50000;2050;1.3;1.07;1.2;1.3;0.7;0;0;0;0;0;0;0;1.3;0;0;0;0.41;0.41;0.41;0.41;0.41;0;0
1000;2015;0.82;0.46;1.11;0.82;0.7;0;0;0;0;0;0;0;0.82;0;0;0;0.18;0.18;0.18;0.18;0.18;0;0
5000;2015;0.99;0.65;1.15;0.99;0.7;0;0;0;0;0;0;0;0.99;0;0;0;0.25;0.25;0.25;0.25;0.25;0;0
10000;2015;1.08;0.76;1.17;1.08;0.7;0;0;0;0;0;0;0;1.08;0;0;0;0.29;0.29;0.29;0.29;0.29;0;0
20000;2015;1.17;0.88;1.18;1.17;0.7;0;0;0;0;0;0;0;1.17;0;0;0;0.34;0.34;0.34;0.34;0.34;0;0
50000;2015;1.3;1.07;1.2;1.3;0.7;0;0;0;0;0;0;0;1.3;0;0;0;0.41;0.41;0.41;0.41;0.41;0;0
1000;2030;0.82;0.46;1.11;0.82;0.7;0;0;0;0;0;0;0;0.82;0;0;0;0.18;0.18;0.18;0.18;0.18;0;0
5000;2030;0.99;0.65;1.15;0.99;0.7;0;0;0;0;0;0;0;0.99;0;0;0;0.25;0.25;0.25;0.25;0.25;0;0
10000;2030;1.08;0.76;1.17;1.08;0.7;0;0;0;0;0;0;0;1.08;0;0;0;0.29;0.29;0.29;0.29;0.29;0;0
20000;2030;1.17;0.88;1.18;1.17;0.7;0;0;0;0;0;0;0;1.17;0;0;0;0.34;0.34;0.34;0.34;0.34;0;0
50000;2030;1.3;1.07;1.2;1.3;0.7;0;0;0;0;0;0;0;1.3;0;0;0;0.41;0.41;0.41;0.41;0.41;0;0
1000;2050;0.82;0.46;1.11;0.82;0.7;0;0;0;0;0;0;0;0.82;0;0;0;0.18;0.18;0.18;0.18;0.18;0;0
5000;2050;0.99;0.65;1.15;0.99;0.7;0;0;0;0;0;0;0;0.99;0;0;0;0.25;0.25;0.25;0.25;0.25;0;0
10000;2050;1.08;0.76;1.17;1.08;0.7;0;0;0;0;0;0;0;1.08;0;0;0;0.29;0.29;0.29;0.29;0.29;0;0
20000;2050;1.17;0.88;1.18;1.17;0.7;0;0;0;0;0;0;0;1.17;0;0;0;0.34;0.34;0.34;0.34;0.34;0;0
50000;2050;1.3;1.07;1.2;1.3;0.7;0;0;0;0;0;0;0;1.3;0;0;0;0.41;0.41;0.41;0.41;0.41;0;0
1000;2015;0.82;0.46;1.11;0.82;0.7;0;0;0;0;0;0;0;0.82;0;0;0;0.18;0.18;0.18;0.18;0.18;0;0
5000;2015;0.99;0.65;1.15;0.99;0.7;0;0;0;0;0;0;0;0.99;0;0;0;0.25;0.25;0.25;0.25;0.25;0;0
10000;2015;1.08;0.76;1.17;1.08;0.7;0;0;0;0;0;0;0;1.08;0;0;0;0.29;0.29;0.29;0.29;0.29;0;0
20000;2015;1.17;0.88;1.18;1.17;0.7;0;0;0;0;0;0;0;1.17;0;0;0;0.34;0.34;0.34;0.34;0.34;0;0
50000;2015;1.3;1.07;1.2;1.3;0.7;0;0;0;0;0;0;0;1.3;0;0;0;0.41;0.41;0.41;0.41;0.41;0;0
1000;2030;0.82;0.46;1.11;0.82;0.7;0;0;0;0;0;0;0;0.82;0;0;0;0.18;0.18;0.18;0.18;0.18;0;0
5000;2030;0.99;0.65;1.15;0.99;0.7;0;0;0;0;0;0;0;0.99;0;0;0;0.25;0.25;0.25;0.25;0.25;0;0
10000;2030;1.08;0.76;1.17;1.08;0.7;0;0;0;0;0;0;0;1.08;0;0;0;0.29;0.29;0.29;0.29;0.29;0;0
20000;2030;1.17;0.88;1.18;1.17;0.7;0;0;0;0;0;0;0;1.17;0;0;0;0.34;0.34;0.34;0.34;0.34;0;0
50000;2030;1.3;1.07;1.2;1.3;0.7;0;0;0;0;0;0;0;1.3;0;0;0;0.41;0.41;0.41;0.41;0.41;0;0
1000;2050;0.82;0.46;1.11;0.82;0.7;0;0;0;0;0;0;0;0.82;0;0;0;0.18;0.18;0.18;0.18;0.18;0;0
5000;2050;0.99;0.65;1.15;0.99;0.7;0;0;0;0;0;0;0;0.99;0;0;0;0.25;0.25;0.25;0.25;0.25;0;0
10000;2050;1.08;0.76;1.17;1.08;0.7;0;0;0;0;0;0;0;1.08;0;0;0;0.29;0.29;0.29;0.29;0.29;0;0
20000;2050;1.17;0.88;1.18;1.17;0.7;0;0;0;0;0;0;0;1.17;0;0;0;0.34;0.34;0.34;0.34;0.34;0;0
50000;2050;1.3;1.07;1.2;1.3;0.7;0;0;0;0;0;0;0;1.3;0;0;0;0.41;0.41;0.41;0.41;0.41;0;0
1000;2015;0.82;0.46;1.11;0.82;0.7;0;0;0;0;0;0;0;0.82;0;0;0;0.18;0.18;0.18;0.18;0.18;0;0
5000;2015;0.99;0.65;1.15;0.99;0.7;0;0;0;0;0;0;0;0.99;0;0;0;0.25;0.25;0.25;0.25;0.25;0;0
10000;2015;1.08;0.76;1.17;1.08;0.7;0;0;0;0;0;0;0;1.08;0;0;0;0.29;0.29;0.29;0.29;0.29;0;0
20000;2015;1.17;0.88;1.18;1.17;0.7;0;0;0;0;0;0;0;1.17;0;0;0;0.34;0.34;0.34;0.34;0.34;0;0
50000;2015;1.3;1.07;1.2;1.3;0.7;0;0;0;0;0;0;0;1.3;0;0;0;0.41;0.41;0.41;0.41;0.41;0;0
1000;2030;0.82;0.46;1.11;0.82;0.7;0;0;0;0;0;0;0;0.82;0;0;0;0.18;0.18;0.18;0.18;0.18;0;0
5000;2030;0.99;0.65;1.15;0.99;0.7;0;0;0;0;0;0;0;0.99;0;0;0;0.25;0.25;0.25;0.25;0.25;0;0
10000;2030;1.08;0.76;1.17;1.08;0.7;0;0;0;0;0;0;0;1.08;0;0;0;0.29;0.29;0.29;0.29;0.29;0;0
20000;2030;1.17;0.88;1.18;1.17;0.7;0;0;0;0;0;0;0;1.17;0;0;0;0.34;0.34;0.34;0.34;0.34;0;0
50000;2030;1.3;1.07;1.2;1.3;0.7;0;0;0;0;0;0;0;1.3;0;0;0;0.41;0.41;0.41;0.41;0.41;0;0
1000;2050;0.82;0.46;1.11;0.82;0.7;0;0;0;0;0;0;0;0.82;0;0;0;0.18;0.18;0.18;0.18;0.18;0;0
5000;2050;0.99;0.65;1.15;0.99;0.7;0;0;0;0;0;0;0;0.99;0;0;0;0.25;0.25;0.25;0.25;0.25;0;0
10000;2050;1.08;0.76;1.17;1.08;0.7;0;0;0;0;0;0;0;1.08;0;0;0;0.29;0.29;0.29;0.29;0.29;0;0
20000;2050;1.17;0.88;1.18;1.17;0.7;0;0;0;0;0;0;0;1.17;0;0;0;0.34;0.34;0.34;0.34;0.34;0;0
50000;2050;1.3;1.07;1.2;1.3;0.7;0;0;0;0;0;0;0;1.3;0;0;0;0.41;0.41;0.41;0.41;0.41;0;0
1000;2015;0.82;0.46;1.11;0.82;0.7;0;0;0;0;0;0;0;0.82;0;0;0;0.18;0.18;0.18;0.18;0.18;0;0
5000;2015;0.99;0.65;1.15;0.99;0.7;0;0;0;0;0;0;0;0.99;0;0;0;0.25;0.25;0.25;0.25;0.25;0;0
10000;2015;1.08;0.76;1.17;1.08;0.7;0;0;0;0;0;0;0;1.08;0;0;0;0.29;0.29;0.29;0.29;0.29;0;0
20000;2015;1.17;0.88;1.18;1.17;0.7;0;0;0;0;0;0;0;1.17;0;0;0;0.34;0.34;0.34;0.34;0.34;0;0
50000;2015;1.3;1.07;1.2;1.3;0.7;0;0;0;0;0;0;0;1.3;0;0;0;0.41;0.41;0.41;0.41;0.41;0;0
1000;2030;0.82;0.46;1.11;0.82;0.7;0;0;0;0;0;0;0;0.82;0;0;0;0.18;0.18;0.18;0.18;0.18;0;0
5000;2030;0.99;0.65;1.15;0.99;0.7;0;0;0;0;0;0;0;0.99;0;0;0;0.25;0.25;0.25;0.25;0.25;0;0
10000;2030;1.08;0.76;1.17;1.08;0.7;0;0;0;0;0;0;0;1.08;0;0;0;0.29;0.29;0.29;0.29;0.29;0;0
20000;2030;1.17;0.88;1.18;1.17;0.7;0;0;0;0;0;0;0;1.17;0;0;0;0.34;0.34;0.34;0.34;0.34;0;0
50000;2030;1.3;1.07;1.2;1.3;0.7;0;0;0;0;0;0;0;1.3;0;0;0;0.41;0.41;0.41;0.41;0.41;0;0
1000;2050;0.82;0.46;1.11;0.82;0.7;0;0;0;0;0;0;0;0.82;0;0;0;0.18;0.18;0.18;0.18;0.18;0;0
5000;2050;0.99;0.65;1.15;0.99;0.7;0;0;0;0;0;0;0;0.99;0;0;0;0.25;0.25;0.25;0.25;0.25;0;0
10000;2050;1.08;0.76;1.17;1.08;0.7;0;0;0;0;0;0;0;1.08;0;0;0;0.29;0.29;0.29;0.29;0.29;0;0
20000;2050;1.17;0.88;1.18;1.17;0.7;0;0;0;0;0;0;0;1.17;0;0;0;0.34;0.34;0.34;0.34;0.34;0;0
50000;2050;1.3;1.07;1.2;1.3;0.7;0;0;0;0;0;0;0;1.3;0;0;0;0.41;0.41;0.41;0.41;0.41;0;0
1000;2015;0.82;0.46;1.11;0.82;0.7;0;0;0;0;0;0;0;0.82;0;0;0;0.18;0.18;0.18;0.18;0.18;0;0
5000;2015;0.99;0.65;1.15;0.99;0.7;0;0;0;0;0;0;0;0.99;0;0;0;0.25;0.25;0.25;0.25;0.25;0;0
10000;2015;1.08;0.76;1.17;1.08;0.7;0;0;0;0;0;0;0;1.08;0;0;0;0.29;0.29;0.29;0.29;0.29;0;0
20000;2015;1.17;0.88;1.18;1.17;0.7;0;0;0;0;0;0;0;1.17;0;0;0;0.34;0.34;0.34;0.34;0.34;0;0
50000;2015;1.3;1.07;1.2;1.3;0.7;0;0;0;0;0;0;0;1.3;0;0;0;0.41;0.41;0.41;0.41;0.41;0;0
1000;2030;0.82;0.46;1.11;0.82;0.7;0;0;0;0;0;0;0;0.82;0;0;0;0.18;0.18;0.18;0.18;0.18;0;0
5000;2030;0.99;0.65;1.15;0.99;0.7;0;0;0;0;0;0;0;0.99;0;0;0;0.25;0.25;0.25;0.25;0.25;0;0
10000;2030;1.08;0.76;1.17;1.08;0.7;0;0;0;0;0;0;0;1.08;0;0;0;0.29;0.29;0.29;0.29;0.29;0;0
20000;2030;1.17;0.88;1.18;1.17;0.7;0;0;0;0;0;0;0;1.17;0;0;0;0.34;0.34;0.34;0.34;0.34;0;0
50000;2030;1.3;1.07;1.2;1.3;0.7;0;0;0;0;0;0;0;1.3;0;0;0;0.41;0.41;0.41;0.41;0.41;0;0
1000;2050;0.82;0.46;1.11;0.82;0.7;0;0;0;0;0;0;0;0.82;0;0;0;0.18;0.18;0.18;0.18;0.18;0;0
5000;2050;0.99;0.65;1.15;0.99;0.7;0;0;0;0;0;0;0;0.99;0;0;0;0.25;0.25;0.25;0.25;0.25;0;0
10000;2050;1.08;0.76;1.17;1.08;0.7;0;0;0;0;0;0;0;1.08;0;0;0;0.29;0.29;0.29;0.29;0.29;0;0
20000;2050;1.17;0.88;1.18;1.17;0.7;0;0;0;0;0;0;0;1.17;0;0;0;0.34;0.34;0.34;0.34;0.34;0;0
50000;2050;1.3;1.07;1.2;1.3;0.7;0;0;0;0;0;0;0;1.3;0;0;0;0.41;0.41;0.41;0.41;0.41;0;0
1000;2015;0.82;0.46;1.11;0.82;0.7;0;0;0;0;0;0;0;0.82;0;0;0;0.18;0.18;0.18;0.18;0.18;0;0
5000;2015;0.99;0.65;1.15;0.99;0.7;0;0;0;0;0;0;0;0.99;0;0;0;0.25;0.25;0.25;0.25;0.25;0;0
10000;2015;1.08;0.76;1.17;1.08;0.7;0;0;0;0;0;0;0;1.08;0;0;0;0.29;0.29;0.29;0.29;0.29;0;0
20000;2015;1.17;0.88;1.18;1.17;0.7;0;0;0;0;0;0;0;1.17;0;0;0;0.34;0.34;0.34;0.34;0.34;0;0
50000;2015;1.3;1.07;1.2;1.3;0.7;0;0;0;0;0;0;0;1.3;0;0;0;0.41;0.41;0.41;0.41;0.41;0;0
1000;2030;0.82;0.46;1.11;0.82;0.7;0;0;0;0;0;0;0;0.82;0;0;0;0.18;0.18;0.18;0.18;0.18;0;0
5000;2030;0.99;0.65;1.15;0.99;0.7;0;0;0;0;0;0;0;0.99;0;0;0;0.25;0.25;0.25;0.25;0.25;0;0
10000;2030;1.08;0.76;1.17;1.08;0.7;0;0;0;0;0;0;0;1.08;0;0;0;0.29;0.29;0.29;0.29;0.29;0;0
20000;2030;1.17;0.88;1.18;1.17;0.7;0;0;0;0;0;0;0;1.17;0;0;0;0.34;0.34;0.34;0.34;0.34;0;0
50000;2030;1.3;1.07;1.2;1.3;0.7;0;0;0;0;0;0;0;1.3;0;0;0;0.41;0.41;0.41;0.41;0.41;0;0
1000;2050;0.82;0.46;1.11;0.82;0.7;0;0;0;0;0;0;0;0.82;0;0;0;0.18;0.18;0.18;0.18;0.18;0;0
5000;2050;0.99;0.65;1.15;0.99;0.7;0;0;0;0;0;0;0;0.99;0;0;0;0.25;0.25;0.25;0.25;0.25;0;0
10000;2050;1.08;0.76;1.17;1.08;0.7;0;0;0;0;0;0;0;1.08;0;0;0;0.29;0.29;0.29;0.29;0.29;0;0
20000;2050;1.17;0.88;1.18;1.17;0.7;0;0;0;0;0;0;0;1.17;0;0;0;0.34;0.34;0.34;0.34;0.34;0;0
50000;2050;1.3;1.07;1.2;1.3;0.7;0;0;0;0;0;0;0;1.3;0;0;0;0.41;0.41;0.41;0.41;0.41;0;0
1000;2015;0.82;0.46;1.11;0.82;0.7;0;0;0;0;0;0;0;0.82;0;0;0;0.18;0.18;0.18;0.18;0.18;0;0
5000;2015;0.99;0.65;1.15;0.99;0.7;0;0;0;0;0;0;0;0.99;0;0;0;0.25;0.25;0.25;0.25;0.25;0;0
10000;2015;1.08;0.76;1.17;1.08;0.7;0;0;0;0;0;0;0;1.08;0;0;0;0.29;0.29;0.29;0.29;0.29;0;0
20000;2015;1.17;0.88;1.18;1.17;0.7;0;0;0;0;0;0;0;1.17;0;0;0;0.34;0.34;0.34;0.34;0.34;0;0
50000;2015;1.3;1.07;1.2;1.3;0.7;0;0;0;0;0;0;0;1.3;0;0;0;0.41;0.41;0.41;0.41;0.41;0;0
1000;2030;0.82;0.46;1.11;0.82;0.7;0;0;0;0;0;0;0;0.82;0;0;0;0.18;0.18;0.18;0.18;0.18;0;0
5000;2030;0.99;0.65;1.15;0.99;0.7;0;0;0;0;0;0;0;0.99;0;0;0;0.25;0.25;0.25;0.25;0.25;0;0
10000;2030;1.08;0.76;1.17;1.08;0.7;0;0;0;0;0;0;0;1.08;0;0;0;0.29;0.29;0.29;0.29;0.29;0;0
20000;2030;1.17;0.88;1.18;1.17;0.7;0;0;0;0;0;0;0;1.17;0;0;0;0.34;0.34;0.34;0.34;0.34;0;0
50000;2030;1.3;1.07;1.2;1.3;0.7;0;0;0;0;0;0;0;1.3;0;0;0;0.41;0.41;0.41;0.41;0.41;0;0
1000;2050;0.82;0.46;1.11;0.82;0.7;0;0;0;0;0;0;0;0.82;0;0;0;0.18;0.18;0.18;0.18;0.18;0;0
5000;2050;0.99;0.65;1.15;0.99;0.7;0;0;0;0;0;0;0;0.99;0;0;0;0.25;0.25;0.25;0.25;0.25;0;0
10000;2050;1.08;0.76;1.17;1.08;0.7;0;0;0;0;0;0;0;1.08;0;0;0;0.29;0.29;0.29;0.29;0.29;0;0
20000;2050;1.17;0.88;1.18;1.17;0.7;0;0;0;0;0;0;0;1.17;0;0;0;0.34;0.34;0.34;0.34;0.34;0;0
50000;2050;1.3;1.07;1.2;1.3;0.7;0;0;0;0;0;0;0;1.3;0;0;0;0.41;0.41;0.41;0.41;0.41;0;0
1000;2015;0.82;0.46;1.11;0.82;0.7;0;0;0;0;0;0;0;0.82;0;0;0;0.18;0.18;0.18;0.18;0.18;0;0
5000;2015;0.99;0.65;1.15;0.99;0.7;0;0;0;0;0;0;0;0.99;0;0;0;0.25;0.25;0.25;0.25;0.25;0;0
10000;2015;1.08;0.76;1.17;1.08;0.7;0;0;0;0;0;0;0;1.08;0;0;0;0.29;0.29;0.29;0.29;0.29;0;0
20000;2015;1.17;0.88;1.18;1.17;0.7;0;0;0;0;0;0;0;1.17;0;0;0;0.34;0.34;0.34;0.34;0.34;0;0
50000;2015;1.3;1.07;1.2;1.3;0.7;0;0;0;0;0;0;0;1.3;0;0;0;0.41;0.41;0.41;0.41;0.41;0;0
1000;2030;0.82;0.46;1.11;0.82;0.7;0;0;0;0;0;0;0;0.82;0;0;0;0.18;0.18;0.18;0.18;0.18;0;0
5000;2030;0.99;0.65;1.15;0.99;0.7;0;0;0;0;0;0;0;0.99;0;0;0;0.25;0.25;0.25;0.25;0.25;0;0
10000;2030;1.08;0.76;1.17;1.08;0.7;0;0;0;0;0;0;0;1.08;0;0;0;0.29;0.29;0.29;0.29;0.29;0;0
20000;2030;1.17;0.88;1.18;1.17;0.7;0;0;0;0;0;0;0;1.17;0;0;0;0.34;0.34;0.34;0.34;0.34;0;0
50000;2030;1.3;1.07;1.2;1.3;0.7;0;0;0;0;0;0;0;1.3;0;0;0;0.41;0.41;0.41;0.41;0.41;0;0
1000;2050;0.82;0.46;1.11;0.82;0.7;0;0;0;0;0;0;0;0.82;0;0;0;0.18;0.18;0.18;0.18;0.18;0;0
5000;2050;0.99;0.65;1.15;0.99;0.7;0;0;0;0;0;0;0;0.99;0;0;0;0.25;0.25;0.25;0.25;0.25;0;0
10000;2050;1.08;0.76;1.17;1.08;0.7;0;0;0;0;0;0;0;1.08;0;0;0;0.29;0.29;0.29;0.29;0.29;0;0
20000;2050;1.17;0.88;1.18;1.17;0.7;0;0;0;0;0;0;0;1.17;0;0;0;0.34;0.34;0.34;0.34;0.34;0;0
50000;2050;1.3;1.07;1.2;1.3;0.7;0;0;0;0;0;0;0;1.3;0;0;0;0.41;0.41;0.41;0.41;0.41;0;0
1000;2015;0.82;0.46;1.11;0.82;0.7;0;0;0;0;0;0;0;0.82;0;0;0;0.18;0.18;0.18;0.18;0.18;0;0
5000;2015;0.99;0.65;1.15;0.99;0.7;0;0;0;0;0;0;0;0.99;0;0;0;0.25;0.25;0.25;0.25;0.25;0;0
10000;2015;1.08;0.76;1.17;1.08;0.7;0;0;0;0;0;0;0;1.08;0;0;0;0.29;0.29;0.29;0.29;0.29;0;0
20000;2015;1.17;0.88;1.18;1.17;0.7;0;0;0;0;0;0;0;1.17;0;0;0;0.34;0.34;0.34;0.34;0.34;0;0
50000;2015;1.3;1.07;1.2;1.3;0.7;0;0;0;0;0;0;0;1.3;0;0;0;0.41;0.41;0.41;0.41;0.41;0;0
1000;2030;0.82;0.46;1.11;0.82;0.7;0;0;0;0;0;0;0;0.82;0;0;0;0.18;0.18;0.18;0.18;0.18;0;0
5000;2030;0.99;0.65;1.15;0.99;0.7;0;0;0;0;0;0;0;0.99;0;0;0;0.25;0.25;0.25;0.25;0.25;0;0
10000;2030;1.08;0.76;1.17;1.08;0.7;0;0;0;0;0;0;0;1.08;0;0;0;0.29;0.29;0.29;0.29;0.29;0;0
20000;2030;1.17;0.88;1.18;1.17;0.7;0;0;0;0;0;0;0;1.17;0;0;0;0.34;0.34;0.34;0.34;0.34;0;0
50000;2030;1.3;1.07;1.2;1.3;0.7;0;0;0;0;0;0;0;1.3;0;0;0;0.41;0.41;0.41;0.41;0.41;0;0
1000;2050;0.82;0.46;1.11;0.82;0.7;0;0;0;0;0;0;0;0.82;0;0;0;0.18;0.18;0.18;0.18;0.18;0;0
5000;2050;0.99;0.65;1.15;0.99;0.7;0;0;0;0;0;0;0;0.99;0;0;0;0.25;0.25;0.25;0.25;0.25;0;0
10000;2050;1.08;0.76;1.17;1.08;0.7;0;0;0;0;0;0;0;1.08;0;0;0;0.29;0.29;0.29;0.29;0.29;0;0
20000;2050;1.17;0.88;1.18;1.17;0.7;0;0;0;0;0;0;0;1.17;0;0;0;0.34;0.34;0.34;0.34;0.34;0;0
50000;2050;1.3;1.07;1.2;1.3;0.7;0;0;0;0;0;0;0;1.3;0;0;0;0.41;0.41;0.41;0.41;0.41;0;0
1000;2015;0.82;0.46;1.11;0.82;0.7;0;0;0;0;0;0;0;0.82;0;0;0;0.18;0.18;0.18;0.18;0.18;0;0
5000;2015;0.99;0.65;1.15;0.99;0.7;0;0;0;0;0;0;0;0.99;0;0;0;0.25;0.25;0.25;0.25;0.25;0;0
10000;2015;1.08;0.76;1.17;1.08;0.7;0;0;0;0;0;0;0;1.08;0;0;0;0.29;0.29;0.29;0.29;0.29;0;0
20000;2015;1.17;0.88;1.18;1.17;0.7;0;0;0;0;0;0;0;1.17;0;0;0;0.34;0.34;0.34;0.34;0.34;0;0
50000;2015;1.3;1.07;1.2;1.3;0.7;0;0;0;0;0;0;0;1.3;0;0;0;0.41;0.41;0.41;0.41;0.41;0;0
1000;2030;0.82;0.46;1.11;0.82;0.7;0;0;0;0;0;0;0;0.82;0;0;0;0.18;0.18;0.18;0.18;0.18;0;0
5000;2030;0.99;0.65;1.15;0.99;0.7;0;0;0;0;0;0;0;0.99;0;0;0;0.25;0.25;0.25;0.25;0.25;0;0
10000;2030;1.08;0.76;1.17;1.08;0.7;0;0;0;0;0;0;0;1.08;0;0;0;0.29;0.29;0.29;0.29;0.29;0;0
20000;2030;1.17;0.88;1.18;1.17;0.7;0;0;0;0;0;0;0;1.17;0;0;0;0.34;0.34;0.34;0.34;0.34;0;0
50000;2030;1.3;1.07;1.2;1.3;0.7;0;0;0;0;0;0;0;1.3;0;0;0;0.41;0.41;0.41;0.41;0.41;0;0
1000;2050;0.82;0.46;1.11;0.82;0.7;0;0;0;0;0;0;0;0.82;0;0;0;0.18;0.18;0.18;0.18;0.18;0;0
5000;2050;0.99;0.65;1.15;0.99;0.7;0;0;0;0;0;0;0;0.99;0;0;0;0.25;0.25;0.25;0.25;0.25;0;0
10000;2050;1.08;0.76;1.17;1.08;0.7;0;0;0;0;0;0;0;1.08;0;0;0;0.29;0.29;0.29;0.29;0.29;0;0
20000;2050;1.17;0.88;1.18;1.17;0.7;0;0;0;0;0;0;0;1.17;0;0;0;0.34;0.34;0.34;0.34;0.34;0;0
50000;2050;1.3;1.07;1.2;1.3;0.7;0;0;0;0;0;0;0;1.3;0;0;0;0.41;0.41;0.41;0.41;0.41;0;0
1000;2015;0.82;0.46;1.11;0.82;0.7;0;0;0;0;0;0;0;0.82;0;0;0;0.18;0.18;0.18;0.18;0.18;0;0
5000;2015;0.99;0.65;1.15;0.99;0.7;0;0;0;0;0;0;0;0.99;0;0;0;0.25;0.25;0.25;0.25;0.25;0;0
10000;2015;1.08;0.76;1.17;1.08;0.7;0;0;0;0;0;0;0;1.08;0;0;0;0.29;0.29;0.29;0.29;0.29;0;0
20000;2015;1.17;0.88;1.18;1.17;0.7;0;0;0;0;0;0;0;1.17;0;0;0;0.34;0.34;0.34;0.34;0.34;0;0
50000;2015;1.3;1.07;1.2;1.3;0.7;0;0;0;0;0;0;0;1.3;0;0;0;0.41;0.41;0.41;0.41;0.41;0;0
1000;2030;0.82;0.46;1.11;0.82;0.7;0;0;0;0;0;0;0;0.82;0;0;0;0.18;0.18;0.18;0.18;0.18;0;0
5000;2030;0.99;0.65;1.15;0.99;0.7;0;0;0;0;0;0;0;0.99;0;0;0;0.25;0.25;0.25;0.25;0.25;0;0
10000;2030;1.08;0.76;1.17;1.08;0.7;0;0;0;0;0;0;0;1.08;0;0;0;0.29;0.29;0.29;0.29;0.29;0;0
20000;2030;1.17;0.88;1.18;1.17;0.7;0;0;0;0;0;0;0;1.17;0;0;0;0.34;0.34;0.34;0.34;0.34;0;0
50000;2030;1.3;1.07;1.2;1.3;0.7;0;0;0;0;0;0;0;1.3;0;0;0;0.41;0.41;0.41;0.41;0.41;0;0
1000;2050;0.82;0.46;1.11;0.82;0.7;0;0;0;0;0;0;0;0.82;0;0;0;0.18;0.18;0.18;0.18;0.18;0;0
5000;2050;0.99;0.65;1.15;0.99;0.7;0;0;0;0;0;0;0;0.99;0;0;0;0.25;0.25;0.25;0.25;0.25;0;0
10000;2050;1.08;0.76;1.17;1.08;0.7;0;0;0;0;0;0;0;1.08;0;0;0;0.29;0.29;0.29;0.29;0.29;0;0
20000;2050;1.17;0.88;1.18;1.17;0.7;0;0;0;0;0;0;0;1.17;0;0;0;0.34;0.34;0.34;0.34;0.34;0;0
50000;2050;1.3;1.07;1.2;1.3;0.7;0;0;0;0;0;0;0;1.3;0;0;0;0.41;0.41;0.41;0.41;0.41;0;0
1000;2015;0.82;0.46;1.11;0.82;0.7;0;0;0;0;0;0;0;0.82;0;0;0;0.18;0.18;0.18;0.18;0.18;0;0
5000;2015;0.99;0.65;1.15;0.99;0.7;0;0;0;0;0;0;0;0.99;0;0;0;0.25;0.25;0.25;0.25;0.25;0;0
10000;2015;1.08;0.76;1.17;1.08;0.7;0;0;0;0;0;0;0;1.08;0;0;0;0.29;0.29;0.29;0.29;0.29;0;0
20000;2015;1.17;0.88;1.18;1.17;0.7;0;0;0;0;0;0;0;1.17;0;0;0;0.34;0.34;0.34;0.34;0.34;0;0
50000;2015;1.3;1.07;1.2;1.3;0.7;0;0;0;0;0;0;0;1.3;0;0;0;0.41;0.41;0.41;0.41;0.41;0;0
1000;2030;0.82;0.46;1.11;0.82;0.7;0;0;0;0;0;0;0;0.82;0;0;0;0.18;0.18;0.18;0.18;0.18;0;0
5000;2030;0.99;0.65;1.15;0.99;0.7;0;0;0;0;0;0;0;0.99;0;0;0;0.25;0.25;0.25;0.25;0.25;0;0
10000;2030;1.08;0.76;1.17;1.08;0.7;0;0;0;0;0;0;0;1.08;0;0;0;0.29;0.29;0.29;0.29;0.29;0;0
20000;2030;1.17;0.88;1.18;1.17;0.7;0;0;0;0;0;0;0;1.17;0;0;0;0.34;0.34;0.34;0.34;0.34;0;0
50000;2030;1.3;1.07;1.2;1.3;0.7;0;0;0;0;0;0;0;1.3;0;0;0;0.41;0.41;0.41;0.41;0.41;0;0
1000;2050;0.82;0.46;1.11;0.82;0.7;0;0;0;0;0;0;0;0.82;0;0;0;0.18;0.18;0.18;0.18;0.18;0;0
5000;2050;0.99;0.65;1.15;0.99;0.7;0;0;0;0;0;0;0;0.99;0;0;0;0.25;0.25;0.25;0.25;0.25;0;0
10000;2050;1.08;0.76;1.17;1.08;0.7;0;0;0;0;0;0;0;1.08;0;0;0;0.29;0.29;0.29;0.29;0.29;0;0
20000;2050;1.17;0.88;1.18;1.17;0.7;0;0;0;0;0;0;0;1.17;0;0;0;0.34;0.34;0.34;0.34;0.34;0;0
50000;2050;1.3;1.07;1.2;1.3;0.7;0;0;0;0;0;0;0;1.3;0;0;0;0.41;0.41;0.41;0.41;0.41;0;0
1000;2015;0.82;0.46;1.11;0.82;0.7;0;0;0;0;0;0;0;0.82;0;0;0;0.18;0.18;0.18;0.18;0.18;0;0
5000;2015;0.99;0.65;1.15;0.99;0.7;0;0;0;0;0;0;0;0.99;0;0;0;0.25;0.25;0.25;0.25;0.25;0;0
10000;2015;1.08;0.76;1.17;1.08;0.7;0;0;0;0;0;0;0;1.08;0;0;0;0.29;0.29;0.29;0.29;0.29;0;0
20000;2015;1.17;0.88;1.18;1.17;0.7;0;0;0;0;0;0;0;1.17;0;0;0;0.34;0.34;0.34;0.34;0.34;0;0
50000;2015;1.3;1.07;1.2;1.3;0.7;0;0;0;0;0;0;0;1.3;0;0;0;0.41;0.41;0.41;0.41;0.41;0;0
1000;2030;0.82;0.46;1.11;0.82;0.7;0;0;0;0;0;0;0;0.82;0;0;0;0.18;0.18;0.18;0.18;0.18;0;0
5000;2030;0.99;0.65;1.15;0.99;0.7;0;0;0;0;0;0;0;0.99;0;0;0;0.25;0.25;0.25;0.25;0.25;0;0
10000;2030;1.08;0.76;1.17;1.08;0.7;0;0;0;0;0;0;0;1.08;0;0;0;0.29;0.29;0.29;0.29;0.29;0;0
20000;2030;1.17;0.88;1.18;1.17;0.7;0;0;0;0;0;0;0;1.17;0;0;0;0.34;0.34;0.34;0.34;0.34;0;0
50000;2030;1.3;1.07;1.2;1.3;0.7;0;0;0;0;0;0;0;1.3;0;0;0;0.41;0.41;0.41;0.41;0.41;0;0
1000;2050;0.82;0.46;1.11;0.82;0.7;0;0;0;0;0;0;0;0.82;0;0;0;0.18;0.18;0.18;0.18;0.18;0;0
5000;2050;0.99;0.65;1.15;0.99;0.7;0;0;0;0;0;0;0;0.99;0;0;0;0.25;0.25;0.25;0.25;0.25;0;0
10000;2050;1.08;0.76;1.17;1.08;0.7;0;0;0;0;0;0;0;1.08;0;0;0;0.29;0.29;0.29;0.29;0.29;0;0
20000;2050;1.17;0.88;1.18;1.17;0.7;0;0;0;0;0;0;0;1.17;0;0;0;0.34;0.34;0.34;0.34;0.34;0;0
50000;2050;1.3;1.07;1.2;1.3;0.7;0;0;0;0;0;0;0;1.3;0;0;0;0.41;0.41;0.41;0.41;0.41;0;0
1000;2015;0.82;0.46;1.11;0.82;0.7;0;0;0;0;0;0;0;0.82;0;0;0;0.18;0.18;0.18;0.18;0.18;0;0
5000;2015;0.99;0.65;1.15;0.99;0.7;0;0;0;0;0;0;0;0.99;0;0;0;0.25;0.25;0.25;0.25;0.25;0;0
10000;2015;1.08;0.76;1.17;1.08;0.7;0;0;0;0;0;0;0;1.08;0;0;0;0.29;0.29;0.29;0.29;0.29;0;0
20000;2015;1.17;0.88;1.18;1.17;0.7;0;0;0;0;0;0;0;1.17;0;0;0;0.34;0.34;0.34;0.34;0.34;0;0
50000;2015;1.3;1.07;1.2;1.3;0.7;0;0;0;0;0;0;0;1.3;0;0;0;0.41;0.41;0.41;0.41;0.41;0;0
1000;2030;0.82;0.46;1.11;0.82;0.7;0;0;0;0;0;0;0;0.82;0;0;0;0.18;0.18;0.18;0.18;0.18;0;0
5000;2030;0.99;0.65;1.15;0.99;0.7;0;0;0;0;0;0;0;0.99;0;0;0;0.25;0.25;0.25;0.25;0.25;0;0
10000;2030;1.08;0.76;1.17;1.08;0.7;0;0;0;0;0;0;0;1.08;0;0;0;0.29;0.29;0.29;0.29;0.29;0;0
20000;2030;1.17;0.88;1.18;1.17;0.7;0;0;0;0;0;0;0;1.17;0;0;0;0.34;0.34;0.34;0.34;0.34;0;0
50000;2030;1.3;1.07;1.2;1.3;0.7;0;0;0;0;0;0;0;1.3;0;0;0;0.41;0.41;0.41;0.41;0.41;0;0
1000;2050;0.82;0.46;1.11;0.82;0.7;0;0;0;0;0;0;0;0.82;0;0;0;0.18;0.18;0.18;0.18;0.18;0;0
5000;2050;0.99;0.65;1.15;0.99;0.7;0;0;0;0;0;0;0;0.99;0;0;0;0.25;0.25;0.25;0.25;0.25;0;0
10000;2050;1.08;0.76;1.17;1.08;0.7;0;0;0;0;0;0;0;1.08;0;0;0;0.29;0.29;0.29;0.29;0.29;0;0
20000;2050;1.17;0.88;1.18;1.17;0.7;0;0;0;0;0;0;0;1.17;0;0;0;0.34;0.34;0.34;0.34;0.34;0;0
50000;2050;1.3;1.07;1.2;1.3;0.7;0;0;0;0;0;0;0;1.3;0;0;0;0.41;0.41;0.41;0.41;0.41;0;0
1000;2015;0.82;0.46;1.11;0.82;0.7;0;0;0;0;0;0;0;0.82;0;0;0;0.18;0.18;0.18;0.18;0.18;0;0
5000;2015;0.99;0.65;1.15;0.99;0.7;0;0;0;0;0;0;0;0.99;0;0;0;0.25;0.25;0.25;0.25;0.25;0;0
10000;2015;1.08;0.76;1.17;1.08;0.7;0;0;0;0;0;0;0;1.08;0;0;0;0.29;0.29;0.29;0.29;0.29;0;0
20000;2015;1.17;0.88;1.18;1.17;0.7;0;0;0;0;0;0;0;1.17;0;0;0;0.34;0.34;0.34;0.34;0.34;0;0
50000;2015;1.3;1.07;1.2;1.3;0.7;0;0;0;0;0;0;0;1.3;0;0;0;0.41;0.41;0.41;0.41;0.41;0;0
1000;2030;0.82;0.46;1.11;0.82;0.7;0;0;0;0;0;0;0;0.82;0;0;0;0.18;0.18;0.18;0.18;0.18;0;0
5000;2030;0.99;0.65;1.15;0.99;0.7;0;0;0;0;0;0;0;0.99;0;0;0;0.25;0.25;0.25;0.25;0.25;0;0
10000;2030;1.08;0.76;1.17;1.08;0.7;0;0;0;0;0;0;0;1.08;0;0;0;0.29;0.29;0.29;0.29;0.29;0;0
20000;2030;1.17;0.88;1.18;1.17;0.7;0;0;0;0;0;0;0;1.17;0;0;0;0.34;0.34;0.34;0.34;0.34;0;0
50000;2030;1.3;1.07;1.2;1.3;0.7;0;0;0;0;0;0;0;1.3;0;0;0;0.41;0.41;0.41;0.41;0.41;0;0
1000;2050;0.82;0.46;1.11;0.82;0.7;0;0;0;0;0;0;0;0.82;0;0;0;0.18;0.18;0.18;0.18;0.18;0;0
5000;2050;0.99;0.65;1.15;0.99;0.7;0;0;0;0;0;0;0;0.99;0;0;0;0.25;0.25;0.25;0.25;0.25;0;0
10000;2050;1.08;0.76;1.17;1.08;0.7;0;0;0;0;0;0;0;1.08;0;0;0;0.29;0.29;0.29;0.29;0.29;0;0
20000;2050;1.17;0.88;1.18;1.17;0.7;0;0;0;0;0;0;0;1.17;0;0;0;0.34;0.34;0.34;0.34;0.34;0;0
50000;2050;1.3;1.07;1.2;1.3;0.7;0;0;0;0;0;0;0;1.3;0;0;0;0.41;0.41;0.41;0.41;0.41;0;0
1000;2015;0.82;0.46;1.11;0.82;0.7;0;0;0;0;0;0;0;0.82;0;0;0;0.18;0.18;0.18;0.18;0.18;0;0
5000;2015;0.99;0.65;1.15;0.99;0.7;0;0;0;0;0;0;0;0.99;0;0;0;0.25;0.25;0.25;0.25;0.25;0;0
10000;2015;1.08;0.76;1.17;1.08;0.7;0;0;0;0;0;0;0;1.08;0;0;0;0.29;0.29;0.29;0.29;0.29;0;0
20000;2015;1.17;0.88;1.18;1.17;0.7;0;0;0;0;0;0;0;1.17;0;0;0;0.34;0.34;0.34;0.34;0.34;0;0
50000;2015;1.3;1.07;1.2;1.3;0.7;0;0;0;0;0;0;0;1.3;0;0;0;0.41;0.41;0.41;0.41;0.41;0;0
1000;2030;0.82;0.46;1.11;0.82;0.7;0;0;0;0;0;0;0;0.82;0;0;0;0.18;0.18;0.18;0.18;0.18;0;0
5000;2030;0.99;0.65;1.15;0.99;0.7;0;0;0;0;0;0;0;0.99;0;0;0;0.25;0.25;0.25;0.25;0.25;0;0
10000;2030;1.08;0.76;1.17;1.08;0.7;0;0;0;0;0;0;0;1.08;0;0;0;0.29;0.29;0.29;0.29;0.29;0;0
20000;2030;1.17;0.88;1.18;1.17;0.7;0;0;0;0;0;0;0;1.17;0;0;0;0.34;0.34;0.34;0.34;0.34;0;0
50000;2030;1.3;1.07;1.2;1.3;0.7;0;0;0;0;0;0;0;1.3;0;0;0;0.41;0.41;0.41;0.41;0.41;0;0
1000;2050;0.82;0.46;1.11;0.82;0.7;0;0;0;0;0;0;0;0.82;0;0;0;0.18;0.18;0.18;0.18;0.18;0;0
5000;2050;0.99;0.65;1.15;0.99;0.7;0;0;0;0;0;0;0;0.99;0;0;0;0.25;0.25;0.25;0.25;0.25;0;0
10000;2050;1.08;0.76;1.17;1.08;0.7;0;0;0;0;0;0;0;1.08;0;0;0;0.29;0.29;0.29;0.29;0.29;0;0
20000;2050;1.17;0.88;1.18;1.17;0.7;0;0;0;0;0;0;0;1.17;0;0;0;0.34;0.34;0.34;0.34;0.34;0;0
50000;2050;1.3;1.07;1.2;1.3;0.7;0;0;0;0;0;0;0;1.3;0;0;0;0.41;0.41;0.41;0.41;0.41;0;0
1000;2015;0.82;0.46;1.11;0.82;0.7;0;0;0;0;0;0;0;0.82;0;0;0;0.18;0.18;0.18;0.18;0.18;0;0
5000;2015;0.99;0.65;1.15;0.99;0.7;0;0;0;0;0;0;0;0.99;0;0;0;0.25;0.25;0.25;0.25;0.25;0;0
10000;2015;1.08;0.76;1.17;1.08;0.7;0;0;0;0;0;0;0;1.08;0;0;0;0.29;0.29;0.29;0.29;0.29;0;0
20000;2015;1.17;0.88;1.18;1.17;0.7;0;0;0;0;0;0;0;1.17;0;0;0;0.34;0.34;0.34;0.34;0.34;0;0
50000;2015;1.3;1.07;1.2;1.3;0.7;0;0;0;0;0;0;0;1.3;0;0;0;0.41;0.41;0.41;0.41;0.41;0;0
1000;2030;0.82;0.46;1.11;0.82;0.7;0;0;0;0;0;0;0;0.82;0;0;0;0.18;0.18;0.18;0.18;0.18;0;0
5000;2030;0.99;0.65;1.15;0.99;0.7;0;0;0;0;0;0;0;0.99;0;0;0;0.25;0.25;0.25;0.25;0.25;0;0
10000;2030;1.08;0.76;1.17;1.08;0.7;0;0;0;0;0;0;0;1.08;0;0;0;0.29;0.29;0.29;0.29;0.29;0;0
20000;2030;1.17;0.88;1.18;1.17;0.7;0;0;0;0;0;0;0;1.17;0;0;0;0.34;0.34;0.34;0.34;0.34;0;0
50000;2030;1.3;1.07;1.2;1.3;0.7;0;0;0;0;0;0;0;1.3;0;0;0;0.41;0.41;0.41;0.41;0.41;0;0
1000;2050;0.82;0.46;1.11;0.82;0.7;0;0;0;0;0;0;0;0.82;0;0;0;0.18;0.18;0.18;0.18;0.18;0;0
5000;2050;0.99;0.65;1.15;0.99;0.7;0;0;0;0;0;0;0;0.99;0;0;0;0.25;0.25;0.25;0.25;0.25;0;0
10000;2050;1.08;0.76;1.17;1.08;0.7;0;0;0;0;0;0;0;1.08;0;0;0;0.29;0.29;0.29;0.29;0.29;0;0
20000;2050;1.17;0.88;1.18;1.17;0.7;0;0;0;0;0;0;0;1.17;0;0;0;0.34;0.34;0.34;0.34;0.34;0;0
50000;2050;1.3;1.07;1.2;1.3;0.7;0;0;0;0;0;0;0;1.3;0;0;0;0.41;0.41;0.41;0.41;0.41;0;0
1000;2015;0.82;0.46;1.11;0.82;0.7;0;0;0;0;0;0;0;0.82;0;0;0;0.18;0.18;0.18;0.18;0.18;0;0
5000;2015;0.99;0.65;1.15;0.99;0.7;0;0;0;0;0;0;0;0.99;0;0;0;0.25;0.25;0.25;0.25;0.25;0;0
10000;2015;1.08;0.76;1.17;1.08;0.7;0;0;0;0;0;0;0;1.08;0;0;0;0.29;0.29;0.29;0.29;0.29;0;0
20000;2015;1.17;0.88;1.18;1.17;0.7;0;0;0;0;0;0;0;1.17;0;0;0;0.34;0.34;0.34;0.34;0.34;0;0
50000;2015;1.3;1.07;1.2;1.3;0.7;0;0;0;0;0;0;0;1.3;0;0;0;0.41;0.41;0.41;0.41;0.41;0;0
1000;2030;0.82;0.46;1.11;0.82;0.7;0;0;0;0;0;0;0;0.82;0;0;0;0.18;0.18;0.18;0.18;0.18;0;0
5000;2030;0.99;0.65;1.15;0.99;0.7;0;0;0;0;0;0;0;0.99;0;0;0;0.25;0.25;0.25;0.25;0.25;0;0
10000;2030;1.08;0.76;1.17;1.08;0.7;0;0;0;0;0;0;0;1.08;0;0;0;0.29;0.29;0.29;0.29;0.29;0;0
20000;2030;1.17;0.88;1.18;1.17;0.7;0;0;0;0;0;0;0;1.17;0;0;0;0.34;0.34;0.34;0.34;0.34;0;0
50000;2030;1.3;1.07;1.2;1.3;0.7;0;0;0;0;0;0;0;1.3;0;0;0;0.41;0.41;0.41;0.41;0.41;0;0
1000;2050;0.82;0.46;1.11;0.82;0.7;0;0;0;0;0;0;0;0.82;0;0;0;0.18;0.18;0.18;0.18;0.18;0;0
5000;2050;0.99;0.65;1.15;0.99;0.7;0;0;0;0;0;0;0;0.99;0;0;0;0.25;0.25;0.25;0.25;0.25;0;0
10000;2050;1.08;0.76;1.17;1.08;0.7;0;0;0;0;0;0;0;1.08;0;0;0;0.29;0.29;0.29;0.29;0.29;0;0
20000;2050;1.17;0.88;1.18;1.17;0.7;0;0;0;0;0;0;0;1.17;0;0;0;0.34;0.34;0.34;0.34;0.34;0;0
50000;2050;1.3;1.07;1.2;1.3;0.7;0;0;0;0;0;0;0;1.3;0;0;0;0.41;0.41;0.41;0.41;0.41;0;0
1000;2015;0.82;0.46;1.11;0.82;0.7;0;0;0;0;0;0;0;0.82;0;0;0;0.18;0.18;0.18;0.18;0.18;0;0
5000;2015;0.99;0.65;1.15;0.99;0.7;0;0;0;0;0;0;0;0.99;0;0;0;0.25;0.25;0.25;0.25;0.25;0;0
10000;2015;1.08;0.76;1.17;1.08;0.7;0;0;0;0;0;0;0;1.08;0;0;0;0.29;0.29;0.29;0.29;0.29;0;0
20000;2015;1.17;0.88;1.18;1.17;0.7;0;0;0;0;0;0;0;1.17;0;0;0;0.34;0.34;0.34;0.34;0.34;0;0
50000;2015;1.3;1.07;1.2;1.3;0.7;0;0;0;0;0;0;0;1.3;0;0;0;0.41;0.41;0.41;0.41;0.41;0;0
1000;2030;0.82;0.46;1.11;0.82;0.7;0;0;0;0;0;0;0;0.82;0;0;0;0.18;0.18;0.18;0.18;0.18;0;0
5000;2030;0.99;0.65;1.15;0.99;0.7;0;0;0;0;0;0;0;0.99;0;0;0;0.25;0.25;0.25;0.25;0.25;0;0
10000;2030;1.08;0.76;1.17;1.08;0.7;0;0;0;0;0;0;0;1.08;0;0;0;0.29;0.29;0.29;0.29;0.29;0;0
20000;2030;1.17;0.88;1.18;1.17;0.7;0;0;0;0;0;0;0;1.17;0;0;0;0.34;0.34;0.34;0.34;0.34;0;0
50000;2030;1.3;1.07;1.2;1.3;0.7;0;0;0;0;0;0;0;1.3;0;0;0;0.41;0.41;0.41;0.41;0.41;0;0
1000;2050;0.82;0.46;1.11;0.82;0.7;0;0;0;0;0;0;0;0.82;0;0;0;0.18;0.18;0.18;0.18;0.18;0;0
5000;2050;0.99;0.65;1.15;0.99;0.7;0;0;0;0;0;0;0;0.99;0;0;0;0.25;0.25;0.25;0.25;0.25;0;0
10000;2050;1.08;0.76;1.17;1.08;0.7;0;0;0;0;0;0;0;1.08;0;0;0;0.29;0.29;0.29;0.29;0.29;0;0
20000;2050;1.17;0.88;1.18;1.17;0.7;0;0;0;0;0;0;0;1.17;0;0;0;0.34;0.34;0.34;0.34;0.34;0;0
50000;2050;1.3;1.07;1.2;1.3;0.7;0;0;0;0;0;0;0;1.3;0;0;0;0.41;0.41;0.41;0.41;0.41;0;0
1000;2015;0.82;0.46;1.11;0.82;0.7;0;0;0;0;0;0;0;0.82;0;0;0;0.18;0.18;0.18;0.18;0.18;0;0
5000;2015;0.99;0.65;1.15;0.99;0.7;0;0;0;0;0;0;0;0.99;0;0;0;0.25;0.25;0.25;0.25;0.25;0;0
10000;2015;1.08;0.76;1.17;1.08;0.7;0;0;0;0;0;0;0;1.08;0;0;0;0.29;0.29;0.29;0.29;0.29;0;0
20000;2015;1.17;0.88;1.18;1.17;0.7;0;0;0;0;0;0;0;1.17;0;0;0;0.34;0.34;0.34;0.34;0.34;0;0
50000;2015;1.3;1.07;1.2;1.3;0.7;0;0;0;0;0;0;0;1.3;0;0;0;0.41;0.41;0.41;0.41;0.41;0;0
1000;2030;0.82;0.46;1.11;0.82;0.7;0;0;0;0;0;0;0;0.82;0;0;0;0.18;0.18;0.18;0.18;0.18;0;0
5000;2030;0.99;0.65;1.15;0.99;0.7;0;0;0;0;0;0;0;0.99;0;0;0;0.25;0.25;0.25;0.25;0.25;0;0
10000;2030;1.08;0.76;1.17;1.08;0.7;0;0;0;0;0;0;0;1.08;0;0;0;0.29;0.29;0.29;0.29;0.29;0;0
20000;2030;1.17;0.88;1.18;1.17;0.7;0;0;0;0;0;0;0;1.17;0;0;0;0.34;0.34;0.34;0.34;0.34;0;0
50000;2030;1.3;1.07;1.2;1.3;0.7;0;0;0;0;0;0;0;1.3;0;0;0;0.41;0.41;0.41;0.41;0.41;0;0
1000;2050;0.82;0.46;1.11;0.82;0.7;0;0;0;0;0;0;0;0.82;0;0;0;0.18;0.18;0.18;0.18;0.18;0;0
5000;2050;0.99;0.65;1.15;0.99;0.7;0;0;0;0;0;0;0;0.99;0;0;0;0.25;0.25;0.25;0.25;0.25;0;0
10000;2050;1.08;0.76;1.17;1.08;0.7;0;0;0;0;0;0;0;1.08;0;0;0;0.29;0.29;0.29;0.29;0.29;0;0
20000;2050;1.17;0.88;1.18;1.17;0.7;0;0;0;0;0;0;0;1.17;0;0;0;0.34;0.34;0.34;0.34;0.34;0;0
50000;2050;1.3;1.07;1.2;1.3;0.7;0;0;0;0;0;0;0;1.3;0;0;0;0.41;0.41;0.41;0.41;0.41;0;0
1000;2015;0.82;0.46;1.11;0.82;0.7;0;0;0;0;0;0;0;0.82;0;0;0;0.18;0.18;0.18;0.18;0.18;0;0
5000;2015;0.99;0.65;1.15;0.99;0.7;0;0;0;0;0;0;0;0.99;0;0;0;0.25;0.25;0.25;0.25;0.25;0;0
10000;2015;1.08;0.76;1.17;1.08;0.7;0;0;0;0;0;0;0;1.08;0;0;0;0.29;0.29;0.29;0.29;0.29;0;0
20000;2015;1.17;0.88;1.18;1.17;0.7;0;0;0;0;0;0;0;1.17;0;0;0;0.34;0.34;0.34;0.34;0.34;0;0
50000;2015;1.3;1.07;1.2;1.3;0.7;0;0;0;0;0;0;0;1.3;0;0;0;0.41;0.41;0.41;0.41;0.41;0;0
1000;2030;0.82;0.46;1.11;0.82;0.7;0;0;0;0;0;0;0;0.82;0;0;0;0.18;0.18;0.18;0.18;0.18;0;0
5000;2030;0.99;0.65;1.15;0.99;0.7;0;0;0;0;0;0;0;0.99;0;0;0;0.25;0.25;0.25;0.25;0.25;0;0
10000;2030;1.08;0.76;1.17;1.08;0.7;0;0;0;0;0;0;0;1.08;0;0;0;0.29;0.29;0.29;0.29;0.29;0;0
20000;2030;1.17;0.88;1.18;1.17;0.7;0;0;0;0;0;0;0;1.17;0;0;0;0.34;0.34;0.34;0.34;0.34;0;0
50000;2030;1.3;1.07;1.2;1.3;0.7;0;0;0;0;0;0;0;1.3;0;0;0;0.41;0.41;0.41;0.41;0.41;0;0
1000;2050;0.82;0.46;1.11;0.82;0.7;0;0;0;0;0;0;0;0.82;0;0;0;0.18;0.18;0.18;0.18;0.18;0;0
5000;2050;0.99;0.65;1.15;0.99;0.7;0;0;0;0;0;0;0;0.99;0;0;0;0.25;0.25;0.25;0.25;0.25;0;0
10000;2050;1.08;0.76;1.17;1.08;0.7;0;0;0;0;0;0;0;1.08;0;0;0;0.29;0.29;0.29;0.29;0.29;0;0
20000;2050;1.17;0.88;1.18;1.17;0.7;0;0;0;0;0;0;0;1.17;0;0;0;0.34;0.34;0.34;0.34;0.34;0;0
50000;2050;1.3;1.07;1.2;1.3;0.7;0;0;0;0;0;0;0;1.3;0;0;0;0.41;0.41;0.41;0.41;0.41;0;0
1000;2015;0.82;0.46;1.11;0.82;0.7;0;0;0;0;0;0;0;0.82;0;0;0;0.18;0.18;0.18;0.18;0.18;0;0
5000;2015;0.99;0.65;1.15;0.99;0.7;0;0;0;0;0;0;0;0.99;0;0;0;0.25;0.25;0.25;0.25;0.25;0;0
10000;2015;1.08;0.76;1.17;1.08;0.7;0;0;0;0;0;0;0;1.08;0;0;0;0.29;0.29;0.29;0.29;0.29;0;0
20000;2015;1.17;0.88;1.18;1.17;0.7;0;0;0;0;0;0;0;1.17;0;0;0;0.34;0.34;0.34;0.34;0.34;0;0
50000;2015;1.3;1.07;1.2;1.3;0.7;0;0;0;0;0;0;0;1.3;0;0;0;0.41;0.41;0.41;0.41;0.41;0;0
1000;2030;0.82;0.46;1.11;0.82;0.7;0;0;0;0;0;0;0;0.82;0;0;0;0.18;0.18;0.18;0.18;0.18;0;0
5000;2030;0.99;0.65;1.15;0.99;0.7;0;0;0;0;0;0;0;0.99;0;0;0;0.25;0.25;0.25;0.25;0.25;0;0
10000;2030;1.08;0.76;1.17;1.08;0.7;0;0;0;0;0;0;0;1.08;0;0;0;0.29;0.29;0.29;0.29;0.29;0;0
20000;2030;1.17;0.88;1.18;1.17;0.7;0;0;0;0;0;0;0;1.17;0;0;0;0.34;0.34;0.34;0.34;0.34;0;0
50000;2030;1.3;1.07;1.2;1.3;0.7;0;0;0;0;0;0;0;1.3;0;0;0;0.41;0.41;0.41;0.41;0.41;0;0
1000;2050;0.82;0.46;1.11;0.82;0.7;0;0;0;0;0;0;0;0.82;0;0;0;0.18;0.18;0.18;0.18;0.18;0;0
5000;2050;0.99;0.65;1.15;0.99;0.7;0;0;0;0;0;0;0;0.99;0;0;0;0.25;0.25;0.25;0.25;0.25;0;0
10000;2050;1.08;0.76;1.17;1.08;0.7;0;0;0;0;0;0;0;1.08;0;0;0;0.29;0.29;0.29;0.29;0.29;0;0
20000;2050;1.17;0.88;1.18;1.17;0.7;0;0;0;0;0;0;0;1.17;0;0;0;0.34;0.34;0.34;0.34;0.34;0;0
50000;2050;1.3;1.07;1.2;1.3;0.7;0;0;0;0;0;0;0;1.3;0;0;0;0.41;0.41;0.41;0.41;0.41;0;0
1000;2015;0.82;0.46;1.11;0.82;0.7;0;0;0;0;0;0;0;0.82;0;0;0;0.18;0.18;0.18;0.18;0.18;0;0
5000;2015;0.99;0.65;1.15;0.99;0.7;0;0;0;0;0;0;0;0.99;0;0;0;0.25;0.25;0.25;0.25;0.25;0;0
10000;2015;1.08;0.76;1.17;1.08;0.7;0;0;0;0;0;0;0;1.08;0;0;0;0.29;0.29;0.29;0.29;0.29;0;0
20000;2015;1.17;0.88;1.18;1.17;0.7;0;0;0;0;0;0;0;1.17;0;0;0;0.34;0.34;0.34;0.34;0.34;0;0
50000;2015;1.3;1.07;1.2;1.3;0.7;0;0;0;0;0;0;0;1.3;0;0;0;0.41;0.41;0.41;0.41;0.41;0;0
1000;2030;0.82;0.46;1.11;0.82;0.7;0;0;0;0;0;0;0;0.82;0;0;0;0.18;0.18;0.18;0.18;0.18;0;0
5000;2030;0.99;0.65;1.15;0.99;0.7;0;0;0;0;0;0;0;0.99;0;0;0;0.25;0.25;0.25;0.25;0.25;0;0
10000;2030;1.08;0.76;1.17;1.08;0.7;0;0;0;0;0;0;0;1.08;0;0;0;0.29;0.29;0.29;0.29;0.29;0;0
20000;2030;1.17;0.88;1.18;1.17;0.7;0;0;0;0;0;0;0;1.17;0;0;0;0.34;0.34;0.34;0.34;0.34;0;0
50000;2030;1.3;1.07;1.2;1.3;0.7;0;0;0;0;0;0;0;1.3;0;0;0;0.41;0.41;0.41;0.41;0.41;0;0
1000;2050;0.82;0.46;1.11;0.82;0.7;0;0;0;0;0;0;0;0.82;0;0;0;0.18;0.18;0.18;0.18;0.18;0;0
5000;2050;0.99;0.65;1.15;0.99;0.7;0;0;0;0;0;0;0;0.99;0;0;0;0.25;0.25;0.25;0.25;0.25;0;0
10000;2050;1.08;0.76;1.17;1.08;0.7;0;0;0;0;0;0;0;1.08;0;0;0;0.29;0.29;0.29;0.29;0.29;0;0
20000;2050;1.17;0.88;1.18;1.17;0.7;0;0;0;0;0;0;0;1.17;0;0;0;0.34;0.34;0.34;0.34;0.34;0;0
50000;2050;1.3;1.07;1.2;1.3;0.7;0;0;0;0;0;0;0;1.3;0;0;0;0.41;0.41;0.41;0.41;0.41;0;0
1000;2015;0.82;0.46;1.11;0.82;0.7;0;0;0;0;0;0;0;0.82;0;0;0;0.18;0.18;0.18;0.18;0.18;0;0
5000;2015;0.99;0.65;1.15;0.99;0.7;0;0;0;0;0;0;0;0.99;0;0;0;0.25;0.25;0.25;0.25;0.25;0;0
10000;2015;1.08;0.76;1.17;1.08;0.7;0;0;0;0;0;0;0;1.08;0;0;0;0.29;0.29;0.29;0.29;0.29;0;0
20000;2015;1.17;0.88;1.18;1.17;0.7;0;0;0;0;0;0;0;1.17;0;0;0;0.34;0.34;0.34;0.34;0.34;0;0
50000;2015;1.3;1.07;1.2;1.3;0.7;0;0;0;0;0;0;0;1.3;0;0;0;0.41;0.41;0.41;0.41;0.41;0;0
1000;2030;0.82;0.46;1.11;0.82;0.7;0;0;0;0;0;0;0;0.82;0;0;0;0.18;0.18;0.18;0.18;0.18;0;0
5000;2030;0.99;0.65;1.15;0.99;0.7;0;0;0;0;0;0;0;0.99;0;0;0;0.25;0.25;0.25;0.25;0.25;0;0
10000;2030;1.08;0.76;1.17;1.08;0.7;0;0;0;0;0;0;0;1.08;0;0;0;0.29;0.29;0.29;0.29;0.29;0;0
20000;2030;1.17;0.88;1.18;1.17;0.7;0;0;0;0;0;0;0;1.17;0;0;0;0.34;0.34;0.34;0.34;0.34;0;0
50000;2030;1.3;1.07;1.2;1.3;0.7;0;0;0;0;0;0;0;1.3;0;0;0;0.41;0.41;0.41;0.41;0.41;0;0
1000;2050;0.82;0.46;1.11;0.82;0.7;0;0;0;0;0;0;0;0.82;0;0;0;0.18;0.18;0.18;0.18;0.18;0;0
5000;2050;0.99;0.65;1.15;0.99;0.7;0;0;0;0;0;0;0;0.99;0;0;0;0.25;0.25;0.25;0.25;0.25;0;0
10000;2050;1.08;0.76;1.17;1.08;0.7;0;0;0;0;0;0;0;1.08;0;0;0;0.29;0.29;0.29;0.29;0.29;0;0
20000;2050;1.17;0.88;1.18;1.17;0.7;0;0;0;0;0;0;0;1.17;0;0;0;0.34;0.34;0.34;0.34;0.34;0;0
50000;2050;1.3;1.07;1.2;1.3;0.7;0;0;0;0;0;0;0;1.3;0;0;0;0.41;0.41;0.41;0.41;0.41;0;0
