NUTS_number,value
0.000000000000000000e+00,0.000000000000000000e+00
1.000000000000000000e+00,0.000000000000000000e+00
2.000000000000000000e+00,0.000000000000000000e+00
3.000000000000000000e+00,0.000000000000000000e+00
4.000000000000000000e+00,7.849692000000000000e+06
5.000000000000000000e+00,0.000000000000000000e+00
6.000000000000000000e+00,0.000000000000000000e+00
7.000000000000000000e+00,7.021442000000000000e+06
8.000000000000000000e+00,2.281858000000000000e+06
9.000000000000000000e+00,3.074834000000000000e+06
1.000000000000000000e+01,0.000000000000000000e+00
1.100000000000000000e+01,2.773939000000000000e+06
1.200000000000000000e+01,1.514319000000000000e+06
1.300000000000000000e+01,1.309892000000000000e+06
1.400000000000000000e+01,0.000000000000000000e+00
1.500000000000000000e+01,1.936513000000000000e+06
1.600000000000000000e+01,1.312445000000000000e+06
1.700000000000000000e+01,5.676450000000000000e+05
1.800000000000000000e+01,3.850083000000000000e+06
1.900000000000000000e+01,8.556920000000000000e+05
2.000000000000000000e+01,1.602919000000000000e+06
2.100000000000000000e+01,0.000000000000000000e+00
2.200000000000000000e+01,4.154904000000000000e+06
2.300000000000000000e+01,3.433692000000000000e+06
2.400000000000000000e+01,0.000000000000000000e+00
2.500000000000000000e+01,2.077009000000000000e+06
2.600000000000000000e+01,3.304210000000000000e+05
2.700000000000000000e+01,7.335850000000000000e+05
2.800000000000000000e+01,2.044460000000000000e+06
2.900000000000000000e+01,1.255722000000000000e+06
3.000000000000000000e+01,1.031530000000000000e+06
3.100000000000000000e+01,6.297300000000000000e+05
3.200000000000000000e+01,5.625620000000000000e+05
3.300000000000000000e+01,0.000000000000000000e+00
3.400000000000000000e+01,0.000000000000000000e+00
3.500000000000000000e+01,2.620452000000000000e+06
3.600000000000000000e+01,0.000000000000000000e+00
3.700000000000000000e+01,6.000950000000000000e+05
3.800000000000000000e+01,3.222558000000000000e+06
3.900000000000000000e+01,1.924881000000000000e+06
4.000000000000000000e+01,5.208830000000000000e+05
4.100000000000000000e+01,1.267174000000000000e+06
4.200000000000000000e+01,1.090895000000000000e+06
4.300000000000000000e+01,1.056918000000000000e+06
4.400000000000000000e+01,0.000000000000000000e+00
4.500000000000000000e+01,7.919060000000000000e+05
4.600000000000000000e+01,4.604830000000000000e+06
4.700000000000000000e+01,5.042830000000000000e+05
4.800000000000000000e+01,1.585633000000000000e+06
4.900000000000000000e+01,5.908310000000000000e+05
5.000000000000000000e+01,0.000000000000000000e+00
5.100000000000000000e+01,4.144160000000000000e+05
5.200000000000000000e+01,3.429250000000000000e+05
5.300000000000000000e+01,4.661610000000000000e+05
5.400000000000000000e+01,4.790440000000000000e+05
5.500000000000000000e+01,3.674040000000000000e+05
5.600000000000000000e+01,0.000000000000000000e+00
5.700000000000000000e+01,8.423530000000000000e+05
5.800000000000000000e+01,2.160332000000000000e+06
5.900000000000000000e+01,4.972870000000000000e+05
6.000000000000000000e+01,0.000000000000000000e+00
6.100000000000000000e+01,0.000000000000000000e+00
6.200000000000000000e+01,0.000000000000000000e+00
6.300000000000000000e+01,0.000000000000000000e+00
6.400000000000000000e+01,0.000000000000000000e+00
6.500000000000000000e+01,0.000000000000000000e+00
6.600000000000000000e+01,3.140040000000000000e+05
6.700000000000000000e+01,4.373660000000000000e+05
6.800000000000000000e+01,5.570740000000000000e+05
6.900000000000000000e+01,7.128900000000000000e+05
7.000000000000000000e+01,4.586440000000000000e+05
7.100000000000000000e+01,0.000000000000000000e+00
7.200000000000000000e+01,6.997620000000000000e+05
7.300000000000000000e+01,4.076820000000000000e+05
7.400000000000000000e+01,6.341210000000000000e+05
7.500000000000000000e+01,3.036580000000000000e+05
7.600000000000000000e+01,2.759380000000000000e+05
7.700000000000000000e+01,0.000000000000000000e+00
7.800000000000000000e+01,1.240442000000000000e+06
7.900000000000000000e+01,4.976180000000000000e+05
8.000000000000000000e+01,4.565420000000000000e+05
8.100000000000000000e+01,3.365920000000000000e+05
8.200000000000000000e+01,0.000000000000000000e+00
8.300000000000000000e+01,1.253932000000000000e+06
8.400000000000000000e+01,4.579010000000000000e+05
8.500000000000000000e+01,3.403520000000000000e+05
8.600000000000000000e+01,9.115920000000000000e+05
8.700000000000000000e+01,0.000000000000000000e+00
8.800000000000000000e+01,0.000000000000000000e+00
8.900000000000000000e+01,3.531358000000000000e+06
9.000000000000000000e+01,8.665510000000000000e+05
9.100000000000000000e+01,8.070790000000000000e+05
9.200000000000000000e+01,4.402760000000000000e+05
9.300000000000000000e+01,4.004930000000000000e+05
9.400000000000000000e+01,0.000000000000000000e+00
9.500000000000000000e+01,1.655965000000000000e+06
9.600000000000000000e+01,5.770010000000000000e+05
9.700000000000000000e+01,6.933540000000000000e+05
9.800000000000000000e+01,3.690790000000000000e+05
9.900000000000000000e+01,3.683030000000000000e+05
1.000000000000000000e+02,0.000000000000000000e+00
1.010000000000000000e+02,0.000000000000000000e+00
1.020000000000000000e+02,0.000000000000000000e+00
1.030000000000000000e+02,0.000000000000000000e+00
1.040000000000000000e+02,0.000000000000000000e+00
1.050000000000000000e+02,0.000000000000000000e+00
1.060000000000000000e+02,7.664215000000000000e+06
1.070000000000000000e+02,0.000000000000000000e+00
1.080000000000000000e+02,7.411310000000000000e+06
1.090000000000000000e+02,0.000000000000000000e+00
1.100000000000000000e+02,3.713217000000000000e+06
1.110000000000000000e+02,3.384689000000000000e+06
1.120000000000000000e+02,0.000000000000000000e+00
1.130000000000000000e+02,1.713192000000000000e+06
1.140000000000000000e+02,4.560555000000000000e+06
1.150000000000000000e+02,0.000000000000000000e+00
1.160000000000000000e+02,2.515605000000000000e+06
1.170000000000000000e+02,3.262332000000000000e+06
1.180000000000000000e+02,3.016453000000000000e+06
1.190000000000000000e+02,0.000000000000000000e+00
1.200000000000000000e+02,2.942085000000000000e+06
1.210000000000000000e+02,6.412721000000000000e+06
1.220000000000000000e+02,0.000000000000000000e+00
1.230000000000000000e+02,3.552387000000000000e+06
1.240000000000000000e+02,3.227470000000000000e+06
1.250000000000000000e+02,0.000000000000000000e+00
1.260000000000000000e+02,7.136673000000000000e+06
1.270000000000000000e+02,0.000000000000000000e+00
1.280000000000000000e+02,0.000000000000000000e+00
1.290000000000000000e+02,0.000000000000000000e+00
1.300000000000000000e+02,0.000000000000000000e+00
1.310000000000000000e+02,0.000000000000000000e+00
1.320000000000000000e+02,0.000000000000000000e+00
1.330000000000000000e+02,4.996626000000000000e+06
1.340000000000000000e+02,3.748544000000000000e+06
1.350000000000000000e+02,3.197837000000000000e+06
1.360000000000000000e+02,3.708280000000000000e+05
1.370000000000000000e+02,0.000000000000000000e+00
1.380000000000000000e+02,1.641821000000000000e+06
1.390000000000000000e+02,4.525028000000000000e+06
1.400000000000000000e+02,0.000000000000000000e+00
1.410000000000000000e+02,3.821614000000000000e+06
1.420000000000000000e+02,5.725523000000000000e+06
1.430000000000000000e+02,0.000000000000000000e+00
1.440000000000000000e+02,3.453679000000000000e+06
1.450000000000000000e+02,6.249214000000000000e+06
1.460000000000000000e+02,0.000000000000000000e+00
1.470000000000000000e+02,4.702876000000000000e+06
1.480000000000000000e+02,0.000000000000000000e+00
1.490000000000000000e+02,0.000000000000000000e+00
1.500000000000000000e+02,0.000000000000000000e+00
1.510000000000000000e+02,0.000000000000000000e+00
1.520000000000000000e+02,0.000000000000000000e+00
1.530000000000000000e+02,0.000000000000000000e+00
1.540000000000000000e+02,3.623741000000000000e+06
1.550000000000000000e+02,2.313456000000000000e+06
1.560000000000000000e+02,3.102318000000000000e+06
1.570000000000000000e+02,1.571601000000000000e+06
1.580000000000000000e+02,3.038570000000000000e+06
1.590000000000000000e+02,2.394068000000000000e+06
1.600000000000000000e+02,6.891510000000000000e+05
1.610000000000000000e+02,1.969926000000000000e+06
1.620000000000000000e+02,6.742330000000000000e+05
1.630000000000000000e+02,1.190941000000000000e+06
1.640000000000000000e+02,8.609120000000000000e+05
1.650000000000000000e+02,8.548860000000000000e+05
1.660000000000000000e+02,2.015137000000000000e+06
1.670000000000000000e+02,0.000000000000000000e+00
1.680000000000000000e+02,3.463640000000000000e+05
1.690000000000000000e+02,1.762811000000000000e+06
1.700000000000000000e+02,2.617017000000000000e+06
1.710000000000000000e+02,1.334288000000000000e+06
1.720000000000000000e+02,8.574570000000000000e+05
1.730000000000000000e+02,1.774961000000000000e+06
1.740000000000000000e+02,9.160080000000000000e+05
1.750000000000000000e+02,3.288350000000000000e+06
1.760000000000000000e+02,7.235530000000000000e+05
1.770000000000000000e+02,9.760300000000000000e+05
1.780000000000000000e+02,1.244312000000000000e+06
1.790000000000000000e+02,7.757940000000000000e+05
1.800000000000000000e+02,0.000000000000000000e+00
1.810000000000000000e+02,1.282879000000000000e+06
1.820000000000000000e+02,1.522569000000000000e+06
1.830000000000000000e+02,8.630630000000000000e+05
1.840000000000000000e+02,2.523814000000000000e+06
1.850000000000000000e+02,9.070270000000000000e+05
1.860000000000000000e+02,1.388492000000000000e+06
1.870000000000000000e+02,9.193360000000000000e+05
1.880000000000000000e+02,1.657173000000000000e+06
1.890000000000000000e+02,1.307784000000000000e+06
1.900000000000000000e+02,1.004525000000000000e+06
1.910000000000000000e+02,0.000000000000000000e+00
1.920000000000000000e+02,1.860865000000000000e+06
1.930000000000000000e+02,1.273746000000000000e+06
1.940000000000000000e+02,1.248643000000000000e+06
1.950000000000000000e+02,7.633960000000000000e+05
1.960000000000000000e+02,1.181895000000000000e+06
1.970000000000000000e+02,1.258389000000000000e+06
1.980000000000000000e+02,1.251288000000000000e+06
1.990000000000000000e+02,1.752559000000000000e+06
2.000000000000000000e+02,8.609000000000000000e+05
2.010000000000000000e+02,0.000000000000000000e+00
2.020000000000000000e+02,0.000000000000000000e+00
2.030000000000000000e+02,8.054830000000000000e+05
2.040000000000000000e+02,8.572617000000000000e+06
2.050000000000000000e+02,3.739350000000000000e+05
2.060000000000000000e+02,7.127610000000000000e+05
2.070000000000000000e+02,6.904200000000000000e+05
2.080000000000000000e+02,7.315480000000000000e+05
2.090000000000000000e+02,8.103450000000000000e+05
2.100000000000000000e+02,7.759500000000000000e+05
2.110000000000000000e+02,7.829290000000000000e+05
2.120000000000000000e+02,7.551350000000000000e+05
2.130000000000000000e+02,1.010148000000000000e+06
2.140000000000000000e+02,1.217893000000000000e+06
2.150000000000000000e+02,5.541700000000000000e+05
2.160000000000000000e+02,7.214730000000000000e+05
2.170000000000000000e+02,6.182840000000000000e+05
2.180000000000000000e+02,6.663780000000000000e+05
2.190000000000000000e+02,2.038316000000000000e+06
2.200000000000000000e+02,5.884470000000000000e+05
2.210000000000000000e+02,7.612880000000000000e+05
2.220000000000000000e+02,1.529143000000000000e+06
2.230000000000000000e+02,8.503630000000000000e+05
2.240000000000000000e+02,1.127867000000000000e+06
2.250000000000000000e+02,8.315980000000000000e+05
2.260000000000000000e+02,0.000000000000000000e+00
2.270000000000000000e+02,4.301000000000000000e+05
2.280000000000000000e+02,3.478050000000000000e+05
2.290000000000000000e+02,2.935950000000000000e+05
2.300000000000000000e+02,7.891450000000000000e+05
2.310000000000000000e+02,5.331910000000000000e+05
2.320000000000000000e+02,7.198580000000000000e+05
2.330000000000000000e+02,9.603900000000000000e+05
2.340000000000000000e+02,1.201925000000000000e+06
2.350000000000000000e+02,5.454120000000000000e+05
2.360000000000000000e+02,7.674580000000000000e+05
2.370000000000000000e+02,6.051460000000000000e+05
2.380000000000000000e+02,6.256090000000000000e+05
2.390000000000000000e+02,0.000000000000000000e+00
2.400000000000000000e+02,2.889760000000000000e+05
2.410000000000000000e+02,9.158820000000000000e+05
2.420000000000000000e+02,2.958180000000000000e+05
2.430000000000000000e+02,6.837830000000000000e+05
2.440000000000000000e+02,8.532770000000000000e+05
2.450000000000000000e+02,8.174770000000000000e+05
2.460000000000000000e+02,6.369640000000000000e+05
2.470000000000000000e+02,1.148405000000000000e+06
2.480000000000000000e+02,9.646330000000000000e+05
2.490000000000000000e+02,5.250410000000000000e+05
2.500000000000000000e+02,0.000000000000000000e+00
2.510000000000000000e+02,4.783200000000000000e+05
2.520000000000000000e+02,4.977300000000000000e+05
2.530000000000000000e+02,3.029740000000000000e+05
2.540000000000000000e+02,3.355480000000000000e+05
2.550000000000000000e+02,8.841810000000000000e+05
2.560000000000000000e+02,7.070480000000000000e+05
2.570000000000000000e+02,5.816260000000000000e+05
2.580000000000000000e+02,7.087790000000000000e+05
2.590000000000000000e+02,7.360290000000000000e+05
2.600000000000000000e+02,5.083320000000000000e+05
2.610000000000000000e+02,5.169750000000000000e+05
2.620000000000000000e+02,4.638440000000000000e+05
2.630000000000000000e+02,5.697670000000000000e+05
2.640000000000000000e+02,0.000000000000000000e+00
2.650000000000000000e+02,2.781990000000000000e+05
2.660000000000000000e+02,7.072900000000000000e+05
2.670000000000000000e+02,7.272210000000000000e+05
2.680000000000000000e+02,3.175370000000000000e+06
2.690000000000000000e+02,2.503950000000000000e+05
2.700000000000000000e+02,1.165870000000000000e+06
2.710000000000000000e+02,8.363540000000000000e+05
2.720000000000000000e+02,7.190710000000000000e+05
2.730000000000000000e+02,1.094373000000000000e+06
2.740000000000000000e+02,6.256650000000000000e+05
2.750000000000000000e+02,7.958010000000000000e+05
2.760000000000000000e+02,6.059870000000000000e+05
2.770000000000000000e+02,0.000000000000000000e+00
2.780000000000000000e+02,4.342380000000000000e+05
2.790000000000000000e+02,3.445330000000000000e+05
2.800000000000000000e+02,8.127630000000000000e+05
2.810000000000000000e+02,1.086478000000000000e+06
2.820000000000000000e+02,6.801660000000000000e+05
2.830000000000000000e+02,5.356820000000000000e+05
2.840000000000000000e+02,5.425370000000000000e+05
2.850000000000000000e+02,5.695540000000000000e+05
2.860000000000000000e+02,8.301790000000000000e+05
2.870000000000000000e+02,8.500490000000000000e+05
2.880000000000000000e+02,7.216050000000000000e+05
2.890000000000000000e+02,9.995610000000000000e+05
2.900000000000000000e+02,0.000000000000000000e+00
2.910000000000000000e+02,1.681459000000000000e+06
2.920000000000000000e+02,2.740400000000000000e+05
2.930000000000000000e+02,4.404820000000000000e+05
2.940000000000000000e+02,2.834190000000000000e+05
2.950000000000000000e+02,7.950730000000000000e+05
2.960000000000000000e+02,1.496383000000000000e+06
2.970000000000000000e+02,5.955270000000000000e+05
2.980000000000000000e+02,7.937880000000000000e+05
2.990000000000000000e+02,1.046074000000000000e+06
3.000000000000000000e+02,5.192880000000000000e+05
3.010000000000000000e+02,9.099190000000000000e+05
3.020000000000000000e+02,9.076130000000000000e+05
3.030000000000000000e+02,8.625200000000000000e+05
3.040000000000000000e+02,1.002411000000000000e+06
3.050000000000000000e+02,0.000000000000000000e+00
3.060000000000000000e+02,0.000000000000000000e+00
3.070000000000000000e+02,2.033475000000000000e+07
3.080000000000000000e+02,0.000000000000000000e+00
3.090000000000000000e+02,0.000000000000000000e+00
3.100000000000000000e+02,4.545920000000000000e+05
3.110000000000000000e+02,6.160230000000000000e+05
3.120000000000000000e+02,3.679750000000000000e+05
3.130000000000000000e+02,9.618120000000000000e+05
3.140000000000000000e+02,1.072262000000000000e+06
3.150000000000000000e+02,1.036517000000000000e+06
3.160000000000000000e+02,7.291980000000000000e+05
3.170000000000000000e+02,9.442950000000000000e+05
3.180000000000000000e+02,1.169895000000000000e+06
3.190000000000000000e+02,1.278278000000000000e+06
3.200000000000000000e+02,7.541580000000000000e+05
3.210000000000000000e+02,1.125840000000000000e+06
3.220000000000000000e+02,6.641240000000000000e+05
3.230000000000000000e+02,1.263729000000000000e+06
3.240000000000000000e+02,5.572310000000000000e+05
3.250000000000000000e+02,8.149180000000000000e+05
3.260000000000000000e+02,1.027614000000000000e+06
3.270000000000000000e+02,8.151110000000000000e+05
3.280000000000000000e+02,0.000000000000000000e+00
3.290000000000000000e+02,0.000000000000000000e+00
3.300000000000000000e+02,3.506560000000000000e+06
3.310000000000000000e+02,7.077500000000000000e+05
3.320000000000000000e+02,0.000000000000000000e+00
3.330000000000000000e+02,0.000000000000000000e+00
3.340000000000000000e+02,1.080464400000000000e+07
3.350000000000000000e+02,0.000000000000000000e+00
3.360000000000000000e+02,0.000000000000000000e+00
3.370000000000000000e+02,8.935050000000000000e+05
3.380000000000000000e+02,4.031779000000000000e+06
3.390000000000000000e+02,6.341430000000000000e+05
3.400000000000000000e+02,1.703840000000000000e+06
3.410000000000000000e+02,1.605971000000000000e+06
3.420000000000000000e+02,1.689302000000000000e+06
3.430000000000000000e+02,1.484039000000000000e+06
3.440000000000000000e+02,1.494941000000000000e+06
3.450000000000000000e+02,2.627867000000000000e+06
3.460000000000000000e+02,1.454224000000000000e+06
3.470000000000000000e+02,6.197210000000000000e+05
3.480000000000000000e+02,1.958026000000000000e+06
3.490000000000000000e+02,1.141589000000000000e+06
3.500000000000000000e+02,1.808305000000000000e+06
3.510000000000000000e+02,0.000000000000000000e+00
3.520000000000000000e+02,1.655859000000000000e+06
3.530000000000000000e+02,1.685852000000000000e+06
3.540000000000000000e+02,1.104119000000000000e+06
3.550000000000000000e+02,1.605533000000000000e+06
3.560000000000000000e+02,7.509990000000000000e+05
3.570000000000000000e+02,0.000000000000000000e+00
3.580000000000000000e+02,1.259376000000000000e+06
3.590000000000000000e+02,1.469483000000000000e+06
3.600000000000000000e+02,8.546220000000000000e+05
3.610000000000000000e+02,1.582946000000000000e+06
3.620000000000000000e+02,1.212896000000000000e+06
3.630000000000000000e+02,1.207390000000000000e+06
3.640000000000000000e+02,7.207970000000000000e+05
3.650000000000000000e+02,0.000000000000000000e+00
3.660000000000000000e+02,0.000000000000000000e+00
3.670000000000000000e+02,1.151172000000000000e+06
3.680000000000000000e+02,5.493150000000000000e+05
3.690000000000000000e+02,1.496818000000000000e+06
3.700000000000000000e+02,1.263400000000000000e+06
3.710000000000000000e+02,1.337314000000000000e+06
3.720000000000000000e+02,9.127440000000000000e+05
3.730000000000000000e+02,1.668441000000000000e+06
3.740000000000000000e+02,1.302286000000000000e+06
3.750000000000000000e+02,0.000000000000000000e+00
3.760000000000000000e+02,0.000000000000000000e+00
3.770000000000000000e+02,1.587710000000000000e+06
3.780000000000000000e+02,6.328420000000000000e+05
3.790000000000000000e+02,7.947090000000000000e+05
3.800000000000000000e+02,1.036986000000000000e+06
3.810000000000000000e+02,1.658979000000000000e+06
3.820000000000000000e+02,1.022068000000000000e+06
3.830000000000000000e+02,5.962050000000000000e+05
3.840000000000000000e+02,9.502590000000000000e+05
3.850000000000000000e+02,5.558480000000000000e+05
3.860000000000000000e+02,8.203070000000000000e+05
3.870000000000000000e+02,7.570920000000000000e+05
3.880000000000000000e+02,0.000000000000000000e+00
3.890000000000000000e+02,1.371990000000000000e+06
3.900000000000000000e+02,1.029806000000000000e+06
3.910000000000000000e+02,1.791760000000000000e+06
3.920000000000000000e+02,5.251220000000000000e+05
3.930000000000000000e+02,7.870170000000000000e+05
3.940000000000000000e+02,1.009670000000000000e+06
3.950000000000000000e+02,7.161010000000000000e+06
3.960000000000000000e+02,0.000000000000000000e+00
3.970000000000000000e+02,1.158240000000000000e+06
3.980000000000000000e+02,1.268315000000000000e+06
3.990000000000000000e+02,1.483885000000000000e+06
4.000000000000000000e+02,3.382170000000000000e+05
4.010000000000000000e+02,1.085570000000000000e+06
4.020000000000000000e+02,6.990600000000000000e+05
4.030000000000000000e+02,1.070910000000000000e+06
4.040000000000000000e+02,8.950490000000000000e+05
4.050000000000000000e+02,1.230783000000000000e+06
4.060000000000000000e+02,6.329420000000000000e+05
4.070000000000000000e+02,8.577530000000000000e+05
4.080000000000000000e+02,0.000000000000000000e+00
4.090000000000000000e+02,4.508450000000000000e+05
4.100000000000000000e+02,3.347400000000000000e+05
4.110000000000000000e+02,1.041352000000000000e+06
4.120000000000000000e+02,1.012896000000000000e+06
4.130000000000000000e+02,5.238310000000000000e+05
4.140000000000000000e+02,7.498490000000000000e+05
4.150000000000000000e+02,1.192421000000000000e+06
4.160000000000000000e+02,9.299230000000000000e+05
4.170000000000000000e+02,1.899338000000000000e+06
4.180000000000000000e+02,6.572090000000000000e+05
4.190000000000000000e+02,8.007210000000000000e+05
4.200000000000000000e+02,1.051510000000000000e+06
4.210000000000000000e+02,7.813570000000000000e+05
4.220000000000000000e+02,2.128658000000000000e+06
4.230000000000000000e+02,8.003470000000000000e+05
4.240000000000000000e+02,6.014250000000000000e+05
4.250000000000000000e+02,3.609970000000000000e+05
4.260000000000000000e+02,0.000000000000000000e+00
4.270000000000000000e+02,0.000000000000000000e+00
4.280000000000000000e+02,3.639880000000000000e+06
4.290000000000000000e+02,2.664261000000000000e+06
4.300000000000000000e+02,3.410861000000000000e+06
4.310000000000000000e+02,1.301766000000000000e+06
4.320000000000000000e+02,1.499154000000000000e+06
4.330000000000000000e+02,1.001172000000000000e+06
4.340000000000000000e+02,1.167442000000000000e+06
4.350000000000000000e+02,6.790210000000000000e+05
4.360000000000000000e+02,9.437860000000000000e+05
4.370000000000000000e+02,2.137348000000000000e+06
4.380000000000000000e+02,1.782936000000000000e+06
4.390000000000000000e+02,2.785560000000000000e+06
4.400000000000000000e+02,2.560073000000000000e+06
4.410000000000000000e+02,1.730340000000000000e+06
4.420000000000000000e+02,2.559165000000000000e+06
4.430000000000000000e+02,0.000000000000000000e+00
4.440000000000000000e+02,1.950993000000000000e+06
4.450000000000000000e+02,5.813662000000000000e+06
4.460000000000000000e+02,9.843940000000000000e+05
4.470000000000000000e+02,1.560099000000000000e+06
4.480000000000000000e+02,2.670200000000000000e+06
4.490000000000000000e+02,1.181793000000000000e+06
4.500000000000000000e+02,1.446238000000000000e+06
4.510000000000000000e+02,1.752445000000000000e+06
4.520000000000000000e+02,1.723109000000000000e+06
4.530000000000000000e+02,3.499540000000000000e+06
4.540000000000000000e+02,3.485526000000000000e+06
4.550000000000000000e+02,0.000000000000000000e+00
4.560000000000000000e+02,6.308030000000000000e+05
4.570000000000000000e+02,1.423080000000000000e+06
4.580000000000000000e+02,1.827450000000000000e+06
4.590000000000000000e+02,2.120526000000000000e+06
4.600000000000000000e+02,1.264522000000000000e+06
4.610000000000000000e+02,3.502609000000000000e+06
4.620000000000000000e+02,2.583105000000000000e+06
4.630000000000000000e+02,1.649905000000000000e+06
4.640000000000000000e+02,0.000000000000000000e+00
4.650000000000000000e+02,1.960546000000000000e+06
4.660000000000000000e+02,2.122566000000000000e+06
4.670000000000000000e+02,1.589859000000000000e+06
4.680000000000000000e+02,9.450400000000000000e+05
4.690000000000000000e+02,2.221376000000000000e+06
4.700000000000000000e+02,2.016282000000000000e+06
4.710000000000000000e+02,1.770326000000000000e+06
4.720000000000000000e+02,0.000000000000000000e+00
4.730000000000000000e+02,2.160618000000000000e+06
4.740000000000000000e+02,3.393065000000000000e+06
4.750000000000000000e+02,1.152653000000000000e+06
4.760000000000000000e+02,1.029532000000000000e+06
4.770000000000000000e+02,8.653300000000000000e+05
4.780000000000000000e+02,2.030421000000000000e+06
4.790000000000000000e+02,1.871790000000000000e+06
4.800000000000000000e+02,2.662093000000000000e+06
4.810000000000000000e+02,9.365600000000000000e+05
4.820000000000000000e+02,1.973547000000000000e+06
4.830000000000000000e+02,1.889944000000000000e+06
4.840000000000000000e+02,2.337676000000000000e+06
4.850000000000000000e+02,0.000000000000000000e+00
4.860000000000000000e+02,0.000000000000000000e+00
4.870000000000000000e+02,7.140210000000000000e+05
4.880000000000000000e+02,8.412110000000000000e+05
4.890000000000000000e+02,8.493020000000000000e+05
4.900000000000000000e+02,1.028554000000000000e+06
4.910000000000000000e+02,5.788430000000000000e+05
4.920000000000000000e+02,4.357610000000000000e+05
4.930000000000000000e+02,1.326924000000000000e+06
4.940000000000000000e+02,1.170520000000000000e+06
4.950000000000000000e+02,6.861690000000000000e+05
4.960000000000000000e+02,8.167790000000000000e+05
4.970000000000000000e+02,1.380352000000000000e+06
4.980000000000000000e+02,0.000000000000000000e+00
4.990000000000000000e+02,6.777220000000000000e+05
5.000000000000000000e+02,7.511730000000000000e+05
5.010000000000000000e+02,6.717560000000000000e+05
5.020000000000000000e+02,4.477940000000000000e+05
5.030000000000000000e+02,9.027890000000000000e+05
5.040000000000000000e+02,0.000000000000000000e+00
5.050000000000000000e+02,2.682720000000000000e+05
5.060000000000000000e+02,6.405690000000000000e+05
5.070000000000000000e+02,2.728250000000000000e+05
5.080000000000000000e+02,9.608650000000000000e+05
5.090000000000000000e+02,1.205818000000000000e+06
5.100000000000000000e+02,3.408710000000000000e+05
5.110000000000000000e+02,2.774190000000000000e+05
5.120000000000000000e+02,2.994570000000000000e+05
5.130000000000000000e+02,4.781920000000000000e+05
5.140000000000000000e+02,2.363230000000000000e+05
5.150000000000000000e+02,7.560460000000000000e+05
5.160000000000000000e+02,8.416850000000000000e+05
5.170000000000000000e+02,4.941190000000000000e+05
5.180000000000000000e+02,7.478130000000000000e+05
5.190000000000000000e+02,6.956480000000000000e+05
5.200000000000000000e+02,5.043790000000000000e+05
5.210000000000000000e+02,6.704370000000000000e+05
5.220000000000000000e+02,8.750530000000000000e+05
5.230000000000000000e+02,1.255535000000000000e+06
5.240000000000000000e+02,6.409730000000000000e+05
5.250000000000000000e+02,0.000000000000000000e+00
5.260000000000000000e+02,0.000000000000000000e+00
5.270000000000000000e+02,2.221558000000000000e+06
5.280000000000000000e+02,7.149320000000000000e+05
5.290000000000000000e+02,9.262200000000000000e+05
5.300000000000000000e+02,1.358396000000000000e+06
5.310000000000000000e+02,1.036140000000000000e+06
5.320000000000000000e+02,6.582950000000000000e+05
5.330000000000000000e+02,0.000000000000000000e+00
5.340000000000000000e+02,0.000000000000000000e+00
5.350000000000000000e+02,3.048190000000000000e+06
5.360000000000000000e+02,1.868834000000000000e+06
5.370000000000000000e+02,1.712530000000000000e+06
5.380000000000000000e+02,1.502641000000000000e+06
5.390000000000000000e+02,1.509032000000000000e+06
5.400000000000000000e+02,0.000000000000000000e+00
5.410000000000000000e+02,1.558756000000000000e+06
5.420000000000000000e+02,2.363386000000000000e+06
5.430000000000000000e+02,2.115882000000000000e+06
5.440000000000000000e+02,1.672299000000000000e+06
5.450000000000000000e+02,2.244546000000000000e+06
5.460000000000000000e+02,0.000000000000000000e+00
5.470000000000000000e+02,3.299292000000000000e+06
5.480000000000000000e+02,1.643640000000000000e+06
5.490000000000000000e+02,1.256426000000000000e+06
5.500000000000000000e+02,0.000000000000000000e+00
5.510000000000000000e+02,0.000000000000000000e+00
5.520000000000000000e+02,5.561520000000000000e+05
5.530000000000000000e+02,1.417032000000000000e+06
5.540000000000000000e+02,1.466921000000000000e+06
5.550000000000000000e+02,5.922370000000000000e+05
5.560000000000000000e+02,1.119372000000000000e+06
5.570000000000000000e+02,6.162450000000000000e+05
5.580000000000000000e+02,1.164778000000000000e+06
5.590000000000000000e+02,1.217513000000000000e+06
5.600000000000000000e+02,1.475033000000000000e+06
5.610000000000000000e+02,9.925210000000000000e+05
5.620000000000000000e+02,1.253427000000000000e+06
5.630000000000000000e+02,1.334184000000000000e+06
5.640000000000000000e+02,7.847960000000000000e+05
5.650000000000000000e+02,8.925670000000000000e+05
5.660000000000000000e+02,0.000000000000000000e+00
5.670000000000000000e+02,0.000000000000000000e+00
5.680000000000000000e+02,5.565770000000000000e+05
5.690000000000000000e+02,1.485709000000000000e+06
5.700000000000000000e+02,1.300031000000000000e+06
5.710000000000000000e+02,4.882460000000000000e+05
5.720000000000000000e+02,9.158120000000000000e+05
5.730000000000000000e+02,1.140553000000000000e+06
5.740000000000000000e+02,1.111734000000000000e+06
5.750000000000000000e+02,1.261202000000000000e+06
5.760000000000000000e+02,1.822578000000000000e+06
5.770000000000000000e+02,7.937780000000000000e+05
5.780000000000000000e+02,1.731325000000000000e+06
5.790000000000000000e+02,1.276044000000000000e+06
5.800000000000000000e+02,1.602842000000000000e+06
5.810000000000000000e+02,8.634860000000000000e+05
5.820000000000000000e+02,1.435811000000000000e+06
5.830000000000000000e+02,0.000000000000000000e+00
5.840000000000000000e+02,0.000000000000000000e+00
5.850000000000000000e+02,1.222828000000000000e+06
5.860000000000000000e+02,5.782080000000000000e+05
5.870000000000000000e+02,6.252420000000000000e+05
5.880000000000000000e+02,2.336560000000000000e+05
5.890000000000000000e+02,3.834840000000000000e+05
5.900000000000000000e+02,6.074750000000000000e+05
5.910000000000000000e+02,5.659110000000000000e+05
5.920000000000000000e+02,6.469550000000000000e+05
5.930000000000000000e+02,4.923490000000000000e+05
5.940000000000000000e+02,8.256760000000000000e+05
5.950000000000000000e+02,8.643820000000000000e+05
5.960000000000000000e+02,4.308420000000000000e+05
5.970000000000000000e+02,4.122570000000000000e+05
5.980000000000000000e+02,7.264340000000000000e+05
5.990000000000000000e+02,5.165540000000000000e+05
6.000000000000000000e+02,4.001170000000000000e+05
6.010000000000000000e+02,7.277360000000000000e+05
6.020000000000000000e+02,5.213070000000000000e+05
6.030000000000000000e+02,5.683930000000000000e+05
6.040000000000000000e+02,6.583910000000000000e+05
6.050000000000000000e+02,5.891740000000000000e+05
6.060000000000000000e+02,2.736490000000000000e+05
6.070000000000000000e+02,7.995380000000000000e+05
6.080000000000000000e+02,0.000000000000000000e+00
6.090000000000000000e+02,0.000000000000000000e+00
6.100000000000000000e+02,0.000000000000000000e+00
6.110000000000000000e+02,0.000000000000000000e+00
6.120000000000000000e+02,0.000000000000000000e+00
6.130000000000000000e+02,0.000000000000000000e+00
6.140000000000000000e+02,4.108481000000000000e+06
6.150000000000000000e+02,1.311100000000000000e+06
6.160000000000000000e+02,1.158686000000000000e+06
6.170000000000000000e+02,9.841550000000000000e+05
6.180000000000000000e+02,2.785527000000000000e+06
6.190000000000000000e+02,0.000000000000000000e+00
6.200000000000000000e+02,0.000000000000000000e+00
6.210000000000000000e+02,0.000000000000000000e+00
6.220000000000000000e+02,0.000000000000000000e+00
6.230000000000000000e+02,0.000000000000000000e+00
6.240000000000000000e+02,0.000000000000000000e+00
6.250000000000000000e+02,2.591918000000000000e+06
6.260000000000000000e+02,1.278675000000000000e+06
6.270000000000000000e+02,2.195950000000000000e+06
6.280000000000000000e+02,0.000000000000000000e+00
6.290000000000000000e+02,6.257388000000000000e+06
6.300000000000000000e+02,2.299866000000000000e+06
6.310000000000000000e+02,1.775367000000000000e+06
6.320000000000000000e+02,2.353734000000000000e+06
6.330000000000000000e+02,3.405110000000000000e+06
6.340000000000000000e+02,0.000000000000000000e+00
6.350000000000000000e+02,0.000000000000000000e+00
6.360000000000000000e+02,0.000000000000000000e+00
6.370000000000000000e+02,0.000000000000000000e+00
6.380000000000000000e+02,0.000000000000000000e+00
6.390000000000000000e+02,0.000000000000000000e+00
6.400000000000000000e+02,2.380218000000000000e+06
6.410000000000000000e+02,2.069782000000000000e+06
6.420000000000000000e+02,3.694660000000000000e+06
6.430000000000000000e+02,2.019994000000000000e+06
6.440000000000000000e+02,2.041476000000000000e+06
6.450000000000000000e+02,7.434250000000000000e+05
6.460000000000000000e+02,1.635171000000000000e+06
6.470000000000000000e+02,0.000000000000000000e+00
6.480000000000000000e+02,0.000000000000000000e+00
6.490000000000000000e+02,5.261960000000000000e+05
6.500000000000000000e+02,2.206090000000000000e+05
6.510000000000000000e+02,2.973880000000000000e+05
6.520000000000000000e+02,0.000000000000000000e+00
6.530000000000000000e+02,6.896000000000000000e+05
6.540000000000000000e+02,6.547430000000000000e+05
6.550000000000000000e+02,0.000000000000000000e+00
6.560000000000000000e+02,1.183891000000000000e+06
6.570000000000000000e+02,4.317240000000000000e+05
6.580000000000000000e+02,3.707990000000000000e+05
6.590000000000000000e+02,6.963640000000000000e+05
6.600000000000000000e+02,0.000000000000000000e+00
6.610000000000000000e+02,0.000000000000000000e+00
6.620000000000000000e+02,8.123530000000000000e+05
6.630000000000000000e+02,5.320520000000000000e+05
6.640000000000000000e+02,5.512230000000000000e+05
6.650000000000000000e+02,5.584120000000000000e+05
6.660000000000000000e+02,8.016490000000000000e+05
6.670000000000000000e+02,0.000000000000000000e+00
6.680000000000000000e+02,6.562910000000000000e+05
6.690000000000000000e+02,5.487671000000000000e+06
6.700000000000000000e+02,4.178210000000000000e+05
6.710000000000000000e+02,6.248400000000000000e+05
6.720000000000000000e+02,7.206160000000000000e+05
6.730000000000000000e+02,8.601590000000000000e+05
6.740000000000000000e+02,1.143871000000000000e+06
6.750000000000000000e+02,0.000000000000000000e+00
6.760000000000000000e+02,1.039631000000000000e+06
6.770000000000000000e+02,2.719380000000000000e+05
6.780000000000000000e+02,3.121290000000000000e+05
6.790000000000000000e+02,0.000000000000000000e+00
6.800000000000000000e+02,5.439010000000000000e+05
6.810000000000000000e+02,2.137250000000000000e+05
6.820000000000000000e+02,1.050927000000000000e+06
6.830000000000000000e+02,0.000000000000000000e+00
6.840000000000000000e+02,0.000000000000000000e+00
6.850000000000000000e+02,1.133566000000000000e+06
6.860000000000000000e+02,1.199825000000000000e+06
6.870000000000000000e+02,9.657670000000000000e+05
6.880000000000000000e+02,0.000000000000000000e+00
6.890000000000000000e+02,1.260880000000000000e+05
6.900000000000000000e+02,6.422820000000000000e+05
6.910000000000000000e+02,1.703810000000000000e+05
6.920000000000000000e+02,1.332960000000000000e+05
6.930000000000000000e+02,0.000000000000000000e+00
6.940000000000000000e+02,8.683590000000000000e+05
6.950000000000000000e+02,1.664458000000000000e+06
6.960000000000000000e+02,6.870100000000000000e+05
6.970000000000000000e+02,0.000000000000000000e+00
6.980000000000000000e+02,5.247170000000000000e+05
6.990000000000000000e+02,1.160360000000000000e+06
7.000000000000000000e+02,1.437870000000000000e+05
7.010000000000000000e+02,7.499760000000000000e+05
7.020000000000000000e+02,2.810490000000000000e+05
7.030000000000000000e+02,0.000000000000000000e+00
7.040000000000000000e+02,1.163381000000000000e+06
7.050000000000000000e+02,7.577570000000000000e+05
7.060000000000000000e+02,1.467205000000000000e+06
7.070000000000000000e+02,0.000000000000000000e+00
7.080000000000000000e+02,0.000000000000000000e+00
7.090000000000000000e+02,0.000000000000000000e+00
7.100000000000000000e+02,0.000000000000000000e+00
7.110000000000000000e+02,0.000000000000000000e+00
7.120000000000000000e+02,0.000000000000000000e+00
7.130000000000000000e+02,2.750986000000000000e+06
7.140000000000000000e+02,9.354590000000000000e+05
7.150000000000000000e+02,9.586270000000000000e+05
7.160000000000000000e+02,2.156072000000000000e+06
7.170000000000000000e+02,0.000000000000000000e+00
7.180000000000000000e+02,2.586061000000000000e+06
7.190000000000000000e+02,0.000000000000000000e+00
7.200000000000000000e+02,1.441044000000000000e+06
7.210000000000000000e+02,0.000000000000000000e+00
7.220000000000000000e+02,0.000000000000000000e+00
7.230000000000000000e+02,8.252780000000000000e+05
7.240000000000000000e+02,1.612654000000000000e+06
7.250000000000000000e+02,2.667859000000000000e+06
7.260000000000000000e+02,0.000000000000000000e+00
7.270000000000000000e+02,1.574542000000000000e+06
7.280000000000000000e+02,0.000000000000000000e+00
7.290000000000000000e+02,8.295070000000000000e+05
7.300000000000000000e+02,0.000000000000000000e+00
7.310000000000000000e+02,6.904740000000000000e+05
7.320000000000000000e+02,4.674130000000000000e+05
7.330000000000000000e+02,2.302139000000000000e+06
7.340000000000000000e+02,0.000000000000000000e+00
7.350000000000000000e+02,0.000000000000000000e+00
7.360000000000000000e+02,1.490526300000000000e+07
7.370000000000000000e+02,0.000000000000000000e+00
7.380000000000000000e+02,0.000000000000000000e+00
7.390000000000000000e+02,5.262510000000000000e+05
7.400000000000000000e+02,1.093127000000000000e+06
7.410000000000000000e+02,1.441944000000000000e+06
7.420000000000000000e+02,4.857270000000000000e+05
7.430000000000000000e+02,9.094310000000000000e+05
7.440000000000000000e+02,4.572340000000000000e+05
7.450000000000000000e+02,2.816610000000000000e+05
7.460000000000000000e+02,1.371170000000000000e+06
7.470000000000000000e+02,5.312320000000000000e+05
7.480000000000000000e+02,0.000000000000000000e+00
7.490000000000000000e+02,1.021476000000000000e+06
7.500000000000000000e+02,1.308759000000000000e+06
7.510000000000000000e+02,6.279010000000000000e+05
7.520000000000000000e+02,7.122430000000000000e+05
7.530000000000000000e+02,1.700435000000000000e+06
7.540000000000000000e+02,0.000000000000000000e+00
7.550000000000000000e+02,1.571562000000000000e+06
7.560000000000000000e+02,1.000109000000000000e+06
7.570000000000000000e+02,0.000000000000000000e+00
7.580000000000000000e+02,0.000000000000000000e+00
7.590000000000000000e+02,1.284235000000000000e+07
7.600000000000000000e+02,1.936047000000000000e+06
7.610000000000000000e+02,1.245134000000000000e+06
7.620000000000000000e+02,1.946144000000000000e+06
7.630000000000000000e+02,0.000000000000000000e+00
7.640000000000000000e+02,4.124696000000000000e+06
7.650000000000000000e+02,1.513811000000000000e+06
7.660000000000000000e+02,5.884036000000000000e+06
7.670000000000000000e+02,0.000000000000000000e+00
7.680000000000000000e+02,2.229230000000000000e+05
7.690000000000000000e+02,1.922196000000000000e+06
7.700000000000000000e+02,2.059230000000000000e+05
7.710000000000000000e+02,0.000000000000000000e+00
7.720000000000000000e+02,0.000000000000000000e+00
7.730000000000000000e+02,1.555684000000000000e+06
7.740000000000000000e+02,2.321320000000000000e+06
7.750000000000000000e+02,1.632935000000000000e+06
7.760000000000000000e+02,2.308128000000000000e+06
7.770000000000000000e+02,1.054009000000000000e+06
7.780000000000000000e+02,1.505123000000000000e+06
7.790000000000000000e+02,3.311674000000000000e+06
7.800000000000000000e+02,3.645706000000000000e+06
7.810000000000000000e+02,0.000000000000000000e+00
7.820000000000000000e+02,2.998402000000000000e+06
7.830000000000000000e+02,0.000000000000000000e+00
7.840000000000000000e+02,1.092030000000000000e+05
7.850000000000000000e+02,0.000000000000000000e+00
7.860000000000000000e+02,1.190640000000000000e+05
7.870000000000000000e+02,0.000000000000000000e+00
7.880000000000000000e+02,0.000000000000000000e+00
7.890000000000000000e+02,2.527900000000000000e+04
7.900000000000000000e+02,1.585900000000000000e+05
7.910000000000000000e+02,1.850391000000000000e+06
7.920000000000000000e+02,5.179000000000000000e+04
7.930000000000000000e+02,1.956130000000000000e+05
7.940000000000000000e+02,3.179020000000000000e+05
7.950000000000000000e+02,1.975780000000000000e+06
7.960000000000000000e+02,0.000000000000000000e+00
7.970000000000000000e+02,0.000000000000000000e+00
7.980000000000000000e+02,0.000000000000000000e+00
7.990000000000000000e+02,0.000000000000000000e+00
8.000000000000000000e+02,0.000000000000000000e+00
8.010000000000000000e+02,0.000000000000000000e+00
8.020000000000000000e+02,1.397856300000000000e+07
8.030000000000000000e+02,6.891034000000000000e+06
8.040000000000000000e+02,7.474064000000000000e+06
8.050000000000000000e+02,6.446937000000000000e+06
8.060000000000000000e+02,8.566605000000000000e+06
8.070000000000000000e+02,7.247286000000000000e+06
8.080000000000000000e+02,6.858372000000000000e+06
8.090000000000000000e+02,5.893916000000000000e+06
8.100000000000000000e+02,0.000000000000000000e+00
8.110000000000000000e+02,0.000000000000000000e+00
8.120000000000000000e+02,1.863401000000000000e+06
8.130000000000000000e+02,1.878064000000000000e+06
8.140000000000000000e+02,3.488557000000000000e+06
8.150000000000000000e+02,1.286456000000000000e+06
8.160000000000000000e+02,0.000000000000000000e+00
8.170000000000000000e+02,3.334967000000000000e+06
8.180000000000000000e+02,4.490068000000000000e+06
8.190000000000000000e+02,3.567699000000000000e+06
8.200000000000000000e+02,0.000000000000000000e+00
8.210000000000000000e+02,3.343006000000000000e+06
8.220000000000000000e+02,7.484726000000000000e+06
8.230000000000000000e+02,0.000000000000000000e+00
8.240000000000000000e+02,2.061358000000000000e+06
8.250000000000000000e+02,2.582950000000000000e+06
8.260000000000000000e+02,1.554809000000000000e+06
8.270000000000000000e+02,3.430423000000000000e+06
8.280000000000000000e+02,2.074277000000000000e+06
8.290000000000000000e+02,3.963093000000000000e+06
8.300000000000000000e+02,0.000000000000000000e+00
8.310000000000000000e+02,4.221700000000000000e+06
8.320000000000000000e+02,3.081885000000000000e+06
8.330000000000000000e+02,1.979144000000000000e+06
8.340000000000000000e+02,0.000000000000000000e+00
8.350000000000000000e+02,3.403046000000000000e+06
8.360000000000000000e+02,1.610210000000000000e+06
8.370000000000000000e+02,3.573228000000000000e+06
8.380000000000000000e+02,2.193985000000000000e+06
8.390000000000000000e+02,0.000000000000000000e+00
8.400000000000000000e+02,0.000000000000000000e+00
8.410000000000000000e+02,1.493046100000000000e+07
8.420000000000000000e+02,8.576163000000000000e+06
8.430000000000000000e+02,0.000000000000000000e+00
8.440000000000000000e+02,0.000000000000000000e+00
8.450000000000000000e+02,4.535517000000000000e+06
8.460000000000000000e+02,1.261023000000000000e+06
8.470000000000000000e+02,6.198208000000000000e+06
8.480000000000000000e+02,2.580023000000000000e+06
8.490000000000000000e+02,0.000000000000000000e+00
8.500000000000000000e+02,6.107119000000000000e+06
8.510000000000000000e+02,4.475631000000000000e+06
8.520000000000000000e+02,0.000000000000000000e+00
8.530000000000000000e+02,3.402646000000000000e+06
8.540000000000000000e+02,1.629948000000000000e+06
8.550000000000000000e+02,1.507512000000000000e+06
8.560000000000000000e+02,8.817070000000000000e+05
8.570000000000000000e+02,0.000000000000000000e+00
8.580000000000000000e+02,0.000000000000000000e+00
8.590000000000000000e+02,7.125133000000000000e+06
8.600000000000000000e+02,4.272962000000000000e+06
8.610000000000000000e+02,1.815045000000000000e+06
8.620000000000000000e+02,3.376880000000000000e+06
8.630000000000000000e+02,3.689048000000000000e+06
8.640000000000000000e+02,0.000000000000000000e+00
8.650000000000000000e+02,3.822735000000000000e+06
8.660000000000000000e+02,5.494265000000000000e+06
8.670000000000000000e+02,5.389486000000000000e+06
8.680000000000000000e+02,4.203806000000000000e+06
8.690000000000000000e+02,0.000000000000000000e+00
8.700000000000000000e+02,2.123334000000000000e+06
8.710000000000000000e+02,3.730304000000000000e+06
8.720000000000000000e+02,2.244726000000000000e+06
8.730000000000000000e+02,2.593012000000000000e+06
8.740000000000000000e+02,0.000000000000000000e+00
8.750000000000000000e+02,0.000000000000000000e+00
8.760000000000000000e+02,2.583101000000000000e+06
8.770000000000000000e+02,7.836603000000000000e+06
8.780000000000000000e+02,2.089678000000000000e+06
8.790000000000000000e+02,1.882482000000000000e+06
8.800000000000000000e+02,3.471372000000000000e+06
8.810000000000000000e+02,0.000000000000000000e+00
8.820000000000000000e+02,1.172189000000000000e+06
8.830000000000000000e+02,2.014813000000000000e+06
8.840000000000000000e+02,6.504125000000000000e+06
8.850000000000000000e+02,1.119156000000000000e+06
8.860000000000000000e+02,1.192298000000000000e+06
8.870000000000000000e+02,1.545900000000000000e+06
8.880000000000000000e+02,2.087613000000000000e+06
8.890000000000000000e+02,1.301194000000000000e+06
8.900000000000000000e+02,0.000000000000000000e+00
8.910000000000000000e+02,1.748196000000000000e+06
8.920000000000000000e+02,9.596220000000000000e+05
8.930000000000000000e+02,2.416532000000000000e+06
8.940000000000000000e+02,0.000000000000000000e+00
8.950000000000000000e+02,0.000000000000000000e+00
8.960000000000000000e+02,3.253516000000000000e+06
8.970000000000000000e+02,2.207216000000000000e+06
8.980000000000000000e+02,2.847291000000000000e+06
8.990000000000000000e+02,6.942335000000000000e+06
9.000000000000000000e+02,4.244524000000000000e+06
9.010000000000000000e+02,9.026950000000000000e+06
9.020000000000000000e+02,3.194711000000000000e+06
9.030000000000000000e+02,5.429666000000000000e+06
9.040000000000000000e+02,0.000000000000000000e+00
9.050000000000000000e+02,2.413460000000000000e+06
9.060000000000000000e+02,1.285595000000000000e+06
9.070000000000000000e+02,1.672702000000000000e+06
9.080000000000000000e+02,4.438213000000000000e+06
9.090000000000000000e+02,0.000000000000000000e+00
9.100000000000000000e+02,0.000000000000000000e+00
9.110000000000000000e+02,2.066891000000000000e+06
9.120000000000000000e+02,3.704621000000000000e+06
9.130000000000000000e+02,5.378040000000000000e+06
9.140000000000000000e+02,7.126980000000000000e+05
9.150000000000000000e+02,3.377035000000000000e+06
9.160000000000000000e+02,0.000000000000000000e+00
9.170000000000000000e+02,1.378382000000000000e+06
9.180000000000000000e+02,1.270880000000000000e+06
9.190000000000000000e+02,6.893698000000000000e+06
9.200000000000000000e+02,9.815816000000000000e+06
9.210000000000000000e+02,5.468979000000000000e+06
9.220000000000000000e+02,3.171880000000000000e+06
9.230000000000000000e+02,0.000000000000000000e+00
9.240000000000000000e+02,5.766190000000000000e+05
9.250000000000000000e+02,8.394370000000000000e+05
9.260000000000000000e+02,0.000000000000000000e+00
9.270000000000000000e+02,0.000000000000000000e+00
9.280000000000000000e+02,0.000000000000000000e+00
9.290000000000000000e+02,0.000000000000000000e+00
9.300000000000000000e+02,0.000000000000000000e+00
9.310000000000000000e+02,0.000000000000000000e+00
9.320000000000000000e+02,0.000000000000000000e+00
9.330000000000000000e+02,0.000000000000000000e+00
9.340000000000000000e+02,0.000000000000000000e+00
9.350000000000000000e+02,0.000000000000000000e+00
9.360000000000000000e+02,0.000000000000000000e+00
9.370000000000000000e+02,0.000000000000000000e+00
9.380000000000000000e+02,0.000000000000000000e+00
9.390000000000000000e+02,0.000000000000000000e+00
9.400000000000000000e+02,0.000000000000000000e+00
9.410000000000000000e+02,0.000000000000000000e+00
9.420000000000000000e+02,0.000000000000000000e+00
9.430000000000000000e+02,1.149133000000000000e+06
9.440000000000000000e+02,2.854000000000000000e+05
9.450000000000000000e+02,7.018290000000000000e+05
9.460000000000000000e+02,4.649500000000000000e+05
9.470000000000000000e+02,1.362226000000000000e+06
9.480000000000000000e+02,8.064530000000000000e+05
9.490000000000000000e+02,3.604490000000000000e+05
9.500000000000000000e+02,0.000000000000000000e+00
9.510000000000000000e+02,2.956137000000000000e+06
9.520000000000000000e+02,8.954030000000000000e+05
9.530000000000000000e+02,3.925800000000000000e+05
9.540000000000000000e+02,5.064460000000000000e+05
9.550000000000000000e+02,3.424970000000000000e+05
9.560000000000000000e+02,2.945760000000000000e+05
9.570000000000000000e+02,3.545360000000000000e+05
9.580000000000000000e+02,2.338800000000000000e+05
9.590000000000000000e+02,2.197420000000000000e+05
9.600000000000000000e+02,4.013020000000000000e+05
9.610000000000000000e+02,9.139440000000000000e+05
9.620000000000000000e+02,4.783700000000000000e+05
9.630000000000000000e+02,4.247980000000000000e+05
9.640000000000000000e+02,5.659930000000000000e+05
9.650000000000000000e+02,0.000000000000000000e+00
9.660000000000000000e+02,0.000000000000000000e+00
9.670000000000000000e+02,0.000000000000000000e+00
9.680000000000000000e+02,0.000000000000000000e+00
9.690000000000000000e+02,0.000000000000000000e+00
9.700000000000000000e+02,0.000000000000000000e+00
9.710000000000000000e+02,1.408786000000000000e+07
9.720000000000000000e+02,1.156253000000000000e+06
9.730000000000000000e+02,1.311648000000000000e+06
9.740000000000000000e+02,1.260341000000000000e+06
9.750000000000000000e+02,2.183049000000000000e+06
9.760000000000000000e+02,3.551152000000000000e+06
9.770000000000000000e+02,1.317549000000000000e+06
9.780000000000000000e+02,2.640294000000000000e+06
9.790000000000000000e+02,0.000000000000000000e+00
9.800000000000000000e+02,9.608760000000000000e+05
9.810000000000000000e+02,0.000000000000000000e+00
9.820000000000000000e+02,1.043693000000000000e+06
9.830000000000000000e+02,1.574407000000000000e+06
9.840000000000000000e+02,5.502717000000000000e+06
9.850000000000000000e+02,1.086364000000000000e+06
9.860000000000000000e+02,0.000000000000000000e+00
9.870000000000000000e+02,5.206092000000000000e+06
9.880000000000000000e+02,3.641195000000000000e+06
9.890000000000000000e+02,2.036077000000000000e+06
9.900000000000000000e+02,1.845197000000000000e+06
9.910000000000000000e+02,7.603343000000000000e+06
9.920000000000000000e+02,7.632915000000000000e+06
9.930000000000000000e+02,3.112444000000000000e+06
9.940000000000000000e+02,1.182522000000000000e+06
9.950000000000000000e+02,2.067502000000000000e+06
9.960000000000000000e+02,2.410080000000000000e+06
9.970000000000000000e+02,1.716846400000000000e+07
9.980000000000000000e+02,4.411840000000000000e+06
9.990000000000000000e+02,0.000000000000000000e+00
1.000000000000000000e+03,0.000000000000000000e+00
1.001000000000000000e+03,1.919247000000000000e+06
1.002000000000000000e+03,1.687274000000000000e+06
1.003000000000000000e+03,1.568670000000000000e+06
1.004000000000000000e+03,1.904206000000000000e+06
1.005000000000000000e+03,0.000000000000000000e+00
1.006000000000000000e+03,5.165590000000000000e+05
1.007000000000000000e+03,1.221696000000000000e+06
1.008000000000000000e+03,0.000000000000000000e+00
1.009000000000000000e+03,3.673595000000000000e+06
1.010000000000000000e+03,1.460180000000000000e+06
1.011000000000000000e+03,1.145639000000000000e+07
1.012000000000000000e+03,2.419707000000000000e+06
1.013000000000000000e+03,4.825142000000000000e+06
1.014000000000000000e+03,0.000000000000000000e+00
1.015000000000000000e+03,2.712574000000000000e+06
1.016000000000000000e+03,1.790667000000000000e+06
1.017000000000000000e+03,3.553447000000000000e+06
1.018000000000000000e+03,2.773921000000000000e+06
1.019000000000000000e+03,5.616614000000000000e+06
1.020000000000000000e+03,1.604294000000000000e+06
1.021000000000000000e+03,0.000000000000000000e+00
1.022000000000000000e+03,1.992550000000000000e+06
1.023000000000000000e+03,7.317970000000000000e+05
1.024000000000000000e+03,0.000000000000000000e+00
1.025000000000000000e+03,2.910712000000000000e+06
1.026000000000000000e+03,6.286400000000000000e+05
1.027000000000000000e+03,1.463807000000000000e+06
1.028000000000000000e+03,7.897670000000000000e+05
1.029000000000000000e+03,2.742296000000000000e+06
1.030000000000000000e+03,0.000000000000000000e+00
1.031000000000000000e+03,0.000000000000000000e+00
1.032000000000000000e+03,1.577091000000000000e+06
1.033000000000000000e+03,5.944230000000000000e+06
1.034000000000000000e+03,3.131224000000000000e+06
1.035000000000000000e+03,2.403152000000000000e+06
1.036000000000000000e+03,1.199655000000000000e+06
1.037000000000000000e+03,8.280060000000000000e+05
1.038000000000000000e+03,3.817793000000000000e+06
1.039000000000000000e+03,1.502901000000000000e+06
1.040000000000000000e+03,1.657162000000000000e+06
1.041000000000000000e+03,0.000000000000000000e+00
1.042000000000000000e+03,1.534945000000000000e+06
1.043000000000000000e+03,7.754570000000000000e+05
1.044000000000000000e+03,2.324186000000000000e+06
1.045000000000000000e+03,8.271590000000000000e+05
1.046000000000000000e+03,6.927110000000000000e+05
1.047000000000000000e+03,2.518470000000000000e+05
1.048000000000000000e+03,4.247950000000000000e+05
1.049000000000000000e+03,5.328590000000000000e+05
1.050000000000000000e+03,0.000000000000000000e+00
1.051000000000000000e+03,0.000000000000000000e+00
1.052000000000000000e+03,3.943020000000000000e+06
1.053000000000000000e+03,0.000000000000000000e+00
1.054000000000000000e+03,3.919938000000000000e+06
1.055000000000000000e+03,0.000000000000000000e+00
1.056000000000000000e+03,5.637455000000000000e+06
1.057000000000000000e+03,5.381063000000000000e+06
1.058000000000000000e+03,2.026930000000000000e+06
1.059000000000000000e+03,5.734540000000000000e+06
1.060000000000000000e+03,5.092524000000000000e+06
1.061000000000000000e+03,5.736408000000000000e+06
1.062000000000000000e+03,1.535868000000000000e+06
1.063000000000000000e+03,0.000000000000000000e+00
1.064000000000000000e+03,2.257290000000000000e+06
1.065000000000000000e+03,3.835109000000000000e+06
1.066000000000000000e+03,8.619390000000000000e+05
1.067000000000000000e+03,1.557034000000000000e+06
1.068000000000000000e+03,0.000000000000000000e+00
1.069000000000000000e+03,2.007557000000000000e+06
1.070000000000000000e+03,3.119817000000000000e+06
1.071000000000000000e+03,3.209012000000000000e+06
1.072000000000000000e+03,4.300896000000000000e+06
1.073000000000000000e+03,6.298846000000000000e+06
1.074000000000000000e+03,2.270252000000000000e+06
1.075000000000000000e+03,2.411502000000000000e+06
1.076000000000000000e+03,2.290124000000000000e+06
1.077000000000000000e+03,1.910168000000000000e+06
1.078000000000000000e+03,0.000000000000000000e+00
1.079000000000000000e+03,0.000000000000000000e+00
1.080000000000000000e+03,1.285411000000000000e+06
1.081000000000000000e+03,2.345766000000000000e+06
1.082000000000000000e+03,1.714416000000000000e+06
1.083000000000000000e+03,5.786882000000000000e+06
1.084000000000000000e+03,1.335263000000000000e+06
1.085000000000000000e+03,1.857446000000000000e+06
1.086000000000000000e+03,2.290888000000000000e+06
1.087000000000000000e+03,2.184240000000000000e+06
1.088000000000000000e+03,1.566049000000000000e+06
1.089000000000000000e+03,1.191878000000000000e+06
1.090000000000000000e+03,0.000000000000000000e+00
1.091000000000000000e+03,3.809379000000000000e+06
1.092000000000000000e+03,1.340764000000000000e+06
1.093000000000000000e+03,0.000000000000000000e+00
1.094000000000000000e+03,2.220216000000000000e+06
1.095000000000000000e+03,2.842749000000000000e+06
1.096000000000000000e+03,1.901820000000000000e+06
1.097000000000000000e+03,1.417516000000000000e+06
1.098000000000000000e+03,9.584440000000000000e+05
1.099000000000000000e+03,0.000000000000000000e+00
1.100000000000000000e+03,1.748255000000000000e+06
1.101000000000000000e+03,1.002071000000000000e+06
1.102000000000000000e+03,1.928432800000000000e+07
1.103000000000000000e+03,2.302574000000000000e+06
1.104000000000000000e+03,2.602641000000000000e+06
1.105000000000000000e+03,0.000000000000000000e+00
1.106000000000000000e+03,0.000000000000000000e+00
1.107000000000000000e+03,0.000000000000000000e+00
1.108000000000000000e+03,0.000000000000000000e+00
1.109000000000000000e+03,0.000000000000000000e+00
1.110000000000000000e+03,0.000000000000000000e+00
1.111000000000000000e+03,1.910204000000000000e+06
1.112000000000000000e+03,0.000000000000000000e+00
1.113000000000000000e+03,0.000000000000000000e+00
1.114000000000000000e+03,0.000000000000000000e+00
1.115000000000000000e+03,0.000000000000000000e+00
1.116000000000000000e+03,0.000000000000000000e+00
1.117000000000000000e+03,0.000000000000000000e+00
1.118000000000000000e+03,1.739775000000000000e+06
1.119000000000000000e+03,2.083568000000000000e+06
1.120000000000000000e+03,3.441192000000000000e+06
1.121000000000000000e+03,2.679452000000000000e+06
1.122000000000000000e+03,1.546902000000000000e+06
1.123000000000000000e+03,1.664143000000000000e+06
1.124000000000000000e+03,0.000000000000000000e+00
1.125000000000000000e+03,0.000000000000000000e+00
1.126000000000000000e+03,0.000000000000000000e+00
1.127000000000000000e+03,0.000000000000000000e+00
1.128000000000000000e+03,0.000000000000000000e+00
1.129000000000000000e+03,0.000000000000000000e+00
1.130000000000000000e+03,7.162880000000000000e+05
1.131000000000000000e+03,2.674172000000000000e+06
1.132000000000000000e+03,1.411338000000000000e+06
1.133000000000000000e+03,7.318370000000000000e+05
1.134000000000000000e+03,1.194500000000000000e+06
1.135000000000000000e+03,1.390788000000000000e+06
1.136000000000000000e+03,5.110210000000000000e+05
1.137000000000000000e+03,6.913980000000000000e+05
1.138000000000000000e+03,7.553120000000000000e+05
1.139000000000000000e+03,3.458550000000000000e+06
1.140000000000000000e+03,0.000000000000000000e+00
1.141000000000000000e+03,0.000000000000000000e+00
1.142000000000000000e+03,0.000000000000000000e+00
1.143000000000000000e+03,0.000000000000000000e+00
1.144000000000000000e+03,0.000000000000000000e+00
1.145000000000000000e+03,0.000000000000000000e+00
1.146000000000000000e+03,4.779316000000000000e+06
1.147000000000000000e+03,0.000000000000000000e+00
1.148000000000000000e+03,0.000000000000000000e+00
1.149000000000000000e+03,0.000000000000000000e+00
1.150000000000000000e+03,0.000000000000000000e+00
1.151000000000000000e+03,0.000000000000000000e+00
1.152000000000000000e+03,0.000000000000000000e+00
1.153000000000000000e+03,9.188654000000000000e+06
1.154000000000000000e+03,6.318118000000000000e+06
1.155000000000000000e+03,0.000000000000000000e+00
1.156000000000000000e+03,0.000000000000000000e+00
1.157000000000000000e+03,2.099828000000000000e+06
1.158000000000000000e+03,1.547669000000000000e+06
1.159000000000000000e+03,1.862326000000000000e+06
1.160000000000000000e+03,0.000000000000000000e+00
1.161000000000000000e+03,2.383546000000000000e+06
1.162000000000000000e+03,1.409631000000000000e+06
1.163000000000000000e+03,1.507920000000000000e+06
1.164000000000000000e+03,0.000000000000000000e+00
1.165000000000000000e+03,1.910260000000000000e+06
1.166000000000000000e+03,1.662984000000000000e+06
1.167000000000000000e+03,1.279179000000000000e+06
1.168000000000000000e+03,0.000000000000000000e+00
1.169000000000000000e+03,0.000000000000000000e+00
1.170000000000000000e+03,3.442155000000000000e+06
1.171000000000000000e+03,1.709275000000000000e+06
1.172000000000000000e+03,1.076134000000000000e+06
1.173000000000000000e+03,0.000000000000000000e+00
1.174000000000000000e+03,2.679329000000000000e+06
1.175000000000000000e+03,2.013130000000000000e+06
1.176000000000000000e+03,2.813785000000000000e+06
1.177000000000000000e+03,0.000000000000000000e+00
1.178000000000000000e+03,2.878551000000000000e+06
1.179000000000000000e+03,2.033766000000000000e+06
1.180000000000000000e+03,2.212387000000000000e+06
1.181000000000000000e+03,0.000000000000000000e+00
1.182000000000000000e+03,0.000000000000000000e+00
1.183000000000000000e+03,0.000000000000000000e+00
1.184000000000000000e+03,0.000000000000000000e+00
1.185000000000000000e+03,0.000000000000000000e+00
1.186000000000000000e+03,0.000000000000000000e+00
1.187000000000000000e+03,6.573550000000000000e+05
1.188000000000000000e+03,6.357200000000000000e+04
1.189000000000000000e+03,0.000000000000000000e+00
1.190000000000000000e+03,0.000000000000000000e+00
1.191000000000000000e+03,0.000000000000000000e+00
1.192000000000000000e+03,0.000000000000000000e+00
1.193000000000000000e+03,0.000000000000000000e+00
1.194000000000000000e+03,0.000000000000000000e+00
1.195000000000000000e+03,9.046430000000000000e+05
1.196000000000000000e+03,3.131610000000000000e+05
1.197000000000000000e+03,2.499982000000000000e+06
1.198000000000000000e+03,0.000000000000000000e+00
1.199000000000000000e+03,2.003494000000000000e+06
1.200000000000000000e+03,6.286510000000000000e+05
1.201000000000000000e+03,1.242320000000000000e+06
1.202000000000000000e+03,0.000000000000000000e+00
1.203000000000000000e+03,1.146521000000000000e+06
1.204000000000000000e+03,1.009500000000000000e+06
1.205000000000000000e+03,7.907840000000000000e+05
1.206000000000000000e+03,0.000000000000000000e+00
1.207000000000000000e+03,0.000000000000000000e+00
1.208000000000000000e+03,2.035527000000000000e+06
1.209000000000000000e+03,8.698200000000000000e+05
1.210000000000000000e+03,3.630527000000000000e+06
1.211000000000000000e+03,0.000000000000000000e+00
1.212000000000000000e+03,3.682351000000000000e+06
1.213000000000000000e+03,1.265358000000000000e+06
1.214000000000000000e+03,2.359100000000000000e+06
1.215000000000000000e+03,4.131285000000000000e+06
1.216000000000000000e+03,0.000000000000000000e+00
1.217000000000000000e+03,1.891447000000000000e+06
1.218000000000000000e+03,0.000000000000000000e+00
1.219000000000000000e+03,0.000000000000000000e+00
1.220000000000000000e+03,7.027454000000000000e+06
1.221000000000000000e+03,0.000000000000000000e+00
1.222000000000000000e+03,2.089266000000000000e+06
1.223000000000000000e+03,1.304106000000000000e+06
1.224000000000000000e+03,1.077839000000000000e+06
1.225000000000000000e+03,1.342818000000000000e+06
1.226000000000000000e+03,8.979910000000000000e+05
1.227000000000000000e+03,7.846955000000000000e+06
1.228000000000000000e+03,1.516371000000000000e+06
1.229000000000000000e+03,0.000000000000000000e+00
1.230000000000000000e+03,4.881332000000000000e+06
1.231000000000000000e+03,1.197089000000000000e+06
1.232000000000000000e+03,2.253406000000000000e+06
1.233000000000000000e+03,1.593734000000000000e+06
1.234000000000000000e+03,8.181112000000000000e+06
1.235000000000000000e+03,2.189564000000000000e+06
1.236000000000000000e+03,0.000000000000000000e+00
1.237000000000000000e+03,6.576780000000000000e+05
1.238000000000000000e+03,1.554945000000000000e+06
1.239000000000000000e+03,0.000000000000000000e+00
1.240000000000000000e+03,0.000000000000000000e+00
1.241000000000000000e+03,3.574031000000000000e+06
1.242000000000000000e+03,2.616618000000000000e+06
1.243000000000000000e+03,3.727492000000000000e+06
1.244000000000000000e+03,4.481360000000000000e+06
1.245000000000000000e+03,0.000000000000000000e+00
1.246000000000000000e+03,1.649288000000000000e+06
1.247000000000000000e+03,1.438588000000000000e+06
1.248000000000000000e+03,3.945796000000000000e+06
1.249000000000000000e+03,0.000000000000000000e+00
1.250000000000000000e+03,0.000000000000000000e+00
1.251000000000000000e+03,0.000000000000000000e+00
1.252000000000000000e+03,0.000000000000000000e+00
1.253000000000000000e+03,0.000000000000000000e+00
1.254000000000000000e+03,0.000000000000000000e+00
1.255000000000000000e+03,3.005060000000000000e+05
1.256000000000000000e+03,1.112189000000000000e+06
1.257000000000000000e+03,7.327410000000000000e+05
1.258000000000000000e+03,0.000000000000000000e+00
1.259000000000000000e+03,1.777387000000000000e+06
1.260000000000000000e+03,2.072854000000000000e+06
1.261000000000000000e+03,1.132286000000000000e+06
1.262000000000000000e+03,1.866410000000000000e+06
1.263000000000000000e+03,1.012343000000000000e+06
1.264000000000000000e+03,2.326012000000000000e+06
1.265000000000000000e+03,2.362073000000000000e+06
1.266000000000000000e+03,0.000000000000000000e+00
1.267000000000000000e+03,1.161810700000000000e+07
1.268000000000000000e+03,0.000000000000000000e+00
1.269000000000000000e+03,0.000000000000000000e+00
1.270000000000000000e+03,2.152022000000000000e+06
1.271000000000000000e+03,1.088511000000000000e+06
1.272000000000000000e+03,1.095480000000000000e+06
1.273000000000000000e+03,0.000000000000000000e+00
1.274000000000000000e+03,2.999854000000000000e+06
1.275000000000000000e+03,6.839550000000000000e+05
1.276000000000000000e+03,1.462512000000000000e+06
1.277000000000000000e+03,1.877785000000000000e+06
1.278000000000000000e+03,1.356326000000000000e+06
1.279000000000000000e+03,8.833330000000000000e+05
1.280000000000000000e+03,0.000000000000000000e+00
1.281000000000000000e+03,0.000000000000000000e+00
1.282000000000000000e+03,2.161386000000000000e+06
1.283000000000000000e+03,4.081416000000000000e+06
1.284000000000000000e+03,1.509404000000000000e+06
1.285000000000000000e+03,1.207732000000000000e+06
1.286000000000000000e+03,1.851989000000000000e+06
1.287000000000000000e+03,0.000000000000000000e+00
1.288000000000000000e+03,1.711100000000000000e+05
1.289000000000000000e+03,1.264587000000000000e+06
1.290000000000000000e+03,2.536595000000000000e+06
1.291000000000000000e+03,0.000000000000000000e+00
1.292000000000000000e+03,2.609460000000000000e+05
1.293000000000000000e+03,2.217835000000000000e+06
1.294000000000000000e+03,3.913970000000000000e+05
1.295000000000000000e+03,7.873940000000000000e+05
1.296000000000000000e+03,1.786524000000000000e+06
1.297000000000000000e+03,0.000000000000000000e+00
1.298000000000000000e+03,7.415880000000000000e+05
1.299000000000000000e+03,2.016555000000000000e+06
1.300000000000000000e+03,0.000000000000000000e+00
1.301000000000000000e+03,0.000000000000000000e+00
1.302000000000000000e+03,0.000000000000000000e+00
1.303000000000000000e+03,0.000000000000000000e+00
1.304000000000000000e+03,0.000000000000000000e+00
1.305000000000000000e+03,0.000000000000000000e+00
1.306000000000000000e+03,3.392450000000000000e+06
1.307000000000000000e+03,2.197358000000000000e+06
1.308000000000000000e+03,3.323478000000000000e+06
1.309000000000000000e+03,2.554469000000000000e+06
1.310000000000000000e+03,1.938679000000000000e+06
1.311000000000000000e+03,0.000000000000000000e+00
1.312000000000000000e+03,8.004948000000000000e+06
1.313000000000000000e+03,3.155370000000000000e+06
1.314000000000000000e+03,4.497691000000000000e+06
1.315000000000000000e+03,4.788400000000000000e+06
1.316000000000000000e+03,1.747084000000000000e+06
1.317000000000000000e+03,1.663109000000000000e+06
1.318000000000000000e+03,1.976248000000000000e+06
1.319000000000000000e+03,1.610891000000000000e+06
1.320000000000000000e+03,0.000000000000000000e+00
1.321000000000000000e+03,0.000000000000000000e+00
1.322000000000000000e+03,3.249594000000000000e+06
1.323000000000000000e+03,4.194908000000000000e+06
1.324000000000000000e+03,2.354184000000000000e+06
1.325000000000000000e+03,2.739536000000000000e+06
1.326000000000000000e+03,1.787239000000000000e+06
1.327000000000000000e+03,2.790385000000000000e+06
1.328000000000000000e+03,0.000000000000000000e+00
1.329000000000000000e+03,2.927029000000000000e+06
1.330000000000000000e+03,4.283058000000000000e+06
1.331000000000000000e+03,3.237382000000000000e+06
1.332000000000000000e+03,2.164596000000000000e+06
1.333000000000000000e+03,2.189958000000000000e+06
1.334000000000000000e+03,3.353512000000000000e+06
1.335000000000000000e+03,3.526868000000000000e+06
1.336000000000000000e+03,1.977848000000000000e+06
1.337000000000000000e+03,0.000000000000000000e+00
1.338000000000000000e+03,0.000000000000000000e+00
1.339000000000000000e+03,1.763835000000000000e+06
1.340000000000000000e+03,3.687013000000000000e+06
1.341000000000000000e+03,3.475415000000000000e+06
1.342000000000000000e+03,2.685427000000000000e+06
1.343000000000000000e+03,0.000000000000000000e+00
1.344000000000000000e+03,2.613107000000000000e+06
1.345000000000000000e+03,1.988931000000000000e+06
1.346000000000000000e+03,3.217995000000000000e+06
1.347000000000000000e+03,2.911145000000000000e+06
1.348000000000000000e+03,0.000000000000000000e+00
1.349000000000000000e+03,3.923394000000000000e+06
1.350000000000000000e+03,2.842505000000000000e+06
1.351000000000000000e+03,0.000000000000000000e+00
1.352000000000000000e+03,2.516698000000000000e+06
1.353000000000000000e+03,2.361801000000000000e+06
1.354000000000000000e+03,1.418090000000000000e+06
1.355000000000000000e+03,0.000000000000000000e+00
1.356000000000000000e+03,0.000000000000000000e+00
1.357000000000000000e+03,2.015592000000000000e+06
1.358000000000000000e+03,3.337877000000000000e+06
1.359000000000000000e+03,2.585568000000000000e+06
1.360000000000000000e+03,3.578722000000000000e+06
1.361000000000000000e+03,2.890254000000000000e+06
1.362000000000000000e+03,3.229307000000000000e+06
1.363000000000000000e+03,0.000000000000000000e+00
1.364000000000000000e+03,1.768794000000000000e+06
1.365000000000000000e+03,1.719207000000000000e+06
1.366000000000000000e+03,2.104037000000000000e+06
1.367000000000000000e+03,2.430532000000000000e+06
1.368000000000000000e+03,0.000000000000000000e+00
1.369000000000000000e+03,1.816238000000000000e+06
1.370000000000000000e+03,3.146564000000000000e+06
1.371000000000000000e+03,0.000000000000000000e+00
1.372000000000000000e+03,0.000000000000000000e+00
1.373000000000000000e+03,2.872349000000000000e+06
1.374000000000000000e+03,3.083966000000000000e+06
1.375000000000000000e+03,2.180489000000000000e+06
1.376000000000000000e+03,3.467619000000000000e+06
1.377000000000000000e+03,3.116765000000000000e+06
1.378000000000000000e+03,0.000000000000000000e+00
1.379000000000000000e+03,2.099122000000000000e+06
1.380000000000000000e+03,3.444153000000000000e+06
1.381000000000000000e+03,0.000000000000000000e+00
1.382000000000000000e+03,0.000000000000000000e+00
1.383000000000000000e+03,3.412115000000000000e+06
1.384000000000000000e+03,1.871481000000000000e+06
1.385000000000000000e+03,1.741722000000000000e+06
1.386000000000000000e+03,9.365720000000000000e+05
1.387000000000000000e+03,1.778834000000000000e+06
1.388000000000000000e+03,0.000000000000000000e+00
1.389000000000000000e+03,2.458551000000000000e+06
1.390000000000000000e+03,2.890491000000000000e+06
1.391000000000000000e+03,1.276303000000000000e+06
1.392000000000000000e+03,0.000000000000000000e+00
1.393000000000000000e+03,3.309154000000000000e+06
1.394000000000000000e+03,2.768631000000000000e+06
1.395000000000000000e+03,1.558499000000000000e+06
1.396000000000000000e+03,1.064708000000000000e+06
1.397000000000000000e+03,1.963577000000000000e+06
1.398000000000000000e+03,0.000000000000000000e+00
1.399000000000000000e+03,0.000000000000000000e+00
1.400000000000000000e+03,0.000000000000000000e+00
1.401000000000000000e+03,0.000000000000000000e+00
1.402000000000000000e+03,0.000000000000000000e+00
1.403000000000000000e+03,0.000000000000000000e+00
1.404000000000000000e+03,3.476180000000000000e+05
1.405000000000000000e+03,5.263260000000000000e+05
1.406000000000000000e+03,5.539580000000000000e+05
1.407000000000000000e+03,2.268492000000000000e+06
1.408000000000000000e+03,1.592380000000000000e+05
1.409000000000000000e+03,5.263940000000000000e+05
1.410000000000000000e+03,3.033350000000000000e+05
1.411000000000000000e+03,2.085780000000000000e+05
1.412000000000000000e+03,0.000000000000000000e+00
1.413000000000000000e+03,5.710630000000000000e+05
1.414000000000000000e+03,0.000000000000000000e+00
1.415000000000000000e+03,4.337160000000000000e+05
1.416000000000000000e+03,4.942730000000000000e+05
1.417000000000000000e+03,6.492820000000000000e+05
1.418000000000000000e+03,3.781350000000000000e+05
1.419000000000000000e+03,3.648780000000000000e+05
1.420000000000000000e+03,1.265150000000000000e+05
1.421000000000000000e+03,3.206450000000000000e+05
1.422000000000000000e+03,3.563020000000000000e+05
1.423000000000000000e+03,0.000000000000000000e+00
1.424000000000000000e+03,3.455043000000000000e+06
1.425000000000000000e+03,0.000000000000000000e+00
1.426000000000000000e+03,1.245410000000000000e+05
1.427000000000000000e+03,1.608590000000000000e+05
1.428000000000000000e+03,2.949060000000000000e+05
1.429000000000000000e+03,1.544140000000000000e+05
1.430000000000000000e+03,2.139180000000000000e+05
1.431000000000000000e+03,0.000000000000000000e+00
1.432000000000000000e+03,0.000000000000000000e+00
1.433000000000000000e+03,2.238890000000000000e+05
1.434000000000000000e+03,0.000000000000000000e+00
1.435000000000000000e+03,0.000000000000000000e+00
1.436000000000000000e+03,1.598340000000000000e+05
1.437000000000000000e+03,0.000000000000000000e+00
1.438000000000000000e+03,0.000000000000000000e+00
1.439000000000000000e+03,0.000000000000000000e+00
1.440000000000000000e+03,0.000000000000000000e+00
1.441000000000000000e+03,0.000000000000000000e+00
1.442000000000000000e+03,0.000000000000000000e+00
1.443000000000000000e+03,1.701025000000000000e+06
1.444000000000000000e+03,8.537370000000000000e+05
1.445000000000000000e+03,2.242828000000000000e+06
1.446000000000000000e+03,1.575343000000000000e+06
1.447000000000000000e+03,1.048085000000000000e+06
1.448000000000000000e+03,6.774980000000000000e+05
1.449000000000000000e+03,0.000000000000000000e+00
1.450000000000000000e+03,1.163339000000000000e+06
1.451000000000000000e+03,1.907341000000000000e+06
1.452000000000000000e+03,6.709830000000000000e+05
1.453000000000000000e+03,1.071188000000000000e+06
1.454000000000000000e+03,1.688965000000000000e+06
1.455000000000000000e+03,1.311462000000000000e+06
1.456000000000000000e+03,0.000000000000000000e+00
1.457000000000000000e+03,0.000000000000000000e+00
1.458000000000000000e+03,1.832119000000000000e+06
1.459000000000000000e+03,1.192666000000000000e+06
1.460000000000000000e+03,2.193336000000000000e+06
1.461000000000000000e+03,1.487326000000000000e+06
1.462000000000000000e+03,2.014244000000000000e+06
1.463000000000000000e+03,1.097776000000000000e+06
1.464000000000000000e+03,0.000000000000000000e+00
1.465000000000000000e+03,8.297430000000000000e+05
1.466000000000000000e+03,1.349012000000000000e+06
1.467000000000000000e+03,1.976635000000000000e+06
1.468000000000000000e+03,1.557998000000000000e+06
1.469000000000000000e+03,6.547700000000000000e+05
1.470000000000000000e+03,1.025171000000000000e+06
1.471000000000000000e+03,0.000000000000000000e+00
1.472000000000000000e+03,0.000000000000000000e+00
1.473000000000000000e+03,1.899828000000000000e+06
1.474000000000000000e+03,7.615030000000000000e+05
1.475000000000000000e+03,1.427835000000000000e+06
1.476000000000000000e+03,7.736820000000000000e+05
1.477000000000000000e+03,7.245910000000000000e+05
1.478000000000000000e+03,2.258054000000000000e+06
1.479000000000000000e+03,1.048200000000000000e+06
1.480000000000000000e+03,0.000000000000000000e+00
1.481000000000000000e+03,5.943682000000000000e+06
1.482000000000000000e+03,1.192112000000000000e+06
1.483000000000000000e+03,0.000000000000000000e+00
1.484000000000000000e+03,0.000000000000000000e+00
1.485000000000000000e+03,1.940322000000000000e+06
1.486000000000000000e+03,1.009359000000000000e+06
1.487000000000000000e+03,7.519190000000000000e+05
1.488000000000000000e+03,1.226952000000000000e+06
1.489000000000000000e+03,1.136076000000000000e+06
1.490000000000000000e+03,0.000000000000000000e+00
1.491000000000000000e+03,1.400942000000000000e+06
1.492000000000000000e+03,1.010146000000000000e+06
1.493000000000000000e+03,1.212270000000000000e+06
1.494000000000000000e+03,2.294512000000000000e+06
1.495000000000000000e+03,0.000000000000000000e+00
1.496000000000000000e+03,0.000000000000000000e+00
1.497000000000000000e+03,0.000000000000000000e+00
1.498000000000000000e+03,0.000000000000000000e+00
1.499000000000000000e+03,0.000000000000000000e+00
1.500000000000000000e+03,0.000000000000000000e+00
1.501000000000000000e+03,6.706330000000000000e+05
1.502000000000000000e+03,1.764925000000000000e+06
1.503000000000000000e+03,4.169780000000000000e+05
1.504000000000000000e+03,1.418870000000000000e+06
1.505000000000000000e+03,2.857160000000000000e+05
1.506000000000000000e+03,4.220240000000000000e+05
1.507000000000000000e+03,7.959460000000000000e+05
1.508000000000000000e+03,3.246990000000000000e+05
1.509000000000000000e+03,0.000000000000000000e+00
1.510000000000000000e+03,2.910500000000000000e+06
1.511000000000000000e+03,1.228036000000000000e+06
1.512000000000000000e+03,7.540390000000000000e+05
1.513000000000000000e+03,5.783680000000000000e+05
1.514000000000000000e+03,0.000000000000000000e+00
1.515000000000000000e+03,0.000000000000000000e+00
1.516000000000000000e+03,0.000000000000000000e+00
1.517000000000000000e+03,0.000000000000000000e+00
1.518000000000000000e+03,0.000000000000000000e+00
1.519000000000000000e+03,0.000000000000000000e+00
1.520000000000000000e+03,2.526394000000000000e+06
1.521000000000000000e+03,0.000000000000000000e+00
1.522000000000000000e+03,2.091131000000000000e+06
1.523000000000000000e+03,2.371845000000000000e+06
1.524000000000000000e+03,2.680343000000000000e+06
1.525000000000000000e+03,0.000000000000000000e+00
1.526000000000000000e+03,2.782404000000000000e+06
1.527000000000000000e+03,2.589084000000000000e+06
1.528000000000000000e+03,0.000000000000000000e+00
1.529000000000000000e+03,2.704551000000000000e+06
1.530000000000000000e+03,2.711000000000000000e+06
1.531000000000000000e+03,0.000000000000000000e+00
1.532000000000000000e+03,0.000000000000000000e+00
1.533000000000000000e+03,0.000000000000000000e+00
1.534000000000000000e+03,0.000000000000000000e+00
1.535000000000000000e+03,0.000000000000000000e+00
1.536000000000000000e+03,0.000000000000000000e+00
1.537000000000000000e+03,2.906484000000000000e+06
1.538000000000000000e+03,2.052850000000000000e+06
1.539000000000000000e+03,1.926654000000000000e+06
1.540000000000000000e+03,2.514397000000000000e+06
1.541000000000000000e+03,5.056488000000000000e+06
1.542000000000000000e+03,0.000000000000000000e+00
1.543000000000000000e+03,1.506764500000000000e+07
1.544000000000000000e+03,0.000000000000000000e+00
1.545000000000000000e+03,4.874578000000000000e+06
1.546000000000000000e+03,1.870192000000000000e+06
1.547000000000000000e+03,2.189794000000000000e+06
1.548000000000000000e+03,2.049204000000000000e+06
1.549000000000000000e+03,1.500059000000000000e+06
1.550000000000000000e+03,0.000000000000000000e+00
1.551000000000000000e+03,1.825972000000000000e+06
1.552000000000000000e+03,2.770365000000000000e+06
1.553000000000000000e+03,1.952954000000000000e+06
1.554000000000000000e+03,1.006431000000000000e+06
1.555000000000000000e+03,7.207030000000000000e+05
1.556000000000000000e+03,4.170280000000000000e+06
1.557000000000000000e+03,2.304922000000000000e+06
1.558000000000000000e+03,0.000000000000000000e+00
1.559000000000000000e+03,0.000000000000000000e+00
1.560000000000000000e+03,3.012180000000000000e+05
1.561000000000000000e+03,0.000000000000000000e+00
1.562000000000000000e+03,0.000000000000000000e+00
1.563000000000000000e+03,0.000000000000000000e+00
1.564000000000000000e+03,0.000000000000000000e+00
1.565000000000000000e+03,0.000000000000000000e+00
1.566000000000000000e+03,0.000000000000000000e+00
1.567000000000000000e+03,1.431571800000000000e+07
1.568000000000000000e+03,0.000000000000000000e+00
1.569000000000000000e+03,2.440388000000000000e+06
1.570000000000000000e+03,2.070457000000000000e+06
1.571000000000000000e+03,3.271744000000000000e+06
1.572000000000000000e+03,2.292782000000000000e+06
1.573000000000000000e+03,1.992710000000000000e+06
1.574000000000000000e+03,0.000000000000000000e+00
1.575000000000000000e+03,0.000000000000000000e+00
1.576000000000000000e+03,2.709340000000000000e+06
1.577000000000000000e+03,1.522700000000000000e+06
1.578000000000000000e+03,1.930362000000000000e+06
1.579000000000000000e+03,4.557200000000000000e+05
1.580000000000000000e+03,0.000000000000000000e+00
1.581000000000000000e+03,1.217632000000000000e+06
1.582000000000000000e+03,8.930101000000000000e+06
1.583000000000000000e+03,0.000000000000000000e+00
1.584000000000000000e+03,2.346725000000000000e+06
1.585000000000000000e+03,1.189082200000000000e+07
1.586000000000000000e+03,0.000000000000000000e+00
1.587000000000000000e+03,0.000000000000000000e+00
1.588000000000000000e+03,2.413873000000000000e+06
1.589000000000000000e+03,2.598045000000000000e+06
1.590000000000000000e+03,2.467888000000000000e+06
1.591000000000000000e+03,0.000000000000000000e+00
1.592000000000000000e+03,2.284848000000000000e+06
1.593000000000000000e+03,1.219483000000000000e+06
1.594000000000000000e+03,0.000000000000000000e+00
1.595000000000000000e+03,2.445329000000000000e+06
1.596000000000000000e+03,2.417016000000000000e+06
1.597000000000000000e+03,0.000000000000000000e+00
1.598000000000000000e+03,0.000000000000000000e+00
1.599000000000000000e+03,0.000000000000000000e+00
1.600000000000000000e+03,0.000000000000000000e+00
1.601000000000000000e+03,0.000000000000000000e+00
1.602000000000000000e+03,0.000000000000000000e+00
1.603000000000000000e+03,1.696158000000000000e+06
1.604000000000000000e+03,1.694812000000000000e+06
1.605000000000000000e+03,6.699420000000000000e+05
1.606000000000000000e+03,3.099763000000000000e+06
1.607000000000000000e+03,0.000000000000000000e+00
1.608000000000000000e+03,2.068832000000000000e+06
1.609000000000000000e+03,5.078834000000000000e+06
1.610000000000000000e+03,1.687444000000000000e+06
1.611000000000000000e+03,0.000000000000000000e+00
1.612000000000000000e+03,0.000000000000000000e+00
1.613000000000000000e+03,1.453312000000000000e+06
1.614000000000000000e+03,1.717926000000000000e+06
1.615000000000000000e+03,0.000000000000000000e+00
1.616000000000000000e+03,2.810618000000000000e+06
1.617000000000000000e+03,2.494923000000000000e+06
1.618000000000000000e+03,2.762359000000000000e+06
1.619000000000000000e+03,3.296936000000000000e+06
1.620000000000000000e+03,3.561504000000000000e+06
1.621000000000000000e+03,0.000000000000000000e+00
1.622000000000000000e+03,7.724970000000000000e+05
1.623000000000000000e+03,8.056660000000000000e+05
1.624000000000000000e+03,1.364830000000000000e+06
1.625000000000000000e+03,2.173749000000000000e+06
1.626000000000000000e+03,1.863339000000000000e+06
1.627000000000000000e+03,1.208248000000000000e+06
1.628000000000000000e+03,0.000000000000000000e+00
1.629000000000000000e+03,1.266917000000000000e+06
1.630000000000000000e+03,2.385567000000000000e+06
1.631000000000000000e+03,2.077347000000000000e+06
1.632000000000000000e+03,0.000000000000000000e+00
1.633000000000000000e+03,2.644845000000000000e+06
1.634000000000000000e+03,2.696113000000000000e+06
1.635000000000000000e+03,1.631103000000000000e+06
1.636000000000000000e+03,1.872553000000000000e+06
1.637000000000000000e+03,0.000000000000000000e+00
1.638000000000000000e+03,0.000000000000000000e+00
1.639000000000000000e+03,1.393338000000000000e+06
1.640000000000000000e+03,2.003759000000000000e+06
1.641000000000000000e+03,1.913967000000000000e+06
1.642000000000000000e+03,0.000000000000000000e+00
1.643000000000000000e+03,1.187271000000000000e+06
1.644000000000000000e+03,3.723119000000000000e+06
1.645000000000000000e+03,0.000000000000000000e+00
1.646000000000000000e+03,4.459465000000000000e+06
1.647000000000000000e+03,3.154316000000000000e+06
1.648000000000000000e+03,0.000000000000000000e+00
1.649000000000000000e+03,2.768040000000000000e+06
1.650000000000000000e+03,4.424035000000000000e+06
1.651000000000000000e+03,3.572485000000000000e+06
1.652000000000000000e+03,1.917318000000000000e+06
1.653000000000000000e+03,0.000000000000000000e+00
1.654000000000000000e+03,0.000000000000000000e+00
1.655000000000000000e+03,1.421572000000000000e+06
1.656000000000000000e+03,1.680680000000000000e+06
1.657000000000000000e+03,2.983280000000000000e+06
1.658000000000000000e+03,1.683262000000000000e+06
1.659000000000000000e+03,2.669180000000000000e+06
1.660000000000000000e+03,1.914755000000000000e+06
1.661000000000000000e+03,0.000000000000000000e+00
1.662000000000000000e+03,1.619584000000000000e+06
1.663000000000000000e+03,3.972897000000000000e+06
1.664000000000000000e+03,2.120586000000000000e+06
1.665000000000000000e+03,1.769479000000000000e+06
1.666000000000000000e+03,0.000000000000000000e+00
1.667000000000000000e+03,4.195888000000000000e+06
1.668000000000000000e+03,0.000000000000000000e+00
1.669000000000000000e+03,0.000000000000000000e+00
1.670000000000000000e+03,1.092791000000000000e+06
1.671000000000000000e+03,3.267708000000000000e+06
1.672000000000000000e+03,3.216816000000000000e+06
1.673000000000000000e+03,0.000000000000000000e+00
1.674000000000000000e+03,9.407150000000000000e+05
1.675000000000000000e+03,1.832464000000000000e+06
1.676000000000000000e+03,1.502981000000000000e+06
1.677000000000000000e+03,4.965590000000000000e+06
1.678000000000000000e+03,0.000000000000000000e+00
1.679000000000000000e+03,5.521546000000000000e+06
1.680000000000000000e+03,1.204866000000000000e+06
1.681000000000000000e+03,1.636149000000000000e+06
1.682000000000000000e+03,1.759390000000000000e+06
1.683000000000000000e+03,1.658583000000000000e+06
1.684000000000000000e+03,1.454300000000000000e+06
1.685000000000000000e+03,1.408002000000000000e+06
1.686000000000000000e+03,0.000000000000000000e+00
1.687000000000000000e+03,0.000000000000000000e+00
1.688000000000000000e+03,1.005101000000000000e+06
1.689000000000000000e+03,3.437984000000000000e+06
1.690000000000000000e+03,4.133442000000000000e+06
1.691000000000000000e+03,2.001064000000000000e+06
1.692000000000000000e+03,1.417950000000000000e+06
1.693000000000000000e+03,1.458824000000000000e+06
1.694000000000000000e+03,0.000000000000000000e+00
1.695000000000000000e+03,9.932920000000000000e+05
1.696000000000000000e+03,5.942570000000000000e+06
1.697000000000000000e+03,8.543760000000000000e+05
1.698000000000000000e+03,1.386598000000000000e+06
1.699000000000000000e+03,0.000000000000000000e+00
1.700000000000000000e+03,9.104930000000000000e+05
1.701000000000000000e+03,7.714800000000000000e+05
1.702000000000000000e+03,2.417681000000000000e+06
1.703000000000000000e+03,1.546074000000000000e+06
1.704000000000000000e+03,1.585485000000000000e+06
1.705000000000000000e+03,1.810007000000000000e+06
1.706000000000000000e+03,0.000000000000000000e+00
1.707000000000000000e+03,0.000000000000000000e+00
1.708000000000000000e+03,1.214459000000000000e+06
1.709000000000000000e+03,1.162943000000000000e+06
1.710000000000000000e+03,1.705366000000000000e+06
1.711000000000000000e+03,1.591038000000000000e+06
1.712000000000000000e+03,0.000000000000000000e+00
1.713000000000000000e+03,2.654594000000000000e+06
1.714000000000000000e+03,1.256634000000000000e+06
1.715000000000000000e+03,2.207908000000000000e+06
1.716000000000000000e+03,2.694805000000000000e+06
1.717000000000000000e+03,1.446980000000000000e+06
1.718000000000000000e+03,0.000000000000000000e+00
1.719000000000000000e+03,2.432858000000000000e+06
1.720000000000000000e+03,2.115166000000000000e+06
1.721000000000000000e+03,2.688689000000000000e+06
1.722000000000000000e+03,1.555934000000000000e+06
1.723000000000000000e+03,0.000000000000000000e+00
1.724000000000000000e+03,1.645307000000000000e+06
1.725000000000000000e+03,1.919406000000000000e+06
1.726000000000000000e+03,2.924270000000000000e+06
1.727000000000000000e+03,0.000000000000000000e+00
1.728000000000000000e+03,1.774754000000000000e+06
1.729000000000000000e+03,1.523244000000000000e+06
1.730000000000000000e+03,1.650040000000000000e+06
1.731000000000000000e+03,2.556573000000000000e+06
1.732000000000000000e+03,2.156424000000000000e+06
1.733000000000000000e+03,0.000000000000000000e+00
1.734000000000000000e+03,0.000000000000000000e+00
1.735000000000000000e+03,4.566204000000000000e+06
1.736000000000000000e+03,1.368746000000000000e+06
1.737000000000000000e+03,2.812581000000000000e+06
1.738000000000000000e+03,3.596652000000000000e+06
1.739000000000000000e+03,0.000000000000000000e+00
1.740000000000000000e+03,1.411819000000000000e+06
1.741000000000000000e+03,2.878291000000000000e+06
1.742000000000000000e+03,3.884632000000000000e+06
1.743000000000000000e+03,1.996995000000000000e+06
1.744000000000000000e+03,2.269220000000000000e+06
1.745000000000000000e+03,1.991554000000000000e+06
1.746000000000000000e+03,0.000000000000000000e+00
1.747000000000000000e+03,9.899380000000000000e+05
1.748000000000000000e+03,1.196388000000000000e+06
1.749000000000000000e+03,7.859920000000000000e+05
1.750000000000000000e+03,2.302837000000000000e+06
1.751000000000000000e+03,2.726336000000000000e+06
1.752000000000000000e+03,1.918294000000000000e+06
1.753000000000000000e+03,0.000000000000000000e+00
1.754000000000000000e+03,1.272240000000000000e+06
1.755000000000000000e+03,1.721260000000000000e+06
1.756000000000000000e+03,2.585010000000000000e+06
1.757000000000000000e+03,1.395641000000000000e+06
1.758000000000000000e+03,1.785920000000000000e+06
1.759000000000000000e+03,0.000000000000000000e+00
1.760000000000000000e+03,0.000000000000000000e+00
1.761000000000000000e+03,2.246266000000000000e+06
1.762000000000000000e+03,3.551582000000000000e+06
1.763000000000000000e+03,3.477765000000000000e+06
1.764000000000000000e+03,1.174401000000000000e+06
1.765000000000000000e+03,2.629161000000000000e+06
1.766000000000000000e+03,0.000000000000000000e+00
1.767000000000000000e+03,1.835876000000000000e+06
1.768000000000000000e+03,2.333889000000000000e+06
1.769000000000000000e+03,2.998099000000000000e+06
1.770000000000000000e+03,0.000000000000000000e+00
1.771000000000000000e+03,2.931703000000000000e+06
1.772000000000000000e+03,0.000000000000000000e+00
1.773000000000000000e+03,1.317688000000000000e+06
1.774000000000000000e+03,5.608000000000000000e+05
1.775000000000000000e+03,4.359142000000000000e+06
1.776000000000000000e+03,0.000000000000000000e+00
1.777000000000000000e+03,0.000000000000000000e+00
1.778000000000000000e+03,4.461070000000000000e+05
1.779000000000000000e+03,8.284910000000000000e+05
1.780000000000000000e+03,1.485343000000000000e+06
1.781000000000000000e+03,2.403616000000000000e+06
1.782000000000000000e+03,1.792672000000000000e+06
1.783000000000000000e+03,2.072636000000000000e+06
1.784000000000000000e+03,1.731245000000000000e+06
1.785000000000000000e+03,1.409252000000000000e+06
1.786000000000000000e+03,0.000000000000000000e+00
1.787000000000000000e+03,1.514029000000000000e+06
1.788000000000000000e+03,2.682416000000000000e+06
1.789000000000000000e+03,1.949879000000000000e+06
1.790000000000000000e+03,9.056690000000000000e+05
1.791000000000000000e+03,0.000000000000000000e+00
1.792000000000000000e+03,0.000000000000000000e+00
1.793000000000000000e+03,1.902668000000000000e+06
1.794000000000000000e+03,2.603344000000000000e+06
1.795000000000000000e+03,1.127634000000000000e+06
1.796000000000000000e+03,8.145900000000000000e+05
1.797000000000000000e+03,3.211130000000000000e+06
1.798000000000000000e+03,9.659390000000000000e+05
1.799000000000000000e+03,1.740546000000000000e+06
1.800000000000000000e+03,1.083922000000000000e+06
1.801000000000000000e+03,0.000000000000000000e+00
1.802000000000000000e+03,1.385270000000000000e+06
1.803000000000000000e+03,1.079327000000000000e+06
1.804000000000000000e+03,1.586096000000000000e+06
1.805000000000000000e+03,3.912613000000000000e+06
1.806000000000000000e+03,2.169895000000000000e+06
1.807000000000000000e+03,2.023273000000000000e+06
1.808000000000000000e+03,7.541720000000000000e+05
1.809000000000000000e+03,2.016330000000000000e+06
1.810000000000000000e+03,0.000000000000000000e+00
1.811000000000000000e+03,3.446817000000000000e+06
1.812000000000000000e+03,0.000000000000000000e+00
1.813000000000000000e+03,7.080460000000000000e+05
1.814000000000000000e+03,1.449752000000000000e+06
1.815000000000000000e+03,7.714930000000000000e+05
1.816000000000000000e+03,1.797980000000000000e+05
1.817000000000000000e+03,1.441910000000000000e+05
1.818000000000000000e+03,1.684980000000000000e+05
1.819000000000000000e+03,0.000000000000000000e+00
1.820000000000000000e+03,0.000000000000000000e+00
1.821000000000000000e+03,1.518465000000000000e+06
1.822000000000000000e+03,2.010642000000000000e+06
1.823000000000000000e+03,2.255930000000000000e+06
1.824000000000000000e+03,1.525027000000000000e+06
1.825000000000000000e+03,2.073265000000000000e+06
1.826000000000000000e+03,0.000000000000000000e+00
1.827000000000000000e+03,0.000000000000000000e+00
1.828000000000000000e+03,0.000000000000000000e+00
1.829000000000000000e+03,0.000000000000000000e+00
1.830000000000000000e+03,0.000000000000000000e+00
1.831000000000000000e+03,0.000000000000000000e+00
1.832000000000000000e+03,2.851592000000000000e+06
1.833000000000000000e+03,2.306682000000000000e+06
1.834000000000000000e+03,0.000000000000000000e+00
1.835000000000000000e+03,0.000000000000000000e+00
1.836000000000000000e+03,0.000000000000000000e+00
1.837000000000000000e+03,0.000000000000000000e+00
1.838000000000000000e+03,0.000000000000000000e+00
1.839000000000000000e+03,0.000000000000000000e+00
1.840000000000000000e+03,0.000000000000000000e+00
1.841000000000000000e+03,0.000000000000000000e+00
1.842000000000000000e+03,0.000000000000000000e+00
1.843000000000000000e+03,0.000000000000000000e+00
1.844000000000000000e+03,0.000000000000000000e+00
1.845000000000000000e+03,0.000000000000000000e+00
1.846000000000000000e+03,0.000000000000000000e+00
1.847000000000000000e+03,3.151228000000000000e+06
1.848000000000000000e+03,3.197268000000000000e+06
1.849000000000000000e+03,0.000000000000000000e+00
1.850000000000000000e+03,1.502000000000000000e+06
1.851000000000000000e+03,1.529771000000000000e+06
1.852000000000000000e+03,0.000000000000000000e+00
1.853000000000000000e+03,1.845028000000000000e+06
1.854000000000000000e+03,1.863700000000000000e+06
1.855000000000000000e+03,1.527473000000000000e+06
1.856000000000000000e+03,1.242379000000000000e+06
1.857000000000000000e+03,0.000000000000000000e+00
1.858000000000000000e+03,7.472280000000000000e+05
1.859000000000000000e+03,1.054036000000000000e+06
1.860000000000000000e+03,2.694353000000000000e+06
1.861000000000000000e+03,0.000000000000000000e+00
1.862000000000000000e+03,3.084632000000000000e+06
1.863000000000000000e+03,7.644750000000000000e+05
1.864000000000000000e+03,1.741162000000000000e+06
1.865000000000000000e+03,0.000000000000000000e+00
1.866000000000000000e+03,1.897674000000000000e+06
1.867000000000000000e+03,9.408860000000000000e+05
1.868000000000000000e+03,0.000000000000000000e+00
1.869000000000000000e+03,1.772988000000000000e+06
1.870000000000000000e+03,1.158046000000000000e+06
1.871000000000000000e+03,6.236860000000000000e+05
1.872000000000000000e+03,0.000000000000000000e+00
1.873000000000000000e+03,0.000000000000000000e+00
1.874000000000000000e+03,0.000000000000000000e+00
1.875000000000000000e+03,0.000000000000000000e+00
1.876000000000000000e+03,0.000000000000000000e+00
1.877000000000000000e+03,0.000000000000000000e+00
1.878000000000000000e+03,4.405901000000000000e+06
1.879000000000000000e+03,2.921541000000000000e+06
1.880000000000000000e+03,2.493694000000000000e+06
1.881000000000000000e+03,0.000000000000000000e+00
1.882000000000000000e+03,6.626025000000000000e+06
1.883000000000000000e+03,1.581189000000000000e+06
1.884000000000000000e+03,1.701105000000000000e+06
1.885000000000000000e+03,1.191891000000000000e+06
1.886000000000000000e+03,4.477660000000000000e+05
1.887000000000000000e+03,0.000000000000000000e+00
1.888000000000000000e+03,1.297636000000000000e+06
1.889000000000000000e+03,1.716482000000000000e+06
1.890000000000000000e+03,3.615451000000000000e+06
1.891000000000000000e+03,0.000000000000000000e+00
1.892000000000000000e+03,8.529964000000000000e+06
1.893000000000000000e+03,0.000000000000000000e+00
1.894000000000000000e+03,3.126850000000000000e+05
1.895000000000000000e+03,4.445320000000000000e+05
1.896000000000000000e+03,3.433110000000000000e+05
1.897000000000000000e+03,9.436100000000000000e+04
1.898000000000000000e+03,2.942850000000000000e+06
1.899000000000000000e+03,1.875038000000000000e+06
1.900000000000000000e+03,1.333682000000000000e+06
1.901000000000000000e+03,0.000000000000000000e+00
1.902000000000000000e+03,2.242156000000000000e+06
1.903000000000000000e+03,2.362010000000000000e+05
1.904000000000000000e+03,8.732130000000000000e+05
1.905000000000000000e+03,2.590670000000000000e+05
1.906000000000000000e+03,2.803850000000000000e+05
1.907000000000000000e+03,6.648890000000000000e+05
1.908000000000000000e+03,0.000000000000000000e+00
1.909000000000000000e+03,2.528388000000000000e+06
